{"text_format":"1","workbook":"xlsx","n_sheets":6,"sheets":["4.12-4.12.3","4.12.4-4.12.7","4.12.8","Test Period - May 2013","Labor","Factors"],"not_rendered":{"charts":0,"images":0,"macros":0,"external_links":48,"defined_names":1269,"comments":0,"pivot_tables":0},"unopened":[],"bounds":{"document_bytes":16777216,"sheet_cells":100000,"rows_first":2000,"rows_last":500,"rows_between":2000,"halvings":0,"cell_chars":16384,"cell_head_chars":4096},"cells_cut":0,"cells_raw":0,"read":"whole","date_system":"1900"}

{"sheet":"4.12-4.12.3","index":0,"n_rows":161,"n_cols":24,"rows_kept":161,"cut":false,"hidden":false,"merged":[]}
[null,null,"Rocky Mountain Power",null,null,null,null,null,null," "," "]
[null,null,"Utah General Rate Case - May 2013"]
[null,null,"O&M Escalation "]
[]
[]
[null,null,null,null,null,null,"TOTAL",null,null,"Utah",null,null,null,null,null,null," "]
["Code",null,null,null,"ACCOUNT","Type","COMPANY","FACTOR","FACTOR %","ALLOCATED","REF#","MA","RI","RP","Total","System","CA","OR","WA","WY-ALL","WYP","UT","ID","WYU"]
[null,null,"Adjustment to Expense:"]
[{"$f":"+E9&H9","v":"500SG"},{"$f":"E9&L9","v":"500SNPPS"},"Steam Operations",null,"500",3,{"$f":"SUM(P9:S9,U9:X9)","v":166271.54341945512},{"$f":"N9","v":"SG"},{"$f":"VLOOKUP(M9,Factors!$B$4:$H$92,7,FALSE)","v":0.43154681048764915},{"$f":"I9*G9","v":71753.954237524522},null,"SNPPS","SNPPS","SG",{"$f":"+P9+Q9+R9+S9+U9+V9+W9+X9","v":166271.54341945512},{"$f":"VLOOKUP(A9,'Test Period - May 2013'!$F$10:$T$406,15,FALSE)","v":166271.54341945512}]
[{"$f":"+E10&H10","v":"500SSGCH"},"500SNPPS","Steam Operations",null,"500",3,{"$f":"SUM(P10:S10,U10:X10)","v":160390.03128107789},{"$f":"N10","v":"SSGCH"},{"$f":"VLOOKUP(M10,Factors!$B$4:$H$92,7,FALSE)","v":0.43154681048764915},{"$f":"I10*G10","v":69215.806433363439},null,"SNPPS","SNPPS","SSGCH",{"$f":"+P10+Q10+R10+S10+U10+V10+W10+X10","v":160390.03128107789},{"$f":"VLOOKUP(A10,'Test Period - May 2013'!$F$10:$T$406,15,FALSE)","v":160390.03128107789}]
["501SE","501SE","Steam Operations",null,"501",3,1304871.2455007688,"SE",{"$f":"VLOOKUP(M11,Factors!$B$4:$H$92,7,FALSE)","v":0.429533673391716},560486.13938316889,null,"SE","SE","SE",1304871.2455007688,{"$f":"VLOOKUP(A11,'Test Period - May 2013'!$F$10:$T$406,15,FALSE)","v":1304871.2455007688}]
["501SSECH","501SE","Steam Operations",null,"501",3,233283.8260555107,"SSECH",{"$f":"VLOOKUP(M12,Factors!$B$4:$H$92,7,FALSE)","v":0.429533673391716},100203.25874849762,null,"SE","SE","SSECH",233283.8260555107,{"$f":"VLOOKUP(A12,'Test Period - May 2013'!$F$10:$T$406,15,FALSE)","v":233283.8260555107}]
["502SG","502SNPPS","Steam Operations",null,"502",3,1070190.7326366771,"SG",{"$f":"VLOOKUP(M13,Factors!$B$4:$H$92,7,FALSE)","v":0.43154681048764915},461837.39728279848,null,"SNPPS","SNPPS","SG",1070190.7326366771,{"$f":"VLOOKUP(A13,'Test Period - May 2013'!$F$10:$T$406,15,FALSE)","v":1070190.7326366771}]
["502SSGCH","502SNPPS","Steam Operations",null,"502",3,553008.02314438194,"SSGCH",{"$f":"VLOOKUP(M14,Factors!$B$4:$H$92,7,FALSE)","v":0.43154681048764915},238648.8485620381,null,"SNPPS","SNPPS","SSGCH",553008.02314438194,{"$f":"VLOOKUP(A14,'Test Period - May 2013'!$F$10:$T$406,15,FALSE)","v":553008.02314438194}]
["503SE","503SE","Steam Operations",null,"503",3,-5100.6900430560936,"SE",{"$f":"VLOOKUP(M15,Factors!$B$4:$H$92,7,FALSE)","v":0.429533673391716},-2190.9181310264339,null,"SE","SE","SE",-5100.6900430560936,{"$f":"VLOOKUP(A15,'Test Period - May 2013'!$F$10:$T$406,15,FALSE)","v":-5100.6900430560936}]
{"$rows_left_out":147}
{"sheet":"4.12.4-4.12.7","index":1,"n_rows":133,"n_cols":22,"rows_kept":133,"cut":false,"hidden":false,"merged":[]}
[null,null,null,"Rocky Mountain Power",null,null,null,null,null,null,null,null,null," ",null,null,null," ",null," "]
[null,null,null,"Utah General Rate Case - May 2013",null,null," "," "," "," ",null,null,null," ",null,null,null," ",null," "]
[null,null,null,"O&M Expense Escalation ",null," "," "," "," "," ",null,null,null," "]
[null,null,null,"12 months ending May 2013"]
[null,null,null," ",null," ",{"$f":"+'Test Period - May 2013'!H5","v":3.2},{"$f":"+'Test Period - May 2013'!I5","v":4.0999999999999996},{"$f":"+'Test Period - May 2013'!J5","v":4.2},{"$f":"+'Test Period - May 2013'!K5","v":4.3},{"$f":"+'Test Period - May 2013'!L5","v":4.4000000000000004},{"$f":"+'Test Period - May 2013'!M5","v":4.5999999999999996},{"$f":"+'Test Period - May 2013'!N5","v":4.7},{"$f":"+'Test Period - May 2013'!O5","v":4.8},{"$f":"+'Test Period - May 2013'!P5","v":"4.10"},{"$f":"+'Test Period - May 2013'!Q5","v":5.0999999999999996},{"$f":"+'Test Period - May 2013'!R5","v":8.9},{"$f":"+'Test Period - May 2013'!S5","v":8.1199999999999992},null,null,"4.12"]
[null,null,null,null,null,{"$f":"+'Test Period - May 2013'!G6","v":"Jun 2011"},{"$f":"+'Test Period - May 2013'!H6","v":" "},{"$f":"+'Test Period - May 2013'!I6","v":"Miscellaneous"},{"$f":"+'Test Period - May 2013'!J6","v":"Remove"},{"$f":"+'Test Period - May 2013'!K6","v":"Idaho Irrigation"},{"$f":"+'Test Period - May 2013'!L6","v":"Remove"},{"$f":"+'Test Period - May 2013'!M6","v":0},{"$f":"+'Test Period - May 2013'!N6","v":0},{"$f":"+'Test Period - May 2013'!O6","v":"Generation"},{"$f":"+'Test Period - May 2013'!P6","v":"Solar"},{"$f":"+'Test Period - May 2013'!Q6","v":"Net "},{"$f":"+'Test Period - May 2013'!R6","v":"Regulatory "},{"$f":"+'Test Period - May 2013'!S6","v":"Misc. Asset"},"O&M",{"$f":"+'Test Period - May 2013'!U6","v":" "},null,"O&M"]
[null,null,null,null,"Allocation",{"$f":"+'Test Period - May 2013'!G7","v":"Unadjusted"},{"$f":"+'Test Period - May 2013'!H7","v":"Wheeling "},{"$f":"+'Test Period - May 2013'!I7","v":"General"},{"$f":"+'Test Period - May 2013'!J7","v":"Unadjusted"},{"$f":"+'Test Period - May 2013'!K7","v":"Load Control"},{"$f":"+'Test Period - May 2013'!L7","v":"Non-Recurring"},{"$f":"+'Test Period - May 2013'!M7","v":"DSM Revenue"},{"$f":"+'Test Period - May 2013'!N7","v":"Insurance"},{"$f":"+'Test Period - May 2013'!O7","v":"Overhaul"},{"$f":"+'Test Period - May 2013'!P7","v":"Photovoltaic"},{"$f":"+'Test Period - May 2013'!Q7","v":"Power Cost"},{"$f":"+'Test Period - May 2013'!R7","v":"Asset"},{"$f":"+'Test Period - May 2013'!S7","v":"Sales and"},"Before",{"$f":"+'Test Period - May 2013'!U7","v":"Escalation"},{"$f":"+'Test Period - May 2013'!T7","v":"O&M"},"After "]
[null,null,null,{"$f":"+'Test Period - May 2013'!C8","v":"Function"},"Code",{"$f":"+'Test Period - May 2013'!G8","v":"O&M"},{"$f":"+'Test Period - May 2013'!H8","v":"Revenue"},{"$f":"+'Test Period - May 2013'!I8","v":"Expense"},{"$f":"+'Test Period - May 2013'!J8","v":"Labor"},{"$f":"+'Test Period - May 2013'!K8","v":"Program"},{"$f":"+'Test Period - May 2013'!L8","v":"Entries"},{"$f":"+'Test Period - May 2013'!M8","v":"and Expense "},{"$f":"+'Test Period - May 2013'!N8","v":"Expense"},{"$f":"+'Test Period - May 2013'!O8","v":"Expense"},{"$f":"+'Test Period - May 2013'!P8","v":"Program"},{"$f":"+'Test Period - May 2013'!Q8","v":"Study"},{"$f":"+'Test Period - May 2013'!R8","v":"Amortization"},{"$f":"+'Test Period - May 2013'!S8","v":"Removals"},"Escalation",{"$f":"+'Test Period - May 2013'!U8","v":"Percentages"},{"$f":"+'Test Period - May 2013'!T8","v":"Escalation"},"Escalation"]
[null,null,null,"Steam Operation"]
[null,null,{"$f":"+$D$9&E10","v":"Steam OperationNPCSE"}," ","NPCSE",{"$f":"SUMIF('Test Period - May 2013'!$E$10:$E$406,$C10,'Test Period - May 2013'!$G$10:$G$406)","v":617817175.73999906},{"$f":"SUMIF('Test Period - May 2013'!$E$10:$E$406,$C10,'Test Period - May 2013'!$H$10:$H$406)","v":0},{"$f":"SUMIF('Test Period - May 2013'!$E$10:$E$406,$C10,'Test Period - May 2013'!$I$10:$I$406)","v":0},{"$f":"SUMIF('Test Period - May 2013'!$E$10:$E$406,$C10,'Test Period - May 2013'!$J$10:$J$406)","v":0},{"$f":"SUMIF('Test Period - May 2013'!$E$10:$E$406,$C10,'Test Period - May 2013'!$K$10:$K$406)","v":0},{"$f":"SUMIF('Test Period - May 2013'!$E$10:$E$406,$C10,'Test Period - May 2013'!$L$10:$L$406)","v":0},{"$f":"SUMIF('Test Period - May 2013'!$E$10:$E$406,$C10,'Test Period - May 2013'!$M$10:$M$406)","v":0},{"$f":"SUMIF('Test Period - May 2013'!$E$10:$E$406,$C10,'Test Period - May 2013'!$N$10:$N$406)","v":0},{"$f":"SUMIF('Test Period - May 2013'!$E$10:$E$406,$C10,'Test Period - May 2013'!$O$10:$O$406)","v":0},{"$f":"SUMIF('Test Period - May 2013'!$E$10:$E$406,$C10,'Test Period - May 2013'!$P$10:$P$406)","v":0},{"$f":"SUMIF('Test Period - May 2013'!$E$10:$E$406,$C10,'Test Period - May 2013'!$Q$10:$Q$406)","v":0},{"$f":"SUMIF('Test Period - May 2013'!$E$10:$E$406,$C10,'Test Period - May 2013'!$R$10:$R$406)","v":0},{"$f":"SUMIF('Test Period - May 2013'!$E$10:$E$406,$C10,'Test Period - May 2013'!$S$10:$S$406)","v":0},{"$f":"SUM(F10:R10)","v":617817175.73999906},0,{"$f":"S10*T10","v":0},{"$f":"S10+U10","v":617817175.73999906}]
[null,null,"Steam OperationNPCSSECH",null,"NPCSSECH",{"$f":"SUMIF('Test Period - May 2013'!$E$10:$E$406,$C11,'Test Period - May 2013'!$G$10:$G$406)","v":49297564.449999899},{"$f":"SUMIF('Test Period - May 2013'!$E$10:$E$406,$C11,'Test Period - May 2013'!$H$10:$H$406)","v":0},{"$f":"SUMIF('Test Period - May 2013'!$E$10:$E$406,$C11,'Test Period - May 2013'!$I$10:$I$406)","v":0},{"$f":"SUMIF('Test Period - May 2013'!$E$10:$E$406,$C11,'Test Period - May 2013'!$J$10:$J$406)","v":0},{"$f":"SUMIF('Test Period - May 2013'!$E$10:$E$406,$C11,'Test Period - May 2013'!$K$10:$K$406)","v":0},{"$f":"SUMIF('Test Period - May 2013'!$E$10:$E$406,$C11,'Test Period - May 2013'!$L$10:$L$406)","v":0},{"$f":"SUMIF('Test Period - May 2013'!$E$10:$E$406,$C11,'Test Period - May 2013'!$M$10:$M$406)","v":0},{"$f":"SUMIF('Test Period - May 2013'!$E$10:$E$406,$C11,'Test Period - May 2013'!$N$10:$N$406)","v":0},{"$f":"SUMIF('Test Period - May 2013'!$E$10:$E$406,$C11,'Test Period - May 2013'!$O$10:$O$406)","v":0},{"$f":"SUMIF('Test Period - May 2013'!$E$10:$E$406,$C11,'Test Period - May 2013'!$P$10:$P$406)","v":0},{"$f":"SUMIF('Test Period - May 2013'!$E$10:$E$406,$C11,'Test Period - May 2013'!$Q$10:$Q$406)","v":0},{"$f":"SUMIF('Test Period - May 2013'!$E$10:$E$406,$C11,'Test Period - May 2013'!$R$10:$R$406)","v":0},{"$f":"SUMIF('Test Period - May 2013'!$E$10:$E$406,$C11,'Test Period - May 2013'!$S$10:$S$406)","v":0},49297564.449999899,0,{"$f":"S11*T11","v":0},{"$f":"S11+U11","v":49297564.449999899}]
[null,null,{"$f":"+$D$9&E12","v":"Steam OperationNPCID"},null,"NPCID",{"$f":"SUMIF('Test Period - May 2013'!$E$10:$E$406,$C12,'Test Period - May 2013'!$G$10:$G$406)","v":-103365.08},{"$f":"SUMIF('Test Period - May 2013'!$E$10:$E$406,$C12,'Test Period - May 2013'!$H$10:$H$406)","v":0},{"$f":"SUMIF('Test Period - May 2013'!$E$10:$E$406,$C12,'Test Period - May 2013'!$I$10:$I$406)","v":0},{"$f":"SUMIF('Test Period - May 2013'!$E$10:$E$406,$C12,'Test Period - May 2013'!$J$10:$J$406)","v":0},{"$f":"SUMIF('Test Period - May 2013'!$E$10:$E$406,$C12,'Test Period - May 2013'!$K$10:$K$406)","v":0},{"$f":"SUMIF('Test Period - May 2013'!$E$10:$E$406,$C12,'Test Period - May 2013'!$L$10:$L$406)","v":0},{"$f":"SUMIF('Test Period - May 2013'!$E$10:$E$406,$C12,'Test Period - May 2013'!$M$10:$M$406)","v":0},{"$f":"SUMIF('Test Period - May 2013'!$E$10:$E$406,$C12,'Test Period - May 2013'!$N$10:$N$406)","v":0},{"$f":"SUMIF('Test Period - May 2013'!$E$10:$E$406,$C12,'Test Period - May 2013'!$O$10:$O$406)","v":0},{"$f":"SUMIF('Test Period - May 2013'!$E$10:$E$406,$C12,'Test Period - May 2013'!$P$10:$P$406)","v":0},{"$f":"SUMIF('Test Period - May 2013'!$E$10:$E$406,$C12,'Test Period - May 2013'!$Q$10:$Q$406)","v":0},{"$f":"SUMIF('Test Period - May 2013'!$E$10:$E$406,$C12,'Test Period - May 2013'!$R$10:$R$406)","v":0},{"$f":"SUMIF('Test Period - May 2013'!$E$10:$E$406,$C12,'Test Period - May 2013'!$S$10:$S$406)","v":0},-103365.08,0,0,-103365.08]
[null,null,"Steam OperationNPCWYP",null,"NPCWYP",{"$f":"SUMIF('Test Period - May 2013'!$E$10:$E$406,$C13,'Test Period - May 2013'!$G$10:$G$406)","v":-305916.84000000003},{"$f":"SUMIF('Test Period - May 2013'!$E$10:$E$406,$C13,'Test Period - May 2013'!$H$10:$H$406)","v":0},{"$f":"SUMIF('Test Period - May 2013'!$E$10:$E$406,$C13,'Test Period - May 2013'!$I$10:$I$406)","v":0},{"$f":"SUMIF('Test Period - May 2013'!$E$10:$E$406,$C13,'Test Period - May 2013'!$J$10:$J$406)","v":0},{"$f":"SUMIF('Test Period - May 2013'!$E$10:$E$406,$C13,'Test Period - May 2013'!$K$10:$K$406)","v":0},{"$f":"SUMIF('Test Period - May 2013'!$E$10:$E$406,$C13,'Test Period - May 2013'!$L$10:$L$406)","v":0},{"$f":"SUMIF('Test Period - May 2013'!$E$10:$E$406,$C13,'Test Period - May 2013'!$M$10:$M$406)","v":0},{"$f":"SUMIF('Test Period - May 2013'!$E$10:$E$406,$C13,'Test Period - May 2013'!$N$10:$N$406)","v":0},{"$f":"SUMIF('Test Period - May 2013'!$E$10:$E$406,$C13,'Test Period - May 2013'!$O$10:$O$406)","v":0},{"$f":"SUMIF('Test Period - May 2013'!$E$10:$E$406,$C13,'Test Period - May 2013'!$P$10:$P$406)","v":0},{"$f":"SUMIF('Test Period - May 2013'!$E$10:$E$406,$C13,'Test Period - May 2013'!$Q$10:$Q$406)","v":0},{"$f":"SUMIF('Test Period - May 2013'!$E$10:$E$406,$C13,'Test Period - May 2013'!$R$10:$R$406)","v":0},{"$f":"SUMIF('Test Period - May 2013'!$E$10:$E$406,$C13,'Test Period - May 2013'!$S$10:$S$406)","v":0},-305916.84000000003,0,0,-305916.84000000003]
[null,null,"Steam OperationSE",null,"SE",{"$f":"SUMIF('Test Period - May 2013'!$E$10:$E$406,$C14,'Test Period - May 2013'!$G$10:$G$406)","v":18028764.550000001},{"$f":"SUMIF('Test Period - May 2013'!$E$10:$E$406,$C14,'Test Period - May 2013'!$H$10:$H$406)","v":0},{"$f":"SUMIF('Test Period - May 2013'!$E$10:$E$406,$C14,'Test Period - May 2013'!$I$10:$I$406)","v":0},{"$f":"SUMIF('Test Period - May 2013'!$E$10:$E$406,$C14,'Test Period - May 2013'!$J$10:$J$406)","v":-57811.907602827647},{"$f":"SUMIF('Test Period - May 2013'!$E$10:$E$406,$C14,'Test Period - May 2013'!$K$10:$K$406)","v":0},{"$f":"SUMIF('Test Period - May 2013'!$E$10:$E$406,$C14,'Test Period - May 2013'!$L$10:$L$406)","v":0},{"$f":"SUMIF('Test Period - May 2013'!$E$10:$E$406,$C14,'Test Period - May 2013'!$M$10:$M$406)","v":0},{"$f":"SUMIF('Test Period - May 2013'!$E$10:$E$406,$C14,'Test Period - May 2013'!$N$10:$N$406)","v":0},{"$f":"SUMIF('Test Period - May 2013'!$E$10:$E$406,$C14,'Test Period - May 2013'!$O$10:$O$406)","v":0},{"$f":"SUMIF('Test Period - May 2013'!$E$10:$E$406,$C14,'Test Period - May 2013'!$P$10:$P$406)","v":0},{"$f":"SUMIF('Test Period - May 2013'!$E$10:$E$406,$C14,'Test Period - May 2013'!$Q$10:$Q$406)","v":0},{"$f":"SUMIF('Test Period - May 2013'!$E$10:$E$406,$C14,'Test Period - May 2013'!$R$10:$R$406)","v":0},{"$f":"SUMIF('Test Period - May 2013'!$E$10:$E$406,$C14,'Test Period - May 2013'!$S$10:$S$406)","v":0},17970952.642397173,7.2326191121960148E-2,1299770.5554577126,19270723.197854884]
[null,null,"Steam OperationSG",null,"SG",{"$f":"SUMIF('Test Period - May 2013'!$E$10:$E$406,$C15,'Test Period - May 2013'!$G$10:$G$406)","v":101269706.82999989},{"$f":"SUMIF('Test Period - May 2013'!$E$10:$E$406,$C15,'Test Period - May 2013'!$H$10:$H$406)","v":0},{"$f":"SUMIF('Test Period - May 2013'!$E$10:$E$406,$C15,'Test Period - May 2013'!$I$10:$I$406)","v":0},{"$f":"SUMIF('Test Period - May 2013'!$E$10:$E$406,$C15,'Test Period - May 2013'!$J$10:$J$406)","v":-78166530.66407463},{"$f":"SUMIF('Test Period - May 2013'!$E$10:$E$406,$C15,'Test Period - May 2013'!$K$10:$K$406)","v":0},{"$f":"SUMIF('Test Period - May 2013'!$E$10:$E$406,$C15,'Test Period - May 2013'!$L$10:$L$406)","v":48112.150000000023},{"$f":"SUMIF('Test Period - May 2013'!$E$10:$E$406,$C15,'Test Period - May 2013'!$M$10:$M$406)","v":0},{"$f":"SUMIF('Test Period - May 2013'!$E$10:$E$406,$C15,'Test Period - May 2013'!$N$10:$N$406)","v":0},{"$f":"SUMIF('Test Period - May 2013'!$E$10:$E$406,$C15,'Test Period - May 2013'!$O$10:$O$406)","v":0},{"$f":"SUMIF('Test Period - May 2013'!$E$10:$E$406,$C15,'Test Period - May 2013'!$P$10:$P$406)","v":0},{"$f":"SUMIF('Test Period - May 2013'!$E$10:$E$406,$C15,'Test Period - May 2013'!$Q$10:$Q$406)","v":0},{"$f":"SUMIF('Test Period - May 2013'!$E$10:$E$406,$C15,'Test Period - May 2013'!$R$10:$R$406)","v":0},{"$f":"SUMIF('Test Period - May 2013'!$E$10:$E$406,$C15,'Test Period - May 2013'!$S$10:$S$406)","v":0},23151288.315925263,7.2326191121960148E-2,1674444.5034572135,24825732.819382478]
{"$rows_left_out":119}
{"sheet":"4.12.8","index":2,"n_rows":49,"n_cols":5,"rows_kept":49,"cut":false,"hidden":false,"merged":[]}
["Rocky Mountain Power",null," ","Page 4.12.8"]
["Utah General Rate Case - May 2013"]
["Escalation Factors"]
[" "]
[" "]
[]
[null,null,"Escalation Factors"]
[null,null,"June 2011\n to May 2013","FERC Accounts"]
["STEAM PRODUCTION PLANT",null," "]
[" Operation:",null,7.2326191121960148E-2,"500 - 507"," "]
[" Maintenance: ",null,3.7244229412357617E-2,"510 - 514"]
[" "]
["HYDRO PRODUCTION PLANT",null," "]
[" Operation:",null,7.26411555055336E-2,"535 - 540"]
[" Maintenance: ",null,4.0386624869383568E-2,"541 - 545"]
{"$rows_left_out":35}
{"sheet":"Test Period - May 2013","index":3,"n_rows":433,"n_cols":22,"rows_kept":433,"cut":false,"hidden":false,"merged":[]}
[null,null,null,null,null,"Rocky Mountain Power",null," "," "," "," "," ",null,null,null,null,null," "," "," "]
[null,null,null,null,null,"Utah General Rate Case - May 2013"]
[null,null,null,null,null,"O&M Expense Escalation",null," "," "," "]
[null,null,null,null,null,"12 months ending May 2013",null,null,null," ",null,null,null,null,null,null,null,null," "," "]
[null,null,null,null,null,null," ",3.2,4.0999999999999996,4.2,4.3,4.4000000000000004,4.5999999999999996,4.7,4.8,"4.10",5.0999999999999996,8.9,8.1199999999999992,4.12,null,"May 2013"]
[null,null,null,null,null,null,"Jun 2011"," ","Miscellaneous","Remove","Idaho Irrigation","Remove",null,null,"Generation","Solar","Net ","Regulatory ","Misc. Asset"," "," ","Escalated "]
[null,null,null,null,null,null,"Unadjusted","Wheeling ","General","Unadjusted","Load Control","Non-Recurring","DSM Revenue","Insurance","Overhaul","Photovoltaic","Power Cost","Asset","Sales and","O&M","Escalation","Non-Labor "]
["FERC","JAM Indicator","Function",null,null,"Revised Protocol Accounts","O&M","Revenue","Expense","Labor","Program","Entries","and Expense ","Expense","Expense","Program","Study","Amortization","Removals","Escalation","Percentages","O&M"]
[null,"Steam Power Generation",null,null,null,"Steam Power Generation"]
[null,"500SNPPS","Steam Operation",{"$f":"MID(F10,4,12)","v":"SG"},{"$f":"+C10&D10","v":"Steam OperationSG"},"500SG",17434919.41,null,null,{"$f":"-IF(ISERROR(VLOOKUP(F10,Labor!$A$7:$B$222,2,0)),0,VLOOKUP(F10,Labor!$A$7:$B$222,2,0))","v":-15136007.482796762},null,null,null,null,null,null,null,null,null,{"$f":"SUM(G10:S10)*U10","v":166271.54341945512},7.2326191121960148E-2,{"$f":"SUM(G10:T10)","v":2465183.4706226932}]
[null,"500SSGCH","Steam Operation",{"$f":"MID(F11,4,12)","v":"SSGCH"},{"$f":"+C11&D11","v":"Steam OperationSSGCH"},"500SSGCH",2217592.67,null,null,{"$f":"-IF(ISERROR(VLOOKUP(F11,Labor!$A$7:$B$222,2,0)),0,VLOOKUP(F11,Labor!$A$7:$B$222,2,0))","v":0},null,null,null,null,null,null,null,null,null,160390.03128107789,7.2326191121960148E-2,2377982.7012810777]
[null,"501NPCID","Steam Operation",{"$f":"MID(F12,4,12)","v":"NPCID"},{"$f":"+C12&D12","v":"Steam OperationNPCID"},"501NPCID",-103365.08,null,null,{"$f":"-IF(ISERROR(VLOOKUP(F12,Labor!$A$7:$B$222,2,0)),0,VLOOKUP(F12,Labor!$A$7:$B$222,2,0))","v":0},null,null,null,null,null,null,null,null,null,0,null,-103365.08]
[null,"501SE","Steam Operation","SE","Steam OperationSE","501SE",18028764.550000001,null,null,{"$f":"-IF(ISERROR(VLOOKUP(F13,Labor!$A$7:$B$222,2,0)),0,VLOOKUP(F13,Labor!$A$7:$B$222,2,0))","v":12711.508104976558},null,null,null,null,null,null,null,null,null,1304871.2455007688,7.2326191121960148E-2,19346347.303605746]
[null,"501SSECH","Steam Operation","SSECH","Steam OperationSSECH","501SSECH",3225440.5,null,null,{"$f":"-IF(ISERROR(VLOOKUP(F14,Labor!$A$7:$B$222,2,0)),0,VLOOKUP(F14,Labor!$A$7:$B$222,2,0))","v":0},null,null,null,null,null,null,null,null,null,233283.8260555107,7.2326191121960148E-2,3458724.3260555109]
[null,"501NPCSE","Steam Operation","NPCSE","Steam OperationNPCSE","501NPCSE",614495568.01999903,null,null,{"$f":"-IF(ISERROR(VLOOKUP(F15,Labor!$A$7:$B$222,2,0)),0,VLOOKUP(F15,Labor!$A$7:$B$222,2,0))","v":0},null,null,null,null,null,null,null,null,null,0,null,614495568.01999903]
{"$rows_left_out":419}
{"sheet":"Labor","index":4,"n_rows":218,"n_cols":2,"rows_kept":218,"cut":false,"hidden":false,"merged":[]}
["Rocky Mountain Power"]
["Utah General Rate Case - May 2013"]
["Wage and Employee Benefit Adjustment"]
["Adjustment by FERC Account and Revised Protocol Factor"]
[]
[]
["Indicator","Actual\n12 Months Ended\nJune 2011"]
["500SG",15136007.482796762]
["501SE",-12711.508104976558]
["502SG",16840474.202882066]
["503SE",70523.415707804204]
["505SG",1783112.5878932071]
["506SG",44406936.390502587]
["506SSGCH",-2156.076512129925]
["510SG",2789979.1228132476]
{"$rows_left_out":204}
{"sheet":"Factors","index":5,"n_rows":92,"n_cols":14,"rows_kept":92,"cut":false,"hidden":false,"merged":[]}
["BEGINNING/ENDING AVERAGE FACTORS","2010 PROTOCOL",null,null,null," "]
["DESCRIPTION","FACTOR","   California","      Oregon","Washington","     Montana","Wyo-PPL","     Utah","Idaho"," Wyo-UPL","FERC-UPL","OTHER","NON-UTILITY","WY-All"]
["Situs","S","-","-","-","-","-","-","-","-","-"]
["System Generation","SG",1.709086646927345E-2,0.25837432114839332,7.9488263420676677E-2,0,0.12165816442311414,0.4315468104876492,5.6322179470869524E-2,3.2152277217705583E-2,3.3671173623181839E-3,null,null,0.15381044164081972]
["System Generation (Pac. Power Costs on SG)","SG-P",1.709086646927345E-2,0.25837432114839332,7.9488263420676677E-2,0,0.12165816442311414,0.4315468104876492,5.6322179470869524E-2,3.2152277217705583E-2,3.3671173623181839E-3,null,null,0.15381044164081972]
["System Generation (R.M.P. Costs on SG)","SG-U",1.709086646927345E-2,0.25837432114839332,7.9488263420676677E-2,0,0.12165816442311414,0.4315468104876492,5.6322179470869524E-2,3.2152277217705583E-2,3.3671173623181839E-3,null,null,0.15381044164081972]
["Divisional Generation - Pac. Power","DGP",3.5859106062125647E-2,0.54210663938232828,0.16677785610347698,0,0.25525639845206904,0,0,0,0,null,null,0.25525639845206904]
["Divisional Generation - R.M.P.","DGU",0,0,0,0,0,0.82452500520838345,0.10761067905724976,6.1431010254561498E-2,6.433305479805175E-3,null,null,6.1431010254561498E-2]
["System Capacity","SC",1.7517092433622483E-2,0.26346617515786286,8.1089328074110234E-2,0,0.11809715300207883,0.4322178561862936,5.3846532905388794E-2,3.0533738227640463E-2,3.2321240130028304E-3,null,null,0.14863089122971929]
["System Energy","SE",1.5812188576226353E-2,0.24309875911998477,7.4685069460376008E-2,0,0.13234119868622005,0.429533673391716,6.3749119167311727E-2,3.7007894187900944E-2,3.7720974102642443E-3,null,null,0.16934909287412098]
["System Energy (Pac. Power Costs on SE)","SE-P",1.5812188576226353E-2,0.24309875911998477,7.4685069460376008E-2,0,0.13234119868622005,0.429533673391716,6.3749119167311727E-2,3.7007894187900944E-2,3.7720974102642443E-3,null,null,0.16934909287412098]
["System Energy (R.M.P. Costs on SE)","SE-U",1.5812188576226353E-2,0.24309875911998477,7.4685069460376008E-2,0,0.13234119868622005,0.429533673391716,6.3749119167311727E-2,3.7007894187900944E-2,3.7720974102642443E-3,null,null,0.16934909287412098]
["Divisional Energy - Pac. Power","DEP",3.3936307379148899E-2,0.52174145111001125,0.16028998526181784,0,0.2840322562490219,0,0,0,0,null,null,0.2840322562490219]
["Divisional Energy - R.M.P.","DEU",0,0,0,0,0,0.80427561353028021,0.11936633867479554,6.9295025389764384E-2,7.0630224051597404E-3,null,null,6.9295025389764384E-2]
["System Overhead","SO",2.3218938266786018E-2,0.27219314780190834,7.7288018691560836E-2,0,0.11340524173305812,0.42853606113710269,5.5235245945311054E-2,2.7695318894744317E-2,2.4280275295287383E-3,null,null,0.14110056062780243]
{"$rows_left_out":77}