{"text_format":"1","workbook":"xlsx","n_sheets":14,"sheets":["Page 1","Page 2","Page 3","Page 4","Page 5","Page 6","Page 7","Page 8","Page 9","Page 10","Page 11","Page 12","Page 13","Page 14"],"not_rendered":{"charts":0,"images":0,"macros":1,"external_links":1,"defined_names":66,"comments":0,"pivot_tables":0},"unopened":[],"bounds":{"document_bytes":16777216,"sheet_cells":100000,"rows_first":2000,"rows_last":500,"rows_between":2000,"halvings":0,"cell_chars":16384,"cell_head_chars":4096},"cells_cut":0,"cells_raw":0,"read":"whole","date_system":"1900"}

{"sheet":"Page 1","index":0,"n_rows":37,"n_cols":8,"rows_kept":37,"cut":false,"hidden":false,"merged":[[2,0,2,7]]}
["PacifiCorp"]
["12 Months Ended June 2011"]
["Functional Factors "]
[]
[]
["Function","Description","Production","Transmission","DPW","CUST","DMSC","Total"]
[]
["BOOKDEPR","Book Depreciation",{"$f":"'Page 7'!C12","v":0.53330883081307834},{"$f":"'Page 7'!D12","v":0.16661852821541756},{"$f":"'Page 7'!E12","v":0.29663707297504832},{"$f":"'Page 7'!F12","v":3.4355679964556858E-3},{"$f":"'Page 7'!G12","v":0},{"$f":"ROUND(SUM(C8:G8),4)","v":1}]
["CUST","Distribution Retail",0,0,0,1,0,1]
["DDS2","Deferred Debits - Situs",{"$f":"'Page 12'!F34","v":0.8654170762895036},{"$f":"'Page 12'!G34","v":1.1344409372251537E-2},{"$f":"'Page 12'!H34","v":7.1894508570484687E-3},{"$f":"'Page 12'!I34","v":0.14539156536514505},{"$f":"'Page 12'!J34","v":-2.9342501883948758E-2},1]
{"$rows_left_out":28}
{"sheet":"Page 2","index":1,"n_rows":29,"n_cols":8,"rows_kept":29,"cut":false,"hidden":false,"merged":[[2,0,2,7]]}
["PacifiCorp"]
["12 Months Ended June 2011"]
["Functional Factors "]
[]
[]
["Function","Description","Production","Transmission","DPW","CUST","DMSC","Total"]
[]
["SCHMA","Schedule M Additions",{"$f":"'Page 9'!F12","v":0.52592735793137158},{"$f":"'Page 9'!G12","v":0.17749230447050818},{"$f":"'Page 9'!H12","v":0.2797551697710543},{"$f":"'Page 9'!I12","v":1.2090484078880118E-2},{"$f":"'Page 9'!J12","v":4.7346837481858691E-3},{"$f":"ROUND(SUM(C8:G8),4)","v":1}]
["SCHMAF","Schedule M Additions - Flow Through",1,0,0,0,0,1]
["SCHMAP","Schedule M Additions - Permanent",{"$f":"'Page 8'!F16","v":0.43956098409095457},{"$f":"'Page 8'!G16","v":7.8689969960154899E-2},{"$f":"'Page 8'!H16","v":0.34527455396186357},{"$f":"'Page 8'!I16","v":0.13647449198702705},{"$f":"'Page 8'!J16","v":0},1]
{"$rows_left_out":20}
{"sheet":"Page 3","index":2,"n_rows":51,"n_cols":9,"rows_kept":51,"cut":false,"hidden":false,"merged":[]}
[{"$f":"+'Page 1'!$A$1","v":"PacifiCorp"}]
[{"$f":"+'Page 1'!A2","v":"12 Months Ended June 2011"}]
["General Plant"]
[]
[null,"Alloc."]
["Description","Factor","Funct.","Amount","Prod","Trans","DPW","CUST","DMISC"]
["Business Centers","CN","CUST",24826,{"$f":"$D7*VLOOKUP(+$C7,$B$45:$H$51,3)","v":0},{"$f":"$D7*VLOOKUP(+$C7,$B$45:$H$51,4)","v":0},{"$f":"$D7*VLOOKUP(+$C7,$B$45:$H$51,5)","v":0},{"$f":"$D7*VLOOKUP(+$C7,$B$45:$H$51,6)","v":24826},{"$f":"$D7*VLOOKUP(+$C7,$B$45:$H$51,7)","v":0}]
[null,"SE","P",660,660,0,0,0,0]
[null,"SG","P",96342,96342,0,0,0,0]
[null,"SG","T",107960,0,107960,0,0,0]
{"$rows_left_out":42}
{"sheet":"Page 4","index":3,"n_rows":53,"n_cols":9,"rows_kept":53,"cut":false,"hidden":false,"merged":[]}
["PacifiCorp"]
["Gross Plant"]
[{"$f":"+'Page 1'!A2","v":"12 Months Ended June 2011"}]
["(In 000's)"]
[]
[null,"Alloc."]
["Description","Factor","Funct.","Amount","Production","Transmisssion","DPW","CUSTOMER","DMISC"]
[]
["Production Plant",null,"P",10754154.3554995,{"$f":"$D9*VLOOKUP(+$C9,$C$46:$I$52,3)","v":10754154.3554995},{"$f":"$D9*VLOOKUP(+$C9,$C$46:$I$52,4)","v":0},{"$f":"$D9*VLOOKUP(+$C9,$C$46:$I$52,5)","v":0},{"$f":"$D9*VLOOKUP(+$C9,$C$46:$I$52,6)","v":0},{"$f":"$D9*VLOOKUP(+$C9,$C$46:$I$52,7)","v":0}]
["Transmission Plant",null,"T",4645694.5145130996,{"$f":"$D10*VLOOKUP(+$C10,$C$46:$I$52,3)","v":0},{"$f":"$D10*VLOOKUP(+$C10,$C$46:$I$52,4)","v":4645694.5145130996},{"$f":"$D10*VLOOKUP(+$C10,$C$46:$I$52,5)","v":0},{"$f":"$D10*VLOOKUP(+$C10,$C$46:$I$52,6)","v":0},{"$f":"$D10*VLOOKUP(+$C10,$C$46:$I$52,7)","v":0}]
{"$rows_left_out":44}
{"sheet":"Page 5","index":4,"n_rows":44,"n_cols":8,"rows_kept":44,"cut":false,"hidden":false,"merged":[]}
[{"$f":"+'Page 1'!A1","v":"PacifiCorp"}]
[{"$f":"+'Page 1'!A2","v":"12 Months Ended June 2011"}]
["Intangible Plant"]
["(In 000's)"]
["Alloc."]
["Factor","Funct.","Amount","Production","Transmisssion","DPW","Customer","DMSC"]
["CN","CUST",121077,{"$f":"$C7*VLOOKUP(+$B7,$B$37:$H$44,3)","v":0},{"$f":"$C7*VLOOKUP(+$B7,$B$37:$H$44,4)","v":0},{"$f":"$C7*VLOOKUP(+$B7,$B$37:$H$44,5)","v":0},{"$f":"$C7*VLOOKUP(+$B7,$B$37:$H$44,6)","v":121077},{"$f":"$C7*VLOOKUP(+$B7,$B$37:$H$44,7)","v":0}]
["SE","P",3654,3654,0,0,0,0]
["SG","P",94169,94169,0,0,0,0]
["SG","T",47228,0,47228,0,0,0]
{"$rows_left_out":35}
{"sheet":"Page 6","index":5,"n_rows":35,"n_cols":9,"rows_kept":35,"cut":false,"hidden":false,"merged":[[2,0,2,8],[1,0,1,8]]}
[{"$f":"+'Page 1'!A1","v":"PacifiCorp"}]
[{"$f":"+'Page 1'!A2:A2","v":"12 Months Ended June 2011"}]
["Account 456"]
[]
["Main"]
["Account","Factor","Function","Amount","Production","Transmission","DPW","Customer","DMSC"]
["456","OTHER","DMSC",4920,{"$f":"$D7*VLOOKUP(+$C7,$C$29:$I35,3,FALSE)","v":0},{"$f":"$D7*VLOOKUP(+$C7,$C$29:$I35,4,FALSE)","v":0},{"$f":"$D7*VLOOKUP(+$C7,$C$29:$I35,5,FALSE)","v":0},{"$f":"$D7*VLOOKUP(+$C7,$C$29:$I35,6,FALSE)","v":0},{"$f":"$D7*VLOOKUP(+$C7,$C$29:$I35,7,FALSE)","v":4920}]
["456","SE","P",0,{"$f":"$D8*VLOOKUP(+$C8,$C$29:$I36,3,FALSE)","v":0},{"$f":"$D8*VLOOKUP(+$C8,$C$29:$I36,4,FALSE)","v":0},{"$f":"$D8*VLOOKUP(+$C8,$C$29:$I36,5,FALSE)","v":0},{"$f":"$D8*VLOOKUP(+$C8,$C$29:$I36,6,FALSE)","v":0},{"$f":"$D8*VLOOKUP(+$C8,$C$29:$I36,7,FALSE)","v":0}]
["456","SE","T",10745,{"$f":"$D9*VLOOKUP(+$C9,$C$29:$I37,3,FALSE)","v":0},{"$f":"$D9*VLOOKUP(+$C9,$C$29:$I37,4,FALSE)","v":10745},{"$f":"$D9*VLOOKUP(+$C9,$C$29:$I37,5,FALSE)","v":0},{"$f":"$D9*VLOOKUP(+$C9,$C$29:$I37,6,FALSE)","v":0},{"$f":"$D9*VLOOKUP(+$C9,$C$29:$I37,7,FALSE)","v":0}]
["456","SG","P",117830,{"$f":"$D10*VLOOKUP(+$C10,$C$29:$I38,3,FALSE)","v":117830},{"$f":"$D10*VLOOKUP(+$C10,$C$29:$I38,4,FALSE)","v":0},{"$f":"$D10*VLOOKUP(+$C10,$C$29:$I38,5,FALSE)","v":0},{"$f":"$D10*VLOOKUP(+$C10,$C$29:$I38,6,FALSE)","v":0},{"$f":"$D10*VLOOKUP(+$C10,$C$29:$I38,7,FALSE)","v":0}]
{"$rows_left_out":26}
{"sheet":"Page 7","index":6,"n_rows":21,"n_cols":7,"rows_kept":21,"cut":false,"hidden":false,"merged":[[0,0,0,6],[1,0,1,6],[2,0,2,6]]}
[{"$f":"+'Page 1'!$A$1","v":"PacifiCorp"}]
[{"$f":"+'Page 1'!A2","v":"12 Months Ended June 2011"}]
["Depreciation Expense"]
[]
["Function","Amount","Production","Transmission","DPW","CUST","DMSC"]
["CUST",1706,{"$f":"VLOOKUP($A6,$A$15:$G$21,3,FALSE)*$B6","v":0},{"$f":"VLOOKUP($A6,$A$15:$G$21,4,FALSE)*$B6","v":0},{"$f":"VLOOKUP($A6,$A$15:$G$21,5,FALSE)*$B6","v":0},{"$f":"VLOOKUP($A6,$A$15:$G$21,6,FALSE)*$B6","v":1706},{"$f":"VLOOKUP($A6,$A$15:$G$21,7,FALSE)*$B6","v":0}]
["DPW",143309,{"$f":"VLOOKUP($A7,$A$15:$G$21,3,FALSE)*$B7","v":0},{"$f":"VLOOKUP($A7,$A$15:$G$21,4,FALSE)*$B7","v":0},{"$f":"VLOOKUP($A7,$A$15:$G$21,5,FALSE)*$B7","v":143309},{"$f":"VLOOKUP($A7,$A$15:$G$21,6,FALSE)*$B7","v":0},{"$f":"VLOOKUP($A7,$A$15:$G$21,7,FALSE)*$B7","v":0}]
["P",257395,{"$f":"VLOOKUP($A8,$A$15:$G$21,3,FALSE)*$B8","v":257395},{"$f":"VLOOKUP($A8,$A$15:$G$21,4,FALSE)*$B8","v":0},{"$f":"VLOOKUP($A8,$A$15:$G$21,5,FALSE)*$B8","v":0},{"$f":"VLOOKUP($A8,$A$15:$G$21,6,FALSE)*$B8","v":0},{"$f":"VLOOKUP($A8,$A$15:$G$21,7,FALSE)*$B8","v":0}]
["PTD",14632,{"$f":"VLOOKUP($A9,$A$15:$G$21,3,FALSE)*$B9","v":7430.1661168503615},{"$f":"VLOOKUP($A9,$A$15:$G$21,4,FALSE)*$B9","v":3209.7625559299072},{"$f":"VLOOKUP($A9,$A$15:$G$21,5,FALSE)*$B9","v":3992.0713272197327},{"$f":"VLOOKUP($A9,$A$15:$G$21,6,FALSE)*$B9","v":0},{"$f":"VLOOKUP($A9,$A$15:$G$21,7,FALSE)*$B9","v":0}]
["T",79528,{"$f":"VLOOKUP($A10,$A$15:$G$21,3,FALSE)*$B10","v":0},{"$f":"VLOOKUP($A10,$A$15:$G$21,4,FALSE)*$B10","v":79528},{"$f":"VLOOKUP($A10,$A$15:$G$21,5,FALSE)*$B10","v":0},{"$f":"VLOOKUP($A10,$A$15:$G$21,6,FALSE)*$B10","v":0},{"$f":"VLOOKUP($A10,$A$15:$G$21,7,FALSE)*$B10","v":0}]
{"$rows_left_out":12}
{"sheet":"Page 8","index":7,"n_rows":55,"n_cols":10,"rows_kept":55,"cut":false,"hidden":false,"merged":[]}
[null,{"$f":"+'Page 1'!A1","v":"PacifiCorp"}]
[null,{"$f":"+'Page 1'!A2","v":"12 Months Ended June 2011"}]
[null,"Schedule M"]
[null,"Primary","PITA"]
[null,"Account","Factor","Function","Amount","Production","Transmission","Poles & Wires","Customers","Miscellaneous"]
[null,"ADDITIONS"]
[{"$f":"IF(C7=\"\",\"\",B7&\"-\"&C7)","v":"SCHMAP-SCHMDEXP"},"SCHMAP","SCHMDEXP","LABOR",-536,{"$f":"VLOOKUP($D7,'Page 10'!$D$30:$J$41,3,FALSE)*$E7","v":-228.94116838479704},{"$f":"VLOOKUP($D7,'Page 10'!$D$30:$J$41,4,FALSE)*$E7","v":-36.743117942383691},{"$f":"VLOOKUP($D7,'Page 10'!$D$30:$J$41,5,FALSE)*$E7","v":-190.46128662568572},{"$f":"VLOOKUP($D7,'Page 10'!$D$30:$J$41,6,FALSE)*$E7","v":-79.854427047133569},{"$f":"VLOOKUP($D7,'Page 10'!$D$30:$J$41,7,FALSE)*$E7","v":0}]
[{"$f":"IF(C8=\"\",\"\",B8&\"-\"&C8)","v":"SCHMAP-SE"},"SCHMAP","SE","P",130,{"$f":"VLOOKUP($D8,'Page 10'!$D$30:$J$41,3,FALSE)*$E8","v":130},{"$f":"VLOOKUP($D8,'Page 10'!$D$30:$J$41,4,FALSE)*$E8","v":0},{"$f":"VLOOKUP($D8,'Page 10'!$D$30:$J$41,5,FALSE)*$E8","v":0},{"$f":"VLOOKUP($D8,'Page 10'!$D$30:$J$41,6,FALSE)*$E8","v":0},{"$f":"VLOOKUP($D8,'Page 10'!$D$30:$J$41,7,FALSE)*$E8","v":0}]
[{"$f":"IF(C9=\"\",\"\",B9&\"-\"&C9)","v":"SCHMAP-OTHER"},"SCHMAP","OTHER","P",29,{"$f":"VLOOKUP($D9,'Page 10'!$D$30:$J$41,3,FALSE)*$E9","v":29},{"$f":"VLOOKUP($D9,'Page 10'!$D$30:$J$41,4,FALSE)*$E9","v":0},{"$f":"VLOOKUP($D9,'Page 10'!$D$30:$J$41,5,FALSE)*$E9","v":0},{"$f":"VLOOKUP($D9,'Page 10'!$D$30:$J$41,6,FALSE)*$E9","v":0},{"$f":"VLOOKUP($D9,'Page 10'!$D$30:$J$41,7,FALSE)*$E9","v":0}]
[{"$f":"IF(C10=\"\",\"\",B10&\"-\"&C10)","v":"SCHMAP-SO"},"SCHMAP","SO","LABOR",13204,{"$f":"VLOOKUP($D10,'Page 10'!$D$30:$J$41,3,FALSE)*$E10","v":5639.8119167030973},{"$f":"VLOOKUP($D10,'Page 10'!$D$30:$J$41,4,FALSE)*$E10","v":905.1420322970788},{"$f":"VLOOKUP($D10,'Page 10'!$D$30:$J$41,5,FALSE)*$E10","v":4691.8858742640932},{"$f":"VLOOKUP($D10,'Page 10'!$D$30:$J$41,6,FALSE)*$E10","v":1967.1601767357306},{"$f":"VLOOKUP($D10,'Page 10'!$D$30:$J$41,7,FALSE)*$E10","v":0}]
{"$rows_left_out":46}
{"sheet":"Page 9","index":8,"n_rows":59,"n_cols":10,"rows_kept":59,"cut":false,"hidden":false,"merged":[]}
[null,{"$f":"+'Page 1'!A1","v":"PacifiCorp"}]
[null,{"$f":"+'Page 1'!A2","v":"12 Months Ended June 2011"}]
[null,"Schedule M"]
[null,"Primary","PITA"]
[null,"Account","Factor","Function","Amount","Production","Transmission","Poles & Wires","Customers","Miscellaneous"]
[{"$f":"IF(C6=\"\",\"\",B6&\"-\"&C6)","v":"SCHMAF-DGP"},"SCHMAF","DGP","P",0,{"$f":"VLOOKUP($D6,'Page 10'!$D$30:$J$41,3,FALSE)*$E6","v":0},{"$f":"VLOOKUP($D6,'Page 10'!$D$30:$J$41,4,FALSE)*$E6","v":0},{"$f":"VLOOKUP($D6,'Page 10'!$D$30:$J$41,5,FALSE)*$E6","v":0},{"$f":"VLOOKUP($D6,'Page 10'!$D$30:$J$41,6,FALSE)*$E6","v":0},{"$f":"VLOOKUP($D6,'Page 10'!$D$30:$J$41,7,FALSE)*$E6","v":0}]
[{"$f":"IF(C7=\"\",\"\",B7&\"-\"&C7)","v":"SCHMAF-TROJP"},"SCHMAF","TROJP","P",0,{"$f":"VLOOKUP($D7,'Page 10'!$D$30:$J$41,3,FALSE)*$E7","v":0},{"$f":"VLOOKUP($D7,'Page 10'!$D$30:$J$41,4,FALSE)*$E7","v":0},{"$f":"VLOOKUP($D7,'Page 10'!$D$30:$J$41,5,FALSE)*$E7","v":0},{"$f":"VLOOKUP($D7,'Page 10'!$D$30:$J$41,6,FALSE)*$E7","v":0},{"$f":"VLOOKUP($D7,'Page 10'!$D$30:$J$41,7,FALSE)*$E7","v":0}]
[{"$f":"IF(C8=\"\",\"\",B8&\"-\"&C8)","v":""},"Total-SCHMAF",null,null,{"$f":"SUMIF($A$6:$A$59,\"SCHMAF\",E$6:E$59)","v":0},0,0,0,0,0]
[{"$f":"IF(C9=\"\",\"\",B9&\"-\"&C9)","v":""},"SCHMAF FACTOR",null,null,{"$f":"SUM(F9:J9)","v":0},{"$f":"IF(ISERROR(F8/$E8),\" \",(F8/$E8))","v":" "},{"$f":"IF(ISERROR(G8/$E8),\" \",(G8/$E8))","v":" "},{"$f":"IF(ISERROR(H8/$E8),\" \",(H8/$E8))","v":" "},{"$f":"IF(ISERROR(I8/$E8),\" \",(I8/$E8))","v":" "},{"$f":"IF(ISERROR(J8/$E8),\" \",(J8/$E8))","v":" "}]
[]
{"$rows_left_out":50}
{"sheet":"Page 10","index":9,"n_rows":41,"n_cols":10,"rows_kept":41,"cut":false,"hidden":false,"merged":[]}
[null,{"$f":"+'Page 1'!A1","v":"PacifiCorp"}]
[null,{"$f":"+'Page 1'!A2","v":"12 Months Ended June 2011"}]
[null,"Schedule M"]
[null,"Primary","PITA"]
[null,"Account","Factor","Function","Amount","Production","Transmission","Poles & Wires","Customers","Miscellaneous"]
[{"$f":"IF(C6=\"\",\"\",B6&\"-\"&C6)","v":""},"Total TAXDEPR",null,null,{"$f":"+'Page 9'!E46","v":2847400},{"$f":"+'Page 9'!F46","v":1644300.924438566},{"$f":"+'Page 9'!G46","v":557824.23558642645},{"$f":"+'Page 9'!H46","v":632414.44580870436},{"$f":"+'Page 9'!I46","v":12860.394166303218},{"$f":"+'Page 9'!J46","v":0}]
["","Total-SITUS",null,null,{"$f":"SUM('Page 9'!E47:E52)+SUM('Page 9'!E27)","v":9698},{"$f":"SUM('Page 9'!F47:F52)+SUM('Page 9'!F27)","v":8092.6574973365196},{"$f":"SUM('Page 9'!G47:G52)+SUM('Page 9'!G27)","v":114.81085674385231},{"$f":"SUM('Page 9'!H47:H52)+SUM('Page 9'!H27)","v":614.03933892202645},{"$f":"SUM('Page 9'!I47:I52)+SUM('Page 9'!I27)","v":285.49230699760142},{"$f":"SUM('Page 9'!J47:J52)+SUM('Page 9'!J27)","v":591}]
["","Total SCHMDT",null,null,{"$f":"SUM('Page 9'!E26:E52)","v":3263756},{"$f":"SUM('Page 9'!F26:F52)","v":1907903.0146367338},{"$f":"SUM('Page 9'!G26:G52)","v":602183.31700389984},{"$f":"SUM('Page 9'!H26:H52)","v":686616.11809694825},{"$f":"SUM('Page 9'!I26:I52)","v":14331.550262418008},{"$f":"SUM('Page 9'!J26:J52)","v":52722}]
["","SCHMDT-GPS",null,null,{"$f":"SUM(F9:J9)","v":1},{"$f":"IF(ISERROR('Page 9'!F53/'Page 9'!$E53),\" \",('Page 9'!F53/'Page 9'!$E53))","v":0.50790729766261489},{"$f":"IF(ISERROR('Page 9'!G53/'Page 9'!$E53),\" \",('Page 9'!G53/'Page 9'!$E53))","v":0.21910781078332736},{"$f":"IF(ISERROR('Page 9'!H53/'Page 9'!$E53),\" \",('Page 9'!H53/'Page 9'!$E53))","v":0.27253400307169895},{"$f":"IF(ISERROR('Page 9'!I53/'Page 9'!$E53),\" \",('Page 9'!I53/'Page 9'!$E53))","v":4.5088848235883444E-4},{"$f":"IF(ISERROR('Page 9'!J53/'Page 9'!$E53),\" \",('Page 9'!J53/'Page 9'!$E53))","v":0}]
["","SCHMDT-CN",null,null,1,{"$f":"IF(ISERROR('Page 9'!F54/'Page 9'!$E54),\" \",('Page 9'!F54/'Page 9'!$E54))","v":0},{"$f":"IF(ISERROR('Page 9'!G54/'Page 9'!$E54),\" \",('Page 9'!G54/'Page 9'!$E54))","v":0},{"$f":"IF(ISERROR('Page 9'!H54/'Page 9'!$E54),\" \",('Page 9'!H54/'Page 9'!$E54))","v":0},{"$f":"IF(ISERROR('Page 9'!I54/'Page 9'!$E54),\" \",('Page 9'!I54/'Page 9'!$E54))","v":1},{"$f":"IF(ISERROR('Page 9'!J54/'Page 9'!$E54),\" \",('Page 9'!J54/'Page 9'!$E54))","v":0}]
{"$rows_left_out":32}
{"sheet":"Page 11","index":10,"n_rows":24,"n_cols":7,"rows_kept":24,"cut":false,"hidden":false,"merged":[[0,0,0,6],[1,0,1,6]]}
[{"$f":"+'Page 1'!$A$1","v":"PacifiCorp"}]
[{"$f":"+'Page 1'!A2","v":"12 Months Ended June 2011"}]
["Tax Depreciation"]
[]
[null,"Total","Production","Transmission","Distribution","General","Mining"]
[]
[]
["Total",{"$f":"SUM(C8:G8)","v":1058690506},{"$f":"571941475-G8","v":563980234},192892391,215853777,78002863,7961241]
[]
[]
{"$rows_left_out":15}
{"sheet":"Page 12","index":11,"n_rows":48,"n_cols":10,"rows_kept":48,"cut":false,"hidden":false,"merged":[[0,1,0,9],[1,1,1,9],[2,1,2,9]]}
[null,{"$f":"+'Page 1'!A1","v":"PacifiCorp"}]
[null,{"$f":"+'Page 1'!A2","v":"12 Months Ended June 2011"}]
[null,"Reg Assets / Deferred Debits"]
[]
[null,"Pri-Acct","Factor","Function","Total","Production","Transmission","DPW","CUST","DMSC"]
[{"$f":"\"RA\"&\"-\"&C6","v":"RA-SE"},"182M","SE","P",0,{"$f":"VLOOKUP($D6,'Page 13'!$D$21:$J$33,3,FALSE)*$E6","v":0},{"$f":"VLOOKUP($D6,'Page 13'!$D$21:$J$33,4,FALSE)*$E6","v":0},{"$f":"VLOOKUP($D6,'Page 13'!$D$21:$J$33,5,FALSE)*$E6","v":0},{"$f":"VLOOKUP($D6,'Page 13'!$D$21:$J$33,6,FALSE)*$E6","v":0},{"$f":"VLOOKUP($D6,'Page 13'!$D$21:$J$33,7,FALSE)*$E6","v":0}]
["RA-SG","182M","SG","P",0,{"$f":"VLOOKUP($D7,'Page 13'!$D$21:$J$33,3,FALSE)*$E7","v":0},{"$f":"VLOOKUP($D7,'Page 13'!$D$21:$J$33,4,FALSE)*$E7","v":0},{"$f":"VLOOKUP($D7,'Page 13'!$D$21:$J$33,5,FALSE)*$E7","v":0},{"$f":"VLOOKUP($D7,'Page 13'!$D$21:$J$33,6,FALSE)*$E7","v":0},{"$f":"VLOOKUP($D7,'Page 13'!$D$21:$J$33,7,FALSE)*$E7","v":0}]
["RA-SGCT","182M","SGCT","P",6828,{"$f":"VLOOKUP($D8,'Page 13'!$D$21:$J$33,3,FALSE)*$E8","v":6828},{"$f":"VLOOKUP($D8,'Page 13'!$D$21:$J$33,4,FALSE)*$E8","v":0},{"$f":"VLOOKUP($D8,'Page 13'!$D$21:$J$33,5,FALSE)*$E8","v":0},{"$f":"VLOOKUP($D8,'Page 13'!$D$21:$J$33,6,FALSE)*$E8","v":0},{"$f":"VLOOKUP($D8,'Page 13'!$D$21:$J$33,7,FALSE)*$E8","v":0}]
["RA-SG-P","182M","SG-P","P",0,{"$f":"VLOOKUP($D9,'Page 13'!$D$21:$J$33,3,FALSE)*$E9","v":0},{"$f":"VLOOKUP($D9,'Page 13'!$D$21:$J$33,4,FALSE)*$E9","v":0},{"$f":"VLOOKUP($D9,'Page 13'!$D$21:$J$33,5,FALSE)*$E9","v":0},{"$f":"VLOOKUP($D9,'Page 13'!$D$21:$J$33,6,FALSE)*$E9","v":0},{"$f":"VLOOKUP($D9,'Page 13'!$D$21:$J$33,7,FALSE)*$E9","v":0}]
["RA-SO","182M","SO","DMSC",5547,{"$f":"VLOOKUP($D10,'Page 13'!$D$21:$J$33,3,FALSE)*$E10","v":0},{"$f":"VLOOKUP($D10,'Page 13'!$D$21:$J$33,4,FALSE)*$E10","v":0},{"$f":"VLOOKUP($D10,'Page 13'!$D$21:$J$33,5,FALSE)*$E10","v":0},{"$f":"VLOOKUP($D10,'Page 13'!$D$21:$J$33,6,FALSE)*$E10","v":0},{"$f":"VLOOKUP($D10,'Page 13'!$D$21:$J$33,7,FALSE)*$E10","v":5547}]
{"$rows_left_out":39}
{"sheet":"Page 13","index":12,"n_rows":33,"n_cols":10,"rows_kept":33,"cut":false,"hidden":false,"merged":[[0,1,0,9],[1,1,1,9],[2,1,2,9]]}
[null,{"$f":"+'Page 1'!A1","v":"PacifiCorp"}]
[null,{"$f":"+'Page 1'!A2","v":"12 Months Ended June 2011"}]
[null,"Reg Assets / Deferred Debits"]
[]
[null,"Pri-Acct","Factor","Function","Total","Production","Transmission","DPW","CUST","DMSC"]
[null,"Major Adjustment"]
[null,"1998 Early Retirement",null,"LABOR",0,{"$f":"VLOOKUP($D7,$D$21:$J$33,3,FALSE)*$E7","v":0},{"$f":"VLOOKUP($D7,$D$21:$J$33,4,FALSE)*$E7","v":0},{"$f":"VLOOKUP($D7,$D$21:$J$33,5,FALSE)*$E7","v":0},{"$f":"VLOOKUP($D7,$D$21:$J$33,6,FALSE)*$E7","v":0},{"$f":"VLOOKUP($D7,$D$21:$J$33,7,FALSE)*$E7","v":0}]
[null,"1999 Early Retirement",null,"LABOR",0,{"$f":"VLOOKUP($D8,$D$21:$J$33,3,FALSE)*$E8","v":0},{"$f":"VLOOKUP($D8,$D$21:$J$33,4,FALSE)*$E8","v":0},{"$f":"VLOOKUP($D8,$D$21:$J$33,5,FALSE)*$E8","v":0},{"$f":"VLOOKUP($D8,$D$21:$J$33,6,FALSE)*$E8","v":0},{"$f":"VLOOKUP($D8,$D$21:$J$33,7,FALSE)*$E8","v":0}]
[null,"Transition Planning",null,"PTD",0,{"$f":"VLOOKUP($D9,$D$21:$J$33,3,FALSE)*$E9","v":0},{"$f":"VLOOKUP($D9,$D$21:$J$33,4,FALSE)*$E9","v":0},{"$f":"VLOOKUP($D9,$D$21:$J$33,5,FALSE)*$E9","v":0},{"$f":"VLOOKUP($D9,$D$21:$J$33,6,FALSE)*$E9","v":0},{"$f":"VLOOKUP($D9,$D$21:$J$33,7,FALSE)*$E9","v":0}]
[null,"Environmental Clean-up",null,"ESD",0,{"$f":"VLOOKUP($D10,$D$21:$J$33,3,FALSE)*$E10","v":0},{"$f":"VLOOKUP($D10,$D$21:$J$33,4,FALSE)*$E10","v":0},{"$f":"VLOOKUP($D10,$D$21:$J$33,5,FALSE)*$E10","v":0},{"$f":"VLOOKUP($D10,$D$21:$J$33,6,FALSE)*$E10","v":0},{"$f":"VLOOKUP($D10,$D$21:$J$33,7,FALSE)*$E10","v":0}]
{"$rows_left_out":24}
{"sheet":"Page 14","index":13,"n_rows":41,"n_cols":7,"rows_kept":41,"cut":false,"hidden":false,"merged":[[0,0,0,6]]}
[{"$f":"+'Page 1'!A1","v":"PacifiCorp"}]
[{"$f":"+'Page 1'!A2","v":"12 Months Ended June 2011"}]
["FERC FORM 1 Funtionalization Factors"]
[]
[]
["Factor","Total","Production","Transmission","DPW","CUST","DMSC"]
[]
["PLANT",{"$f":"SUM(C8:G8)","v":21177828.874217849},{"$f":"+'Page 4'!D9","v":10754154.3554995},{"$f":"+'Page 4'!D10","v":4645694.5145130996},{"$f":"+'Page 4'!D11","v":5777980.0042052502},0,0]
["UNCLASSIFIED PLANT",{"$f":"SUM(C9:G9)","v":0},null,null,null,0,0]
["TOTAL PLANT",{"$f":"SUM(C10:G10)","v":21177828.874217849},{"$f":"C8+C9","v":10754154.3554995},{"$f":"D8+D9","v":4645694.5145130996},{"$f":"E8+E9","v":5777980.0042052502},0,0]
{"$rows_left_out":31}