{"text_format":"1","workbook":"xlsx","n_sheets":7,"sheets":["Scenario Summaries","Inputs and Revenues","Single Bills","Reduced Usage Scenario","Data","Assumptions","Sheet1"],"not_rendered":{"charts":0,"images":0,"macros":1,"external_links":1,"defined_names":1,"comments":0,"pivot_tables":0},"unopened":[],"bounds":{"document_bytes":16777216,"sheet_cells":100000,"rows_first":2000,"rows_last":500,"rows_between":2000,"halvings":0,"cell_chars":16384,"cell_head_chars":4096},"cells_cut":0,"cells_raw":0,"read":"whole","date_system":"1900"}

{"sheet":"Scenario Summaries","index":0,"n_rows":54,"n_cols":13,"rows_kept":54,"cut":false,"hidden":false,"merged":[[46,0,53,0],[46,1,46,4],[47,10,48,10],[47,11,48,11],[47,12,48,12],[46,6,46,8],[46,10,46,12],[2,0,2,12],[6,0,13,0],[7,10,8,10],[7,12,8,12],[7,11,8,11],[6,1,6,4],[6,6,6,8],[6,10,6,12],[4,6,4,12],[4,1,4,4],[16,0,23,0],[16,1,16,4],[17,10,18,10],[17,11,18,11],[17,12,18,12],[16,6,16,8],[16,10,16,12],[26,0,33,0],[26,1,26,4],[27,10,28,10],[27,11,28,11],[27,12,28,12],[26,6,26,8],[26,10,26,12],[36,0,43,0],[36,1,36,4],[37,10,38,10],[37,11,38,11],[37,12,38,12],[36,6,36,8],[36,10,36,12]]}
[]
[]
["scenario summaries"]
[]
[null,"Inputs",null,null,null,null,"Results"]
[]
["scenario 1","Assumptions",null,null,null,null,"Revenues",null,null,null,"Revenue Changes for Scenario 1"]
[null,"July 2010 through June 2011 bill frequency data",null,null,null,null,"revenues with minimum bill",":",{"$f":"ROUND(619017970.514264,-3)","v":619018000},null,"increased revenues with minimum bill",":",{"$f":"I8-I9","v":269000}]
[null,"(current) customer charge",":",4,null,null,"revenues with no minimum bill",":",{"$f":"ROUND(618748757.785942,-3)","v":618749000}]
[null,"(current) minimum bill",":",7]
[null,"(current) energy rates",":",8.4003999999999995E-2,"1st 400 kWh May-Sept",null,"revenues if 6% drop in usage in all tiers",":",{"$f":"ROUND(601171349.279336,-3)","v":601171000},null,"Lost revenue* from 6% efficiency scenario",":",{"$f":"ROUND(17846621.2349277,-3)","v":17847000}]
[null,null,null,0.103481,"next 66 kWh May-Sept",null,"revenues if 20% drop in tiers 2 & 3",":",{"$f":"ROUND(563817896.592554,-3)","v":563818000},null,"Lost revenue* from 20% efficiency scenario",":",{"$f":"ROUND(56550871.7198881,-3)","v":56551000}]
[null,null,null,0.12870899999999999,"all add'l kWh May-Sept",null,null,null,null,null,"(*Calculated using minimum bill scenario)"]
[null,null,null,8.7035000000000001E-2,"all kWh Oct-April",null,"Revenues from Customer Charge",":",{"$f":"ROUND(32316296.0616,-3)","v":32316000}]
[]
{"$rows_left_out":40}
{"sheet":"Inputs and Revenues","index":1,"n_rows":101,"n_cols":17,"rows_kept":101,"cut":false,"hidden":false,"merged":[[2,6,2,9],[2,10,2,13],[2,1,2,4],[41,7,41,10],[49,11,49,12]]}
[]
[]
[null,"Rates",null,null,null,null,"Revenues with minimum bill",null,null,null,"Revenues without minimum bill"]
[]
[]
[null,"Monthly fixed charges:",null,null,null,null,"Revenues per kWh range: ",null,null,null,"Revenues per kWh range: "]
[null,null,"Customer charge",4,null,null,null,"0 kWh",{"$f":"'Inputs and Revenues'!D12*(((5/12)*'Single Bills'!G5)+((7/12)*'Single Bills'!K5))","v":319569.18279999966},null,null,"0 kWh",{"$f":"D12*(((5/12)*'Single Bills'!F5)+((7/12)*'Single Bills'!J5))","v":182610.96159999978}]
[null,null,"Minimum bill",7,null,null,null,"0 - 20 kWh",{"$f":"'Inputs and Revenues'!D13*(((5/12)*'Single Bills'!G6)+((7/12)*'Single Bills'!K6))","v":369946.8653999989},null,null,"0 - 20 kWh",{"$f":"D13*(((5/12)*'Single Bills'!F6)+((7/12)*'Single Bills'!J6))","v":256728.37075427672},null,null,null,"color coding key:"]
[null,null,null,null,null,null,null,"20 - 40 kWh",{"$f":"'Inputs and Revenues'!D14*(((5/12)*'Single Bills'!G7)+((7/12)*'Single Bills'!K7))","v":312184.58389999915},null,null,"20 - 40 kWh",{"$f":"D14*(((5/12)*'Single Bills'!F7)+((7/12)*'Single Bills'!J7))","v":293148.5714242254},null,null,null,"pick a number or rate"]
[null,"Bill frequency: ",null,null,null,null,null,"40 - 60 kWh",{"$f":"'Inputs and Revenues'!D15*(((5/12)*'Single Bills'!G8)+((7/12)*'Single Bills'!K8))","v":425403.91327953414},null,null,"40 - 60 kWh",{"$f":"D15*(((5/12)*'Single Bills'!F8)+((7/12)*'Single Bills'!J8))","v":425403.91327953414},null,null,null,"inputs from \"Data\" tab "]
[null,null,"kWh range","# of bills",null,null,null,"60 - 80 kWh",{"$f":"'Inputs and Revenues'!D16*(((5/12)*'Single Bills'!G9)+((7/12)*'Single Bills'!K9))","v":532446.47885155573},null,null,"60 - 80 kWh",{"$f":"D16*(((5/12)*'Single Bills'!F9)+((7/12)*'Single Bills'!J9))","v":532446.47885155573},null,null,null,"unlocked formula "]
[null,null,"0 kWh",{"$f":"Data!P5","v":45652.740399999944},null,null,null,"80 - 100 kWh",{"$f":"'Inputs and Revenues'!D17*(((5/12)*'Single Bills'!G10)+((7/12)*'Single Bills'!K10))","v":691210.34508986119},null,null,"80 - 100 kWh",{"$f":"D17*(((5/12)*'Single Bills'!F10)+((7/12)*'Single Bills'!J10))","v":691210.34508986119}]
[null,null,"0 - 20 kWh",{"$f":"Data!P6","v":52849.552199999838},null,null,null,"100 - 200 kWh",{"$f":"'Inputs and Revenues'!D18*(((5/12)*'Single Bills'!G11)+((7/12)*'Single Bills'!K11))","v":6528911.3124052342},null,null,"100 - 200 kWh",{"$f":"D18*(((5/12)*'Single Bills'!F11)+((7/12)*'Single Bills'!J11))","v":6528911.3124052342}]
[null,null,"20 - 40 kWh",{"$f":"Data!P7","v":44597.797699999872},null,null,null,"200 - 300 kWh",{"$f":"'Inputs and Revenues'!D19*(((5/12)*'Single Bills'!G12)+((7/12)*'Single Bills'!K12))","v":15183088.171378223},null,null,"200 - 300 kWh",{"$f":"D19*(((5/12)*'Single Bills'!F12)+((7/12)*'Single Bills'!J12))","v":15183088.171378223}]
[null,null,"40 - 60 kWh",{"$f":"Data!P8","v":51323.950899999851},null,null,null,"300 - 400 kWh",{"$f":"'Inputs and Revenues'!D20*(((5/12)*'Single Bills'!G13)+((7/12)*'Single Bills'!K13))","v":25790262.499656204},null,null,"300 - 400 kWh",{"$f":"D20*(((5/12)*'Single Bills'!F13)+((7/12)*'Single Bills'!J13))","v":25790262.499656204}]
{"$rows_left_out":87}
{"sheet":"Single Bills","index":2,"n_rows":38,"n_cols":11,"rows_kept":38,"cut":false,"hidden":false,"merged":[[2,4,2,5],[33,4,33,5],[35,0,35,1],[36,0,36,1],[37,0,37,1],[34,0,34,1]]}
[null,null,null,null,null,"May to September Rates",null,null,null,"October to April Rates"]
[]
[null,null,null,null,"no minimum bill",null,"minimum bill"]
["kWh range","energy charge per kWh ($)","assumed kWh usage within range (kWh)",null,"energy charge*","energy charge + customer charge","minimum bill or energy charge + customer charge",null,"energy Charge","energy charge + customer charge","minimum bill or energy charge + customer charge"]
["0 kWh",{"$f":"'Inputs and Revenues'!$D$44","v":8.4003999999999995E-2},0,0,{"$f":"D5","v":0},{"$f":"E5+'Inputs and Revenues'!$D$7","v":4},{"$f":"IF(F5<'Inputs and Revenues'!$D$8,'Inputs and Revenues'!$D$8,'Single Bills'!F5)","v":7},null,{"$f":"C5*'Inputs and Revenues'!D71","v":0},{"$f":"I5+'Inputs and Revenues'!$D$7","v":4},{"$f":"IF(J5<'Inputs and Revenues'!$D$8,'Inputs and Revenues'!$D$8,'Single Bills'!J5)","v":7}]
["0 - 20 kWh",{"$f":"'Inputs and Revenues'!$D$44","v":8.4003999999999995E-2},10,0.8400399999999999,{"$f":"D6","v":0.8400399999999999},{"$f":"E6+'Inputs and Revenues'!$D$7","v":4.8400400000000001},{"$f":"IF(F6<'Inputs and Revenues'!$D$8,'Inputs and Revenues'!$D$8,'Single Bills'!F6)","v":7},null,{"$f":"C6*'Inputs and Revenues'!D72","v":0.87034999999999996},{"$f":"I6+'Inputs and Revenues'!$D$7","v":4.8703500000000002},{"$f":"IF(J6<'Inputs and Revenues'!$D$8,'Inputs and Revenues'!$D$8,'Single Bills'!J6)","v":7}]
["20 - 40 kWh",{"$f":"'Inputs and Revenues'!$D$44","v":8.4003999999999995E-2},30,2.5201199999999995,2.5201199999999995,{"$f":"E7+'Inputs and Revenues'!$D$7","v":6.5201199999999995},{"$f":"IF(F7<'Inputs and Revenues'!$D$8,'Inputs and Revenues'!$D$8,'Single Bills'!F7)","v":7},null,{"$f":"C7*'Inputs and Revenues'!D73","v":2.6110500000000001},{"$f":"I7+'Inputs and Revenues'!$D$7","v":6.6110500000000005},{"$f":"IF(J7<'Inputs and Revenues'!$D$8,'Inputs and Revenues'!$D$8,'Single Bills'!J7)","v":7}]
["40 - 60 kWh",{"$f":"'Inputs and Revenues'!$D$44","v":8.4003999999999995E-2},50,4.2001999999999997,4.2001999999999997,{"$f":"E8+'Inputs and Revenues'!$D$7","v":8.2001999999999988},{"$f":"IF(F8<'Inputs and Revenues'!$D$8,'Inputs and Revenues'!$D$8,'Single Bills'!F8)","v":8.2001999999999988},null,{"$f":"C8*'Inputs and Revenues'!D74","v":4.35175},{"$f":"I8+'Inputs and Revenues'!$D$7","v":8.3517499999999991},{"$f":"IF(J8<'Inputs and Revenues'!$D$8,'Inputs and Revenues'!$D$8,'Single Bills'!J8)","v":8.3517499999999991}]
["60 - 80 kWh",{"$f":"'Inputs and Revenues'!$D$44","v":8.4003999999999995E-2},70,5.8802799999999991,5.8802799999999991,{"$f":"E9+'Inputs and Revenues'!$D$7","v":9.8802799999999991},{"$f":"IF(F9<'Inputs and Revenues'!$D$8,'Inputs and Revenues'!$D$8,'Single Bills'!F9)","v":9.8802799999999991},null,{"$f":"C9*'Inputs and Revenues'!D75","v":6.0924500000000004},{"$f":"I9+'Inputs and Revenues'!$D$7","v":10.092449999999999},{"$f":"IF(J9<'Inputs and Revenues'!$D$8,'Inputs and Revenues'!$D$8,'Single Bills'!J9)","v":10.092449999999999}]
["80 - 100 kWh",{"$f":"'Inputs and Revenues'!$D$44","v":8.4003999999999995E-2},90,7.5603599999999993,7.5603599999999993,{"$f":"E10+'Inputs and Revenues'!$D$7","v":11.560359999999999},{"$f":"IF(F10<'Inputs and Revenues'!$D$8,'Inputs and Revenues'!$D$8,'Single Bills'!F10)","v":11.560359999999999},null,{"$f":"C10*'Inputs and Revenues'!D76","v":7.8331499999999998},{"$f":"I10+'Inputs and Revenues'!$D$7","v":11.83315},{"$f":"IF(J10<'Inputs and Revenues'!$D$8,'Inputs and Revenues'!$D$8,'Single Bills'!J10)","v":11.83315}]
["100 - 200 kWh",{"$f":"'Inputs and Revenues'!D45","v":8.4003999999999995E-2},150,12.6006,12.6006,{"$f":"E11+'Inputs and Revenues'!$D$7","v":16.6006},{"$f":"IF(F11<'Inputs and Revenues'!$D$8,'Inputs and Revenues'!$D$8,'Single Bills'!F11)","v":16.6006},null,{"$f":"C11*'Inputs and Revenues'!D77","v":13.055250000000001},{"$f":"I11+'Inputs and Revenues'!$D$7","v":17.055250000000001},{"$f":"IF(J11<'Inputs and Revenues'!$D$8,'Inputs and Revenues'!$D$8,'Single Bills'!J11)","v":17.055250000000001}]
["200 - 300 kWh",{"$f":"'Inputs and Revenues'!D46","v":8.4003999999999995E-2},250,21.000999999999998,21.000999999999998,{"$f":"E12+'Inputs and Revenues'!$D$7","v":25.000999999999998},{"$f":"IF(F12<'Inputs and Revenues'!$D$8,'Inputs and Revenues'!$D$8,'Single Bills'!F12)","v":25.000999999999998},null,{"$f":"C12*'Inputs and Revenues'!D78","v":21.758749999999999},{"$f":"I12+'Inputs and Revenues'!$D$7","v":25.758749999999999},{"$f":"IF(J12<'Inputs and Revenues'!$D$8,'Inputs and Revenues'!$D$8,'Single Bills'!J12)","v":25.758749999999999}]
["300 - 400 kWh",{"$f":"'Inputs and Revenues'!D47","v":8.4003999999999995E-2},350,29.401399999999999,29.401399999999999,{"$f":"E13+'Inputs and Revenues'!$D$7","v":33.401399999999995},{"$f":"IF(F13<'Inputs and Revenues'!$D$8,'Inputs and Revenues'!$D$8,'Single Bills'!F13)","v":33.401399999999995},null,{"$f":"C13*'Inputs and Revenues'!D79","v":30.462250000000001},{"$f":"I13+'Inputs and Revenues'!$D$7","v":34.462249999999997},{"$f":"IF(J13<'Inputs and Revenues'!$D$8,'Inputs and Revenues'!$D$8,'Single Bills'!J13)","v":34.462249999999997}]
["400 - 500 kWh",{"$f":"'Inputs and Revenues'!D48","v":0.103481},450,39.749499999999983,39.749499999999983,{"$f":"E14+'Inputs and Revenues'!$D$7","v":43.749499999999983},{"$f":"IF(F14<'Inputs and Revenues'!$D$8,'Inputs and Revenues'!$D$8,'Single Bills'!F14)","v":43.749499999999983},null,{"$f":"C14*'Inputs and Revenues'!D80","v":39.165750000000003},{"$f":"I14+'Inputs and Revenues'!$D$7","v":43.165750000000003},{"$f":"IF(J14<'Inputs and Revenues'!$D$8,'Inputs and Revenues'!$D$8,'Single Bills'!J14)","v":43.165750000000003}]
["500 - 600 kWh",{"$f":"'Inputs and Revenues'!D49","v":0.103481},550,50.097599999999986,50.097599999999986,{"$f":"E15+'Inputs and Revenues'!$D$7","v":54.097599999999986},{"$f":"IF(F15<'Inputs and Revenues'!$D$8,'Inputs and Revenues'!$D$8,'Single Bills'!F15)","v":54.097599999999986},null,{"$f":"C15*'Inputs and Revenues'!D81","v":47.869250000000001},{"$f":"I15+'Inputs and Revenues'!$D$7","v":51.869250000000001},{"$f":"IF(J15<'Inputs and Revenues'!$D$8,'Inputs and Revenues'!$D$8,'Single Bills'!J15)","v":51.869250000000001}]
{"$rows_left_out":24}
{"sheet":"Reduced Usage Scenario","index":3,"n_rows":40,"n_cols":16,"rows_kept":40,"cut":false,"hidden":false,"merged":[[1,1,1,2],[3,6,3,7],[35,6,35,7],[37,14,37,15],[38,14,38,15],[36,14,36,15],[1,6,1,8],[1,10,1,12],[1,14,1,15]]}
[]
[null,"percentage usage drop:",null,20,"%",null,"May to September rates",null,null,null,"October to April rates",null,null,null,"revenues with decreased usage"]
[]
[null,null,null,null,null,null,"no minimum bill",null,"minimum bill",null,null,"no minimum bill","minimum bill",null,"no minimum bill","minimum bill"]
[null,"kWh range","assumed use within range (kWh)","energy charge per kWh ($)","decreased tailblock usage**",null,"energy charge*","energy charge + customer charge","minimum bill or energy charge + customer charge",null,"energy Charge","energy charge + customer charge","minimum bill or energy charge + customer charge",null,"revenues with no minimum bill","revenues with minimum bill"]
[null,"0 kWh",0,{"$f":"'Single Bills'!B5","v":8.4003999999999995E-2},{"$f":"C6","v":0},0,{"$f":"F6","v":0},{"$f":"G6+'Inputs and Revenues'!$D$7","v":4},{"$f":"IF(H6<'Inputs and Revenues'!$D$8,'Inputs and Revenues'!$D$8,H6)","v":7},null,{"$f":"C6*'Inputs and Revenues'!D71","v":0},{"$f":"K6+'Inputs and Revenues'!$D$7","v":4},{"$f":"IF(L6<'Inputs and Revenues'!$D$8,'Inputs and Revenues'!$D$8,L6)","v":7},null,{"$f":"'Inputs and Revenues'!D12*(((5/12)*H6)+((7/12)*L6))","v":182610.96159999978},{"$f":"'Inputs and Revenues'!D12*(((5/12)*I6)+((7/12)*'Reduced Usage Scenario'!M6))","v":319569.18279999966}]
[null,"0 - 20 kWh",10,{"$f":"'Single Bills'!B6","v":8.4003999999999995E-2},{"$f":"C7","v":10},0.8400399999999999,{"$f":"F7","v":0.8400399999999999},{"$f":"G7+'Inputs and Revenues'!$D$7","v":4.8400400000000001},{"$f":"IF(H7<'Inputs and Revenues'!$D$8,'Inputs and Revenues'!$D$8,H7)","v":7},null,{"$f":"C7*'Inputs and Revenues'!D72","v":0.87034999999999996},{"$f":"K7+'Inputs and Revenues'!$D$7","v":4.8703500000000002},{"$f":"IF(L7<'Inputs and Revenues'!$D$8,'Inputs and Revenues'!$D$8,L7)","v":7},null,{"$f":"'Inputs and Revenues'!D13*(((5/12)*H7)+((7/12)*L7))","v":256728.37075427672},{"$f":"'Inputs and Revenues'!D13*(((5/12)*I7)+((7/12)*'Reduced Usage Scenario'!M7))","v":369946.8653999989}]
[null,"20 - 40 kWh",30,{"$f":"'Single Bills'!B7","v":8.4003999999999995E-2},30,2.5201199999999995,2.5201199999999995,{"$f":"G8+'Inputs and Revenues'!$D$7","v":6.5201199999999995},{"$f":"IF(H8<'Inputs and Revenues'!$D$8,'Inputs and Revenues'!$D$8,H8)","v":7},null,{"$f":"C8*'Inputs and Revenues'!D73","v":2.6110500000000001},{"$f":"K8+'Inputs and Revenues'!$D$7","v":6.6110500000000005},{"$f":"IF(L8<'Inputs and Revenues'!$D$8,'Inputs and Revenues'!$D$8,L8)","v":7},null,{"$f":"'Inputs and Revenues'!D14*(((5/12)*H8)+((7/12)*L8))","v":293148.5714242254},{"$f":"'Inputs and Revenues'!D14*(((5/12)*I8)+((7/12)*'Reduced Usage Scenario'!M8))","v":312184.58389999915}]
[null,"40 - 60 kWh",50,{"$f":"'Single Bills'!B8","v":8.4003999999999995E-2},50,4.2001999999999997,4.2001999999999997,{"$f":"G9+'Inputs and Revenues'!$D$7","v":8.2001999999999988},{"$f":"IF(H9<'Inputs and Revenues'!$D$8,'Inputs and Revenues'!$D$8,H9)","v":8.2001999999999988},null,{"$f":"C9*'Inputs and Revenues'!D74","v":4.35175},{"$f":"K9+'Inputs and Revenues'!$D$7","v":8.3517499999999991},{"$f":"IF(L9<'Inputs and Revenues'!$D$8,'Inputs and Revenues'!$D$8,L9)","v":8.3517499999999991},null,{"$f":"'Inputs and Revenues'!D15*(((5/12)*H9)+((7/12)*L9))","v":425403.91327953414},{"$f":"'Inputs and Revenues'!D15*(((5/12)*I9)+((7/12)*'Reduced Usage Scenario'!M9))","v":425403.91327953414}]
[null,"60 - 80 kWh",70,{"$f":"'Single Bills'!B9","v":8.4003999999999995E-2},70,5.8802799999999991,5.8802799999999991,{"$f":"G10+'Inputs and Revenues'!$D$7","v":9.8802799999999991},{"$f":"IF(H10<'Inputs and Revenues'!$D$8,'Inputs and Revenues'!$D$8,H10)","v":9.8802799999999991},null,{"$f":"C10*'Inputs and Revenues'!D75","v":6.0924500000000004},{"$f":"K10+'Inputs and Revenues'!$D$7","v":10.092449999999999},{"$f":"IF(L10<'Inputs and Revenues'!$D$8,'Inputs and Revenues'!$D$8,L10)","v":10.092449999999999},null,{"$f":"'Inputs and Revenues'!D16*(((5/12)*H10)+((7/12)*L10))","v":532446.47885155573},{"$f":"'Inputs and Revenues'!D16*(((5/12)*I10)+((7/12)*'Reduced Usage Scenario'!M10))","v":532446.47885155573}]
[null,"80 - 100 kWh",90,{"$f":"'Single Bills'!B10","v":8.4003999999999995E-2},90,7.5603599999999993,7.5603599999999993,{"$f":"G11+'Inputs and Revenues'!$D$7","v":11.560359999999999},{"$f":"IF(H11<'Inputs and Revenues'!$D$8,'Inputs and Revenues'!$D$8,H11)","v":11.560359999999999},null,{"$f":"C11*'Inputs and Revenues'!D76","v":7.8331499999999998},{"$f":"K11+'Inputs and Revenues'!$D$7","v":11.83315},{"$f":"IF(L11<'Inputs and Revenues'!$D$8,'Inputs and Revenues'!$D$8,L11)","v":11.83315},null,{"$f":"'Inputs and Revenues'!D17*(((5/12)*H11)+((7/12)*L11))","v":691210.34508986119},{"$f":"'Inputs and Revenues'!D17*(((5/12)*I11)+((7/12)*'Reduced Usage Scenario'!M11))","v":691210.34508986119}]
[null,"100 - 200 kWh",150,{"$f":"'Single Bills'!B11","v":8.4003999999999995E-2},150,12.6006,12.6006,{"$f":"G12+'Inputs and Revenues'!$D$7","v":16.6006},{"$f":"IF(H12<'Inputs and Revenues'!$D$8,'Inputs and Revenues'!$D$8,H12)","v":16.6006},null,{"$f":"C12*'Inputs and Revenues'!D77","v":13.055250000000001},{"$f":"K12+'Inputs and Revenues'!$D$7","v":17.055250000000001},{"$f":"IF(L12<'Inputs and Revenues'!$D$8,'Inputs and Revenues'!$D$8,L12)","v":17.055250000000001},null,{"$f":"'Inputs and Revenues'!D18*(((5/12)*H12)+((7/12)*L12))","v":6528911.3124052342},{"$f":"'Inputs and Revenues'!D18*(((5/12)*I12)+((7/12)*'Reduced Usage Scenario'!M12))","v":6528911.3124052342}]
[null,"200 - 300 kWh",250,{"$f":"'Single Bills'!B12","v":8.4003999999999995E-2},250,21.000999999999998,21.000999999999998,{"$f":"G13+'Inputs and Revenues'!$D$7","v":25.000999999999998},{"$f":"IF(H13<'Inputs and Revenues'!$D$8,'Inputs and Revenues'!$D$8,H13)","v":25.000999999999998},null,{"$f":"C13*'Inputs and Revenues'!D78","v":21.758749999999999},{"$f":"K13+'Inputs and Revenues'!$D$7","v":25.758749999999999},{"$f":"IF(L13<'Inputs and Revenues'!$D$8,'Inputs and Revenues'!$D$8,L13)","v":25.758749999999999},null,{"$f":"'Inputs and Revenues'!D19*(((5/12)*H13)+((7/12)*L13))","v":15183088.171378223},{"$f":"'Inputs and Revenues'!D19*(((5/12)*I13)+((7/12)*'Reduced Usage Scenario'!M13))","v":15183088.171378223}]
[null,"300 - 400 kWh",350,{"$f":"'Single Bills'!B13","v":8.4003999999999995E-2},350,29.401399999999999,29.401399999999999,{"$f":"G14+'Inputs and Revenues'!$D$7","v":33.401399999999995},{"$f":"IF(H14<'Inputs and Revenues'!$D$8,'Inputs and Revenues'!$D$8,H14)","v":33.401399999999995},null,{"$f":"C14*'Inputs and Revenues'!D79","v":30.462250000000001},{"$f":"K14+'Inputs and Revenues'!$D$7","v":34.462249999999997},{"$f":"IF(L14<'Inputs and Revenues'!$D$8,'Inputs and Revenues'!$D$8,L14)","v":34.462249999999997},null,{"$f":"'Inputs and Revenues'!D20*(((5/12)*H14)+((7/12)*L14))","v":25790262.499656204},{"$f":"'Inputs and Revenues'!D20*(((5/12)*I14)+((7/12)*'Reduced Usage Scenario'!M14))","v":25790262.499656204}]
[null,"400 - 500 kWh",450,{"$f":"D14","v":8.4003999999999995E-2},{"$f":"C15*(1-($D$2/100))","v":360},35.533691999999995,35.533691999999995,{"$f":"G15+'Inputs and Revenues'!$D$7","v":39.533691999999995},{"$f":"IF(H15<'Inputs and Revenues'!$D$8,'Inputs and Revenues'!$D$8,H15)","v":39.533691999999995},null,{"$f":"C15*'Inputs and Revenues'!D80","v":39.165750000000003},{"$f":"K15+'Inputs and Revenues'!$D$7","v":43.165750000000003},{"$f":"IF(L15<'Inputs and Revenues'!$D$8,'Inputs and Revenues'!$D$8,L15)","v":43.165750000000003},null,{"$f":"'Inputs and Revenues'!D21*(((5/12)*H15)+((7/12)*L15))","v":34981212.571025044},{"$f":"'Inputs and Revenues'!D21*(((5/12)*I15)+((7/12)*'Reduced Usage Scenario'!M15))","v":34981212.571025044}]
{"$rows_left_out":26}
{"sheet":"Data","index":4,"n_rows":35,"n_cols":18,"rows_kept":35,"cut":false,"hidden":false,"merged":[[1,0,1,3]]}
[]
["2010 - 2011 bill frequency data (OCS 3.37)"]
[]
[null,"kWh range",201007,201008,201009,201010,201011,201012,201101,201102,201103,201104,201105,201106,null,"Total Bills",null,"Ave # of bills"]
[null,0,3189.7983999999901,3151.3622,3079.6812,2987.7826,3549.5812999999898,4305.4961000000103,4497.8545999999897,4549.4084999999905,4544.3154999999897,4429.0237999999899,4083.5346,3284.9016000000001,null,{"$f":"SUM(C5:N5)","v":45652.740399999944},null,{"$f":"SUM(C5:N5)/12","v":3804.3950333333287}]
[null,20,4800.3055999999797,4562.8441999999905,4614.8871999999901,4974.7452999999896,4892.1333999999797,3883.7174999999902,3721.9580999999898,3722.7864999999902,3951.8289999999902,4291.2417999999898,4637.0117999999802,4796.0917999999801,null,52849.552199999838,null,{"$f":"SUM(C6:N6)/12","v":4404.1293499999865}]
[null,40,3547.3580999999999,2947.7055999999998,3286.0281999999902,3943.7159999999899,4622.0914999999904,3424.2223999999901,2972.8293999999901,3063.9063999999898,3551.0521999999901,4136.01079999997,4538.9199999999801,4563.9570999999896,null,44597.797699999872,null,3716.4831416666561]
[null,60,4172.1245999999901,3344.4279999999899,3830.55059999998,4820.0253999999904,5108.9114999999902,3647.58679999999,3034.8719999999898,3401.8679999999699,4131.5289999999804,4818.89929999998,5489.5389999999898,5523.6167000000096,null,51323.950899999851,null,4276.9959083333206]
[null,80,4337.4089000000104,3717.2291999999802,4207.1896999999899,5258.2756999999801,5008.2781999999997,3740.8329999999901,3250.9357999999902,3721.33339999998,4284.8228999999801,4887.0816999999797,5251.09669999998,5558.6295,null,53223.114699999867,null,4435.2595583333223]
[null,100,4852.8204999999898,3885.6283999999901,4651.2047999999904,5876.8580999999904,5316.0843000000104,4055.00719999999,3717.2513999999901,4288.6508999999696,4814.1314999999904,5213.4229999999798,5974.3712999999998,6334.1396000000104,null,58979.570999999894,null,4914.9642499999909]
[null,200,28143.138699999599,21891.9656,29012.0612000002,39248.931000000499,36517.158200000304,24842.708700000301,23741.578099999901,28701.111500000799,33290.793600000798,37122.0106000007,42198.9699000002,42398.780500000103,null,387109.2076000034,null,32259.100633333615]
[null,300,38739.857699998996,27702.423599999998,41267.122800000099,58793.617900000303,59246.836300000701,38095.428100000201,35812.608299999702,46782.889400000298,54851.392900000203,61310.695899999897,68264.535699999804,65881.235000000393,null,596748.64360000053,null,49729.05363333338]
[null,400,47694.540699998601,34094.354399999902,51881.4165000004,71208.084900000002,75347.626500000406,50781.457800000098,48115.986499999897,63348.834500000201,72046.755900000106,78746.588600000003,84806.178199999602,80014.265200000198,null,758086.08969999943,null,63173.840808333283]
[null,500,52868.5944999985,40021.908499999998,57762.437900000201,76535.030599999795,82902.401500000095,59147.660000000098,56684.578600000401,73228.478499999997,80062.478399999905,85932.5145999995,90365.920199999702,84324.809700000202,null,839836.81299999845,null,69986.401083333199]
[null,600,54321.736799997998,42678.942100000102,59673.960700000098,72711.906800000099,80750.401600000303,63858.412700000103,60177.727900000398,74645.768499999802,79181.313999999693,82193.325599999895,83028.122299999595,79664.639200000194,null,832886.25819999818,null,69407.188183333186]
{"$rows_left_out":21}
{"sheet":"Assumptions","index":5,"n_rows":25,"n_cols":10,"rows_kept":25,"cut":false,"hidden":false,"merged":[[20,1,20,10],[0,0,0,10],[2,0,2,7],[4,0,4,7],[5,1,5,10],[19,1,19,7]]}
["Assumptions:"]
[]
["Assumed kWh usage in \"Single Bills\" tab to be the midpoint of the kWh range."]
[]
["Assumed the average kWh usage for the \"Over 5000kWh\" range as follows:"]
[null,"Monthly usage numbers were derived by taking a simple average of the kWh used by the number of bills for a specific month, according to the bill frequency data from OCS data request 3.37:"]
[null,null,"month ","average kWh"]
[null,null,"July",{"$f":"'[1]Sch 1'!D37/'[1]Sch 1'!C37","v":7305.1209854328754}]
[null,null,"August",{"$f":"'[1]Sch 1'!D66/'[1]Sch 1'!C66","v":7145.5993960537771}]
[null,null,"Sept",{"$f":"'[1]Sch 1'!D95/'[1]Sch 1'!C95","v":7635.6999384452274}]
[null,null,"Oct",{"$f":"'[1]Sch 1'!D124/'[1]Sch 1'!C124","v":7916.9765630448783}]
[null,null,"Nov",{"$f":"'[1]Sch 1'!D153/'[1]Sch 1'!C153","v":8129.3101146551071}]
[null,null,"Dec",{"$f":"'[1]Sch 1'!D182/'[1]Sch 1'!C182","v":8196.9289972665265}]
[null,null,"Jan",{"$f":"'[1]Sch 1'!D211/'[1]Sch 1'!C211","v":8097.4945655827714}]
[null,null,"Feb",{"$f":"'[1]Sch 1'!D240/'[1]Sch 1'!C240","v":8264.3429528518336}]
{"$rows_left_out":11}
{"sheet":"Sheet1","index":6,"n_rows":0,"n_cols":0,"rows_kept":0,"cut":false,"hidden":false,"merged":[]}