{"text_format":"1","workbook":"xlsx","n_sheets":4,"sheets":["SAPBEXqueries","SAPBEXfilters","Page B7 ITC Amortization","Master Data"],"not_rendered":{"charts":0,"images":3,"macros":1,"external_links":0,"defined_names":138,"comments":0,"pivot_tables":0},"unopened":[],"bounds":{"document_bytes":16777216,"sheet_cells":100000,"rows_first":2000,"rows_last":500,"rows_between":2000,"halvings":0,"cell_chars":16384,"cell_head_chars":4096},"cells_cut":0,"cells_raw":0,"read":"whole","date_system":"1900"}

{"sheet":"SAPBEXqueries","index":0,"n_rows":171,"n_cols":233,"rows_kept":171,"cut":false,"hidden":true,"merged":[]}
[9]
[3,null,null,null,null,null,null,null,null,null,null,null,null,null,null,null,null,null,null,null,null,null,null,null,null,null,null,null,null,null,39,null,null,null,null,null,null,null,null,null,null,null,null,null,null,null,null,null,null,null,null,null,null,null,null,null,null,null,null,null,null,null,null,null,null,null,null,null,null,null,null,null,null,null,null,null,null,null,null,null,null,null,null,null,null,null,null,null,null,null,43,null,null,null,null,null,null,null,null,null,null,null,null,null,null,null,null,null,null,null,168,null,null,null,null,null,null,null,null,null,null,null,null,null,null,null,null,null,null,null,78,null,null,null,null,null,null,null,null,null,null,null,null,null,null,null,null,null,null,null,0,null,null,null,null,null,null,null,null,null,null,null,null,null,null,null,null,null,null,null,null,null,null,null,null,null,null,null,null,null,43,null,null,null,null,null,null,null,null,null,null,null,null,null,null,null,null,null,null,null,null,null,null,null,null,null,null,null,null,null,null,null,null,null,null,null,null,null,null,null,null,null,null,null,null,null,null,null,null,null,97]
[24,null,null,null,null,null,null,null,null,null,null,null,null,null,null,null,null,null,null,null,null,null,null,null,null,null,null,null,null,null,59,null,null,null,null,null,null,null,null,null,null,null,null,null,null,null,null,null,null,null,null,null,null,null,null,null,null,null,null,null,null,null,null,null,null,null,null,null,null,null,null,null,null,null,null,null,null,null,null,null,null,null,null,null,null,null,null,null,null,null,13,null,null,null,null,null,null,null,null,null,null,null,null,null,null,null,null,null,null,null,15,null,null,null,null,null,null,null,null,null,null,null,null,null,null,null,null,null,null,null,13,null,null,null,null,null,null,null,null,null,null,null,null,null,null,null,null,null,null,null,11,null,null,null,null,null,null,null,null,null,null,null,null,null,null,null,null,null,null,null,null,null,null,null,null,null,null,null,null,null,21,null,null,null,null,null,null,null,null,null,null,null,null,null,null,null,null,null,null,null,null,null,null,null,null,null,null,null,null,null,null,null,null,null,null,null,null,null,null,null,null,null,null,null,null,null,null,null,null,null,2]
[null,0,"45B2RPXJGDNDOCAJLTHPCMAYP",true,true,"SAPBEXq0002",2,6,false,null,null,true,false,null,true,false,1,null,5,true,false,null,null,false,false,false,null,null,null,null,6,"45GNYLS3V6HRAXCFZ22SH6BK1","FERC Regional Assignment","","X","","0001","","Total","","","","","U","","00","","","","","K","45GNYLS3V6HRAXCFZ22SH6BK1","A","","","","","","","","","00000000","0000","","0","","1","","","0","0","0","0","0","","","","","","45GNYLS3V6HRAXCFZ22SH6BK1","","","","","","","0000","","","",6,"45BYHSJ2JI4710LQ5JOBPNI81","45BYHSQR2GPWJN56BDQNZPGXT","Actuals","0001","","S","","L","","","","","",null,null,null,null,null,null,6,"ZISJARS01___F00006","0BAL_FLAG","Balance Sheet Acct","0000","X","2","0","0","","","","","0000","","",null,null,null,null,6,"45BYHSQR2GPWJN56BDQNZPGXT","45GNYLZSE53GTJVW4W54R8A9T","3","0","","","","01","X","0","0","","",null,null,null,null,null,null,null,null,null,null,null,null,null,null,null,null,null,null,null,null,null,null,null,null,null,null,null,null,null,null,null,null,null,null,null,null,6,"0P_BVER1","1","P","I","EQ","000","0","","","Actuals / Detailed Plan","40","","0","","0","","20","","","ZISJARS01___F00008","",null,null,null,null,null,null,null,null,null,null,null,null,null,null,null,null,null,null,null,null,null,null,null,null,null,null,null,null,6,"0000000107","45BYHPJJ61O9S91FVURJSW075"]
[null,0,"45B2RPXJGDNDOCAJLTHPCMAYP",true,true,"SAPBEXq0001",2,6,false,null,null,true,false,null,true,false,1,null,5,true,false,null,null,false,false,false,null,null,null,null,6,"ZISJARS01___F00006","Account Number","X","","","0002","","","","","","","U","0","03","","","","00000000","K","ZISJARS01___F00006","A","","","H","","","","","","00000000","0000","","0","","","","2","1","1","1","0","0","","","","","0","45BYHQ6KQXHEC4NSDCYKN1WCH","","","","","","","0000","","","",6,"45GNYLS3V6HRAXCFZ22SH6BK1","45GNYLZSE53GTJVW4W54R8A9T","Total","0001","","S","","L","","","","","",null,null,null,null,null,null,6,"ZISJARS01___F00006","0CSTEL_FLAG","Ind.: Cost Element","0000","X","2","0","0","","","","","0000","","",null,null,null,null,6,"45BYHSQR2GPWJN56BDQNZPGXT","45GNYM7GX3P6C6FCAQ7H1A8ZL","3","0","","","","01","X","0","0","","",null,null,null,null,null,null,null,null,null,null,null,null,null,null,null,null,null,null,null,null,null,null,null,null,null,null,null,null,null,null,null,null,null,null,null,null,6,"ZSFRCACT","1","S","","","","","","","","0","","0","","0","","20","","","ZISJARS01___F00001","",null,null,null,null,null,null,null,null,null,null,null,null,null,null,null,null,null,null,null,null,null,null,null,null,null,null,null,null,6,"0000000100",""]
[null,0,"45BYHTT5P9QG4RUF4K2DDZAIP",true,true,"SAPBEXq0003",2,6,false,null,null,true,false,null,true,false,1,null,5,true,false,null,null,false,false,false,null,null,null,null,6,"ZISJARS01___F00029","Allocation Version","X","","","0003","","","","","","","U","1","03","","","","00000000","S","ZISJARS01___F00029","A","","","H","","","","","","00000000","0000","","0","","","","2","1","1","1","0","0","","","","","0","45BYHQE99W33UR78J70WX3V29","","","","","","","0000","","","",6,"45BYHSJ2JI4710LQ5JOBPNI81","45BYHSYFLFBM29OMH7T09RFNL"," Actuals / Detailed Plan","0002","","S","","L","","","","","",null,null,null,null,null,null,6,"ZISJARS01___F00006","0GLACC_FLAG","G/L account","0000","X","2","0","0","","","","","0000","","",null,null,null,null,6,"45BYHSQR2GPWJN56BDQNZPGXT","45GNYMF5G2AVUSYSGK9TBC7PD","3","0","","","","01","X","0","0","","",null,null,null,null,null,null,null,null,null,null,null,null,null,null,null,null,null,null,null,null,null,null,null,null,null,null,null,null,null,null,null,null,null,null,null,null,6,"ZJRSCLMN","1","P","I","EQ","201106","06/2011","","","JUN 2011","40","","0","","0","","20","","","ZISJARS01___F00025","",null,null,null,null,null,null,null,null,null,null,null,null,null,null,null,null,null,null,null,null,null,null,null,null,null,null,null,null,6,"0000000101",""]
[null,null,null,null,null,null,null,null,null,null,null,null,null,null,null,null,null,null,null,null,null,null,null,null,null,false,null,null,null,null,6,"ZISJARS01___F00014","Calendar Year/Month","X","","","0004","","","","","","","U","2","03","","","","00000000","K","ZISJARS01___F00014","A","","","H","","","","","","00000000","0000","","0","","","","2","1","1","1","0","0","","","","","0","45BYHQLXSUOTDDQOP13975TS1","","","","","","","0000","","","",6,"45GNYLS3V6HRAXCFZ22SH6BK1","45GNYM7GX3P6C6FCAQ7H1A8ZL","Calif","0002","Y","S","","L","","","","","",null,null,null,null,null,null,6,"ZISJARS01___F00006","0LOGSYS","Source System","0000","X","1","0","0","","","","","0000","","",null,null,null,null,6,"45BYHSQR2GPWJN56BDQNZPGXT","45GNYMMTZ0WLDFI8MEC5LE6F5","3","0","","","","01","X","0","0","","",null,null,null,null,null,null,null,null,null,null,null,null,null,null,null,null,null,null,null,null,null,null,null,null,null,null,null,null,null,null,null,null,null,null,null,null,6,"ZPMETHOD","1","P","I","EQ","03","3","","","Factor 2010 Protocol","40","","0","","0","","20","","","ZISJARS01___F00024","",null,null,null,null,null,null,null,null,null,null,null,null,null,null,null,null,null,null,null,null,null,null,null,null,null,null,null,null,6,"0000000104","1"]
[null,null,null,null,null,null,null,null,null,null,null,null,null,null,null,null,null,null,null,null,null,null,null,null,null,false,null,null,null,null,6,"ZISJARS01___F00011","Company code","X","","","0005","","","","","","","U","0","03","","","","00000000","K","ZISJARS01___F00011","A","","","H","","","","","","00000000","0000","","0","","","","2","1","1","1","0","0","","","","","0","45BYHQTMBTAIW0A4UV5LH7SHT","","","","","","","0000","","","",6,"45BYHSJ2JI4710LQ5JOBPNI81","45BYHT644DXBKW82N1VCJTEDD","Var $","0003","","F","","L","","","","","",null,null,null,null,null,null,6,"ZISJARS01___F00006","0SEM_POSIT","Planning Item","0000","X","1","0","0","","","","","0000","","",null,null,null,null,6,"45BYHSQR2GPWJN56BDQNZPGXT","45GNYMUIHZIAW21OS8EHVG54X","3","0","","","","01","X","0","0","","",null,null,null,null,null,null,null,null,null,null,null,null,null,null,null,null,null,null,null,null,null,null,null,null,null,null,null,null,null,null,null,null,null,null,null,null,6,"ZSVERSN","1","P","I","EQ","01","1","","","Average","40","","0","","0","","20","","","ZISJARS01___F00029","",null,null,null,null,null,null,null,null,null,null,null,null,null,null,null,null,null,null,null,null,null,null,null,null,null,null,null,null,6,"0000000103",""]
[null,null,null,null,null,null,null,null,null,null,null,null,null,null,null,null,null,null,null,null,null,null,null,null,null,null,null,null,null,null,6,"ZISJARS01___F00002","FERC Location Code","X","","","0006","","","","","","","U","1","03","","","","00000000","K","ZISJARS01___F00002","A","","","H","","","","","","00000000","0000","","0","","","","2","1","1","1","0","0","","","","","0","45BYHR1AURW8EMTL0P7XR9R7L","","","","","","","0000","","","",6,"45GNYLS3V6HRAXCFZ22SH6BK1","45GNYMF5G2AVUSYSGK9TBC7PD","Oregon","0003","Y","S","","L","","","","","",null,null,null,null,null,null,6,"ZISJARS01___F00029","ZJRSRBCD","JARS Rate Base Code","0000","X","2","0","0","","","","","0000","","",null,null,null,null,6,"45BYHSQR2GPWJN56BDQNZPGXT","45GNYN270Y40EOL4Y2GU5I3UP","3","0","","","","01","X","0","0","","",null,null,null,null,null,null,null,null,null,null,null,null,null,null,null,null,null,null,null,null,null,null,null,null,null,null,null,null,null,null,null,null,null,null,null,null,6,"ZSFACTOR","1","S","E","EQ","NUTIL","NUTIL","","","","40","","0","","0","","20","","","ZISJARS01___F00032","",null,null,null,null,null,null,null,null,null,null,null,null,null,null,null,null,null,null,null,null,null,null,null,null,null,null,null,null,6,"0000000102","3"]
[null,null,null,null,null,null,null,null,null,null,null,null,null,null,null,null,null,null,null,null,null,null,null,null,null,null,null,null,null,null,6,"ZISJARS01___F00013","FERC Merger Code","X","","","0007","","","","","","","U","1","03","","","","00000000","K","ZISJARS01___F00013","A","","","H","","","","","","00000000","0000","","0","","","","2","1","1","1","0","0","","","","","0","45BYHR8ZDQHXX9D16JAA1BPXD","","","","","","","0000","","","",6,"45BYHSJ2JI4710LQ5JOBPNI81","45BYHTDSNCJ13IRISVXOTVD35","Var %","0004","","F","","L","","","","","",null,null,null,null,null,null,6,"ZISJARS01___F00011","0CHRT_ACCTS","Chart of accounts","0000","X","0","0","0","","","","","0000","","",null,null,null,null,6,"45BYHSQR2GPWJN56BDQNZPGXT","45GNYN9VJWPPXB4L3WJ6FK2KH","3","0","","","","01","X","0","0","","",null,null,null,null,null,null,null,null,null,null,null,null,null,null,null,null,null,null,null,null,null,null,null,null,null,null,null,null,null,null,null,null,null,null,null,null,6,"ZS_JPG","1","S","","","","","","","","0","","0","","0","","20","","","ZISJARS01___F00035","",null,null,null,null,null,null,null,null,null,null,null,null,null,null,null,null,null,null,null,null,null,null,null,null,null,null,null,null,6,"0000000108","X"]
{"$rows_left_out":162}
{"sheet":"SAPBEXfilters","index":1,"n_rows":8,"n_cols":237,"rows_kept":8,"cut":false,"hidden":true,"merged":[]}
[]
[null,null,null,null,null,null,null,null,null,null,null,null,null,null,null,null,null,null,null,null,null,null,null,null,null,null,null,null,null,null,null,null,null,null,null,null,null,null,null,null,null,null,null,null,null,null,null,null,null,null,null,null,null,null,null,null,null,null,null,null,null,null,null,null,null,null,null,null,null,null,null,null,null,null,null,null,null,null,null,null,null,null,null,null,null,null,null,null,null,null,null,null,null,null,null,null,null,null,null,null,0,null,null,null,null,null,null,null,null,null,null,null,null,null,null,null,null,null,null,null,null,null,null,null,null,null,null,null,null,null,null,null,null,null,null,null,null,null,null,null,null,null,null,null,null,null,null,null,null,null,null,null,null,null,null,5,null,null,null,null,null,null,null,null,null,null,null,null,null,null,null,null,null,null,null,null,null,null,null,null,null,null,null,null,null,null,null,null,null,null,null,null,null,null,null,null,null,null,null,null,null,null,null,null,null,5]
[null,null,null,null,null,null,null,null,null,null,null,null,null,null,null,null,null,null,null,null,null,null,null,null,null,null,null,null,null,null,null,null,null,null,null,null,null,null,null,null,null,null,null,null,null,null,null,null,null,null,null,null,null,null,null,null,null,null,null,null,null,null,null,null,null,null,null,null,null,null,null,null,null,null,null,null,null,null,null,null,null,null,null,null,null,null,null,null,null,null,null,null,null,null,null,null,null,null,null,null,8,null,null,null,null,null,null,null,null,null,null,null,null,null,null,null,null,null,null,null,null,null,null,null,null,null,null,null,null,null,null,null,null,null,null,null,null,null,null,null,null,null,null,null,null,null,null,null,null,null,null,null,null,null,null,12,null,null,null,null,null,null,null,null,null,null,null,null,null,null,null,null,null,null,null,null,null,null,null,null,null,null,null,null,null,null,null,null,null,null,null,null,null,null,null,null,null,null,null,null,null,null,null,null,null,31]
[null,null,null,null,null,null,null,null,null,null,null,null,null,null,null,null,null,null,null,null,null,null,null,null,null,null,null,null,null,null,null,null,null,null,null,null,null,null,null,null,null,null,null,null,null,null,null,null,null,null,null,null,null,null,null,null,null,null,null,null,null,null,null,null,null,null,null,null,null,null,null,null,null,null,null,null,null,null,null,null,null,null,null,null,null,null,null,null,null,null,null,null,null,null,null,null,null,null,null,null,null,null,null,null,null,null,null,null,null,null,null,null,null,null,null,null,null,null,null,null,null,null,null,null,null,null,null,null,null,null,null,null,null,null,null,null,null,null,null,null,null,null,null,null,null,null,null,null,null,null,null,null,null,null,null,6,"4V9ICO8973SUBL1K6M4157JDD","","X","3","0","ZISJARS01___F00035","","","0","","","",null,null,null,null,null,null,null,null,null,null,null,null,null,null,null,null,null,null,null,null,null,null,null,null,null,null,null,null,null,null,null,null,null,null,null,null,null,6,"4V9ICO8973SUBL1K6M4157JDD","","","0001","0001","0","0000","I","EQ","ITCE","","ITCE","","1","","0","","","","","","","0","","","0","","0","","","00"]
[null,null,null,null,null,null,null,null,null,null,null,null,null,null,null,null,null,null,null,null,null,null,null,null,null,null,null,null,null,null,null,null,null,null,null,null,null,null,null,null,null,null,null,null,null,null,null,null,null,null,null,null,null,null,null,null,null,null,null,null,null,null,null,null,null,null,null,null,null,null,null,null,null,null,null,null,null,null,null,null,null,null,null,null,null,null,null,null,null,null,null,null,null,null,null,null,null,null,null,null,null,null,null,null,null,null,null,null,null,null,null,null,null,null,null,null,null,null,null,null,null,null,null,null,null,null,null,null,null,null,null,null,null,null,null,null,null,null,null,null,null,null,null,null,null,null,null,null,null,null,null,null,null,null,null,4,"4V9ICZBOL35P854WM1HRO1OLT","","X","3","0","ZISJARS01___F00008","","","0","","","",null,null,null,null,null,null,null,null,null,null,null,null,null,null,null,null,null,null,null,null,null,null,null,null,null,null,null,null,null,null,null,null,null,null,null,null,null,4,"4V9ICZBOL35P854WM1HRO1OLT","","","0001","0001","0","0000","I","EQ","001","","1","","1","","0","","Budget  (Original)","","","","","0","","","0","","0","","","00"]
[null,null,null,null,null,null,null,null,null,null,null,null,null,null,null,null,null,null,null,null,null,null,null,null,null,null,null,null,null,null,null,null,null,null,null,null,null,null,null,null,null,null,null,null,null,null,null,null,null,null,null,null,null,null,null,null,null,null,null,null,null,null,null,null,null,null,null,null,null,null,null,null,null,null,null,null,null,null,null,null,null,null,null,null,null,null,null,null,null,null,null,null,null,null,null,null,null,null,null,null,null,null,null,null,null,null,null,null,null,null,null,null,null,null,null,null,null,null,null,null,null,null,null,null,null,null,null,null,null,null,null,null,null,null,null,null,null,null,null,null,null,null,null,null,null,null,null,null,null,null,null,null,null,null,null,4,"4V9ICZJD41REQROCRVK3Y3NBL","","X","3","0","ZISJARS01___F00035","","","0","","","",null,null,null,null,null,null,null,null,null,null,null,null,null,null,null,null,null,null,null,null,null,null,null,null,null,null,null,null,null,null,null,null,null,null,null,null,null,4,"4V9ICZJD41REQROCRVK3Y3NBL","","","0001","0001","0","0000","I","EQ","ITCE","","ITCE","","1","","0","","","","","","","0","","","0","","0","","","00"]
[null,null,null,null,null,null,null,null,null,null,null,null,null,null,null,null,null,null,null,null,null,null,null,null,null,null,null,null,null,null,null,null,null,null,null,null,null,null,null,null,null,null,null,null,null,null,null,null,null,null,null,null,null,null,null,null,null,null,null,null,null,null,null,null,null,null,null,null,null,null,null,null,null,null,null,null,null,null,null,null,null,null,null,null,null,null,null,null,null,null,null,null,null,null,null,null,null,null,null,null,null,null,null,null,null,null,null,null,null,null,null,null,null,null,null,null,null,null,null,null,null,null,null,null,null,null,null,null,null,null,null,null,null,null,null,null,null,null,null,null,null,null,null,null,null,null,null,null,null,null,null,null,null,null,null,5,"4V9ICTKAD4VK98JS8HQK4KN9T","","X","3","0","ZISJARS01___F00008","","","0","","","",null,null,null,null,null,null,null,null,null,null,null,null,null,null,null,null,null,null,null,null,null,null,null,null,null,null,null,null,null,null,null,null,null,null,null,null,null,5,"4V9ICTKAD4VK98JS8HQK4KN9T","","","0001","0001","0","0000","I","EQ","000","","0","","1","","0","","Actuals / Detailed Plan","","","","","0","","","0","","0","","","00"]
[null,null,null,null,null,null,null,null,null,null,null,null,null,null,null,null,null,null,null,null,null,null,null,null,null,null,null,null,null,null,null,null,null,null,null,null,null,null,null,null,null,null,null,null,null,null,null,null,null,null,null,null,null,null,null,null,null,null,null,null,null,null,null,null,null,null,null,null,null,null,null,null,null,null,null,null,null,null,null,null,null,null,null,null,null,null,null,null,null,null,null,null,null,null,null,null,null,null,null,null,null,null,null,null,null,null,null,null,null,null,null,null,null,null,null,null,null,null,null,null,null,null,null,null,null,null,null,null,null,null,null,null,null,null,null,null,null,null,null,null,null,null,null,null,null,null,null,null,null,null,null,null,null,null,null,5,"4V9ICTRYW3H9RV38EBSWEMLZL","","X","3","0","ZISJARS01___F00035","","","0","","","",null,null,null,null,null,null,null,null,null,null,null,null,null,null,null,null,null,null,null,null,null,null,null,null,null,null,null,null,null,null,null,null,null,null,null,null,null,5,"4V9ICTRYW3H9RV38EBSWEMLZL","","","0001","0001","0","0000","I","EQ","ITCE","","ITCE","","1","","0","","","","","","","0","","","0","","0","","","00"]

{"sheet":"Page B7 ITC Amortization","index":2,"n_rows":39,"n_cols":19,"rows_kept":39,"cut":false,"hidden":false,"merged":[]}
[]
[]
[]
[]
[{"$f":"VLOOKUP($B$19,MD_High1:MD_Low1,4,FALSE) & \" (Actuals)\"","v":"Investment Tax Credit Amortization (Actuals)"}]
[{"$f":"+\"Twelve Months Ending - \" & IF(LEN($B$27)>7,(VLOOKUP(MID($B$27,10,2),'Master Data'!$F$2:$G$13,2,FALSE) & \" \" & MID($B$27,13,4)),(VLOOKUP(MID($B$27,1,2),'Master Data'!$F$2:$G$13,2,FALSE) & \" \" & MID($B$27,4,4)))","v":"Twelve Months Ending - June 2013"}]
[{"$f":"+\"Allocation Method - \" &$B$30","v":"Allocation Method - Factor 2010 Protocol"}]
["(Allocated in Thousands)"]
[]
["Current User","P33583","Key Date","9/26/2013"]
{"$rows_left_out":30}
{"sheet":"Master Data","index":3,"n_rows":36,"n_cols":38,"rows_kept":36,"cut":false,"hidden":true,"merged":[]}
[null,"Actual","Plan","Name",null,null,null,null,"PGC","Low","High","SGC","Desc",null,"PGC","Low","High","SGC","Desc",null,"PGC","Low","High","SGC","Desc",null,"PGC","Low","High","SGC","Desc",null,"PGC","Low","High","SGC","Desc"]
["ADVN",1,1,"Customer Advances",null,"01","January",null,"DEPE",0,3099999,"UNAS","Unassigned",{"$f":"K2+1=J3","v":true},"OMEX",0,4999999,"UNAS","Unassigned",{"$f":"Q2+1=P3","v":true},"EPIS",0,3009999,"UNAS","Unassigned",{"$f":"W2+1=V3","v":true},"REVN",0,4117999,"UNAS","Unassigned",{"$f":"AC2+1=AB3","v":true},"DEPR",0,3009999,"UNAS","Unassigned",{"$f":"AI2+1=AH3","v":true}]
["AMTE",1,1,"Amortization Expense",null,"02","February",null,"DEPE",3100000,3169999,"DSTM","Steam Depreciation Expense",true,"OMEX",5000000,5009999,"STEX","Steam O&M Expense",{"$f":"Q3+1=P4","v":true},"EPIS",3010000,3039999,"INTP","Intangible Plant",true,"REVN",4118000,4118000,"ALOW","Sales of S02 Allowances",true,"DEPR",3010000,3039999,"INTR","Intangible Plant Reserve",true]
["AMTR",1,1,"Amortization Reserve",null,"03","March",null,"DEPE",3170000,3199999,"UNAS","Unassigned",true,"OMEX",5010000,5010000,"NPCX","Net Power Cost Expense",true,"EPIS",3040000,3099999,"UNAS","Unassigned",true,"REVN",4118001,4210999,"UNAS","Unassigned",true,"DEPR",3040000,3099999,"UNAS","Unassigned",true]
["CAPL",1,1,"Capital Lease",null,"04","April",null,"DEPE",3200000,3259999,"DNUC","Nuclear Depreciation Expense",true,"OMEX",5010001,5010999,"STEX","Steam O&M Expense",true,"EPIS",3100000,3169999,"STMP","Steam Production Plant",true,"REVN",4211000,4211000,"DISP","Sale of Utility Plant",true,"DEPR",3100000,3169999,"STMR","Steam Production Plant Reserve",true]
["CWC ",1,1,"Cash Working Capital",null,"05","May",null,"DEPE",3260000,3299999,"UNAS","Unassigned",true,"OMEX",5011000,5011099,"NPCX","Net Power Cost Expense",true,"EPIS",3170000,3199999,"UNAS","Unassigned",true,"REVN",4211001,4211999,"UNAS","Unassigned",true,"DEPR",3170000,3199999,"UNAS","Unassigned",true]
["DEFD",1,1,"Deferred Debits",null,"06","June",null,"DEPE",3300000,3379999,"DHYO","Hydro Depreciation Expense",true,"OMEX",5011100,5011100,"NPCX","Net Power Cost Expense",true,"EPIS",3200000,3259999,"NKEP","Nuclear Production Plant",true,"REVN",4212000,4212000,"DISP","Sale of Utility Plant",true,"DEPR",3200000,3259999,"NKER","Nuclear Production Plant Reserve",true]
["DEPE",1,1,"Depreciation Expense",null,"07","July",null,"DEPE",3380000,3399999,"UNAS","Unassigned",true,"OMEX",5011101,5012999,"STEX","Steam O&M Expense",true,"EPIS",3260000,3299999,"UNAS","Unassigned",true,"REVN",4212001,4399999,"UNAS","Unassigned",true,"DEPR",3260000,3299999,"UNAS","Unassigned",true]
["DEPR",1,1,"Depreciation Reserve",null,"08","August",null,"DEPE",3400000,3479999,"DOTP","Other Depreciation Expense",true,"OMEX",5013000,5013499,"NPCX","Net Power Cost Expense",true,"EPIS",3300000,3379999,"HYDP","Hydro Production Plant",true,"REVN",4400000,4469999,"RETL","Retail Sales",true,"DEPR",3300000,3379999,"HYDR","Hydro Production Plant Reserve",true]
["DITB",1,1,"Deferred Income Tax Balance",null,"09","September",null,"DEPE",3480000,3499999,"UNAS","Unassigned",true,"OMEX",5013500,5013999,"NPCX","Net Power Cost Expense",true,"EPIS",3380000,3399999,"UNAS","Unassigned",true,"REVN",4470000,4470999,"UNAS","Unassigned",true,"DEPR",3380000,3399999,"UNAS","Unassigned",true]
{"$rows_left_out":26}