{"text_format":"1","workbook":"xlsx","n_sheets":43,"sheets":["Ex 1 HDD","Exhibit 1.1","Exhibit 1.2","Exhibit 1.3","Ex 2 Clay Basin","Ex 2 Aquifers","Ex 2 Spire Storage West","Exhibit 2.1","Exhibit 2.2","Exhibit 2.3","Exhibit 2.4","Exhibit 2.5","Exhibit 2.6","Exhibit Firm Sales Volume","Worksheet","Exhibit 3.1","Exhibit 3.2","Exhibit 3.3","Exhibit 3.4","Ex 4 Purchase Gas","Exhibit 4.1","Exhibit 4.2","Exhibit 4.3","Ex 5 Purchase Gas Cost","Exhibit 5.1","Exhibit 5.2","Exhibit 5.3","Ex 6 Purch Gas Unit Cost","Exhibit 6.1","Exhibit 6.2","Ex 7 Co. Owned Gas","Exhibit 7.1","Exhibit 7.2","Exhibit 7.3","Ex 8 New Drill","Exhibit 8.1","Exhibit 8.2","Exhibit 8.3","Normal Purchase %","IRP Pruch Cover Sheet","Shut-In","Deleted Exhibit 2.5","Deleted Exhibit 2.6"],"not_rendered":{"charts":28,"images":0,"macros":1,"external_links":11,"defined_names":1376,"comments":3,"pivot_tables":0},"unopened":[],"bounds":{"document_bytes":16777216,"sheet_cells":100000,"rows_first":2000,"rows_last":500,"rows_between":2000,"halvings":0,"cell_chars":16384,"cell_head_chars":4096},"cells_cut":0,"cells_raw":0,"read":"whole","date_system":"1900"}

{"sheet":"Ex 1 HDD","index":0,"n_rows":36,"n_cols":9,"rows_kept":36,"cut":false,"hidden":false,"merged":[[0,0,0,5],[1,0,1,5],[1,8,1,9],[26,0,26,6],[4,0,4,6]]}
["Heating Degree Days",null,null,null,null,null,"Docket",null,"Dominion Energy Utah"]
["Source: Use data from cdxr01",null,null,null,null,null,null,null,"Docket No. 19-057-01"]
[null,null,null,null,null,null,null,null,"DEU Variance Exhibit"]
[]
[]
[]
["Month/Year","Actual","IRP Forecast (Normal)",null,null,"Actual","IRP Forecast (Normal)"]
["2019-06-01",33,46.17,{"$f":"B8-C8","v":-13.170000000000002},null,{"$f":"B8","v":33},{"$f":"C8","v":46.17}]
["2019-07-01",0,2.08,{"$f":"B9-C9","v":-2.08},null,{"$f":"B9+F8","v":33},{"$f":"C9+G8","v":48.25}]
["2019-08-01",0,2.2999999999999998,-2.2999999999999998,null,33,{"$f":"C10+G9","v":50.55}]
{"$rows_left_out":27}
{"sheet":"Exhibit 1.1","index":1,"n_rows":32,"n_cols":17,"rows_kept":32,"cut":false,"hidden":false,"merged":[]}
[]
[]
[]
[]
[]
[]
[]
[]
[]
[]
{"$rows_left_out":23}
{"sheet":"Exhibit 1.2","index":2,"n_rows":32,"n_cols":17,"rows_kept":32,"cut":false,"hidden":false,"merged":[]}
[]
[]
[]
[]
[]
[]
[]
[]
[]
[]
{"$rows_left_out":23}
{"sheet":"Exhibit 1.3","index":3,"n_rows":32,"n_cols":17,"rows_kept":32,"cut":false,"hidden":false,"merged":[]}
[]
[]
[]
[]
[]
[]
[]
[]
[]
[]
{"$rows_left_out":23}
{"sheet":"Ex 2 Clay Basin","index":4,"n_rows":76,"n_cols":21,"rows_kept":76,"cut":false,"hidden":false,"merged":[[3,0,3,8],[0,0,0,8],[4,0,4,8],[1,0,1,4],[2,0,2,5]]}
["Clay Basin Ending Inventory (MDths)"]
[]
[]
[]
[null,null,null,null,null,null,null,null,null,null,null,null,"Plan Year 1",1106]
[null,null,null,null,null,null,null,null,null,null,"Month/Year","Month","Inj","With","Total"]
["Month/Year","Actual","IRP Forecast (Normal)",null,"Actual","Actual/1000",null,"Actual","Normal",null,null,null,null,null,2000]
["2019-06-01",{"$f":"F8","v":3477.596},{"$f":"O8","v":4700},{"$f":"B8-C8","v":-1222.404},3477596,{"$f":"E8/1000","v":3477.596},null,{"$f":"F8","v":3477.596},{"$f":"C8","v":4700},null,{"$f":"A8","v":"2019-06-01"},{"$f":"O7","v":2000},2700,0,{"$f":"L8+M8-N8","v":4700},null,123.428,null,{"$f":"M8/30","v":90},null,{"$f":"(M8-N8)/30","v":90}]
["2019-07-01",{"$f":"F9","v":6286.77},{"$f":"O9","v":7474.17},-1187.3999999999996,6286770,{"$f":"E9/1000","v":6286.77},null,{"$f":"H8+F9","v":9764.366},{"$f":"C9+I8","v":12174.17},null,{"$f":"A9","v":"2019-07-01"},{"$f":"O8","v":4700},2774.17,0,7474.17,null,66.779499999999999,null,{"$f":"M9/31","v":89.489354838709673},null,{"$f":"(M9-N9)/31","v":89.489354838709673}]
["2019-08-01",{"$f":"F10","v":8985.4959999999992},9954.17,-968.67400000000089,8985496,8985.4959999999992,null,{"$f":"H9+F10","v":18749.862000000001},22128.34,null,"2019-08-01",{"$f":"O9","v":7474.17},2480,0,9954.17,null,19.965599999999998,null,{"$f":"M10/31","v":80},null,{"$f":"(M10-N10)/31","v":80}]
{"$rows_left_out":67}
{"sheet":"Ex 2 Aquifers","index":5,"n_rows":48,"n_cols":21,"rows_kept":48,"cut":false,"hidden":false,"merged":[[31,0,31,11],[2,0,2,14],[1,0,1,14],[3,0,3,9]]}
["Total Aquifer Storage Ending Inventory (MDths)"]
[]
[]
[null,null,null,null,null,null,null,null,null,null,null,null,null,null,1082,1106]
[]
[null,null,null,null,null,null,null,1.0549999999999999,null,null,null,null,"Month/Year","Month","Inj","With","Total"]
["Month/Year","Actual","IRP Forecast (Normal)",null,"Actual","IRP Forecast (Normal)",null,"MCF","DTH","MDTH",null,null,null,null,null,null,833,null,null,null,497.53800000000001]
[{"$f":"'Ex 1 HDD'!$A$8","v":"2019-06-01"},{"$f":"J8","v":492.15600000000001},{"$f":"Q8","v":833},{"$f":"B8-C8","v":-340.84399999999999},{"$f":"B8","v":492.15600000000001},{"$f":"C8","v":833},null,{"$f":"I8/$H$6","v":466498.57819905214},492156,{"$f":"I8/1000","v":492.15600000000001},null,null,{"$f":"A8","v":"2019-06-01"},{"$f":"Q7","v":833},0,0,{"$f":"N8+O8-P8","v":833},null,0,null,365]
[{"$f":"'Ex 1 HDD'!$A$9","v":"2019-07-01"},{"$f":"J9","v":611.73900000000003},{"$f":"Q9","v":833},{"$f":"B9-C9","v":-221.26099999999997},{"$f":"B9+E8","v":1103.895},{"$f":"C9+F8","v":1666},null,{"$f":"I9/$H$6","v":579847.3933649289},611739,{"$f":"I9/1000","v":611.73900000000003},null,null,{"$f":"A9","v":"2019-07-01"},{"$f":"Q8","v":833},0,0,{"$f":"N9+O9-P9","v":833},null,0,null,12]
[{"$f":"'Ex 1 HDD'!$A$10","v":"2019-08-01"},{"$f":"J10","v":606.92200000000003},833,{"$f":"B10-C10","v":-226.07799999999997},{"$f":"B10+E9","v":1710.817},2499,null,575281.51658767776,606922,606.92200000000003,null,null,"2019-08-01",{"$f":"Q9","v":833},0,0,833,null,0,null,{"$f":"SUM(U7:U9)","v":874.53800000000001}]
{"$rows_left_out":39}
{"sheet":"Ex 2 Spire Storage West","index":6,"n_rows":21,"n_cols":17,"rows_kept":21,"cut":false,"hidden":false,"merged":[]}
[]
[]
[]
[]
[null,null,null,null,null,null,null,null,null,null,null,null,null,null,1082,1106]
[null,null,null,null,null,null,null,1000,null,null,null,null,null,"Month","Inj","With","Total"]
[{"$f":"'Ex 1 HDD'!A7","v":"Month/Year"},"Actual","IRP Forecast (Normal)","Days","Daily Demand",null,"Actual Dth","MDth",null,"Actual","IRP Forecast (Normal)",null,null,null,null,null,450]
[{"$f":"'Ex 1 HDD'!A8","v":"2019-06-01"},{"$f":"H8","v":799.21500000000003},{"$f":"Q8","v":791.73},{"$f":"DAY(EOMONTH(A8,0))","v":30},{"$f":"C8/D8","v":26.391000000000002},{"$f":"+B9-B8","v":352.12900000000002},799215,{"$f":"G8/$H$6","v":799.21500000000003},null,949.73599999999999,{"$f":"C8","v":791.73},null,{"$f":"A8","v":"2019-06-01"},{"$f":"Q7","v":450},341.73,0,{"$f":"N8+O8-P8","v":791.73}]
[{"$f":"'Ex 1 HDD'!A9","v":"2019-07-01"},{"$f":"H9","v":1151.3440000000001},{"$f":"Q9","v":1144.8499999999999},{"$f":"DAY(EOMONTH(A9,0))","v":31},{"$f":"C9/D9","v":36.930645161290322},{"$f":"+B10-B9","v":352.12899999999991},1151344,{"$f":"G9/$H$6","v":1151.3440000000001},null,{"$f":"B9+J8","v":2101.08},{"$f":"C9+K8","v":1936.58},null,{"$f":"A9","v":"2019-07-01"},{"$f":"Q8","v":791.73},353.12,0,1144.8499999999999]
[{"$f":"'Ex 1 HDD'!A10","v":"2019-08-01"},{"$f":"H10","v":1503.473},1497.9699999999998,31,48.321612903225798,null,1503473,1503.473,null,3604.5529999999999,3434.5499999999997,null,"2019-08-01",{"$f":"Q9","v":1144.8499999999999},353.12,0,1497.9699999999998]
{"$rows_left_out":12}
{"sheet":"Exhibit 2.1","index":7,"n_rows":32,"n_cols":23,"rows_kept":32,"cut":false,"hidden":false,"merged":[]}
[]
[]
[]
[]
[]
[]
[]
[]
[]
[]
{"$rows_left_out":23}
{"sheet":"Exhibit 2.2","index":8,"n_rows":32,"n_cols":17,"rows_kept":32,"cut":false,"hidden":false,"merged":[]}
[]
[]
[]
[]
[]
[]
[]
[]
[]
[]
{"$rows_left_out":23}
{"sheet":"Exhibit 2.3","index":9,"n_rows":32,"n_cols":17,"rows_kept":32,"cut":false,"hidden":false,"merged":[]}
[]
[]
[]
[]
[]
[]
[]
[]
[]
[]
{"$rows_left_out":23}
{"sheet":"Exhibit 2.4","index":10,"n_rows":32,"n_cols":17,"rows_kept":32,"cut":false,"hidden":false,"merged":[]}
[]
[]
[]
[]
[]
[]
[]
[]
[]
[]
{"$rows_left_out":23}
{"sheet":"Exhibit 2.5","index":11,"n_rows":32,"n_cols":17,"rows_kept":32,"cut":false,"hidden":false,"merged":[]}
[]
[]
[]
[]
[]
[]
[]
[]
[]
[]
{"$rows_left_out":23}
{"sheet":"Exhibit 2.6","index":12,"n_rows":32,"n_cols":17,"rows_kept":32,"cut":false,"hidden":false,"merged":[]}
[]
[]
[]
[]
[]
[]
[]
[]
[]
[]
{"$rows_left_out":23}
{"sheet":"Exhibit Firm Sales Volume","index":13,"n_rows":20,"n_cols":5,"rows_kept":20,"cut":false,"hidden":false,"merged":[[1,0,1,9]]}
["Demand"]
[]
[]
[]
[]
[]
[{"$f":"'Ex 1 HDD'!A7","v":"Month/Year"},"Actual","IRP Forecast (Normal)","Days","Daily Demand"]
[{"$f":"'Ex 1 HDD'!A8","v":"2019-06-01"},3012.4411359999999,3304.8550000000005,{"$f":"DAY(EOMONTH(A8,0))","v":30},{"$f":"C8/D8","v":110.16183333333335}]
[{"$f":"'Ex 1 HDD'!A9","v":"2019-07-01"},2628.2336639999999,2562.7410000000004,{"$f":"DAY(EOMONTH(A9,0))","v":31},{"$f":"C9/D9","v":82.66906451612904}]
[{"$f":"'Ex 1 HDD'!A10","v":"2019-08-01"},2555.4106139999999,2567.7429999999999,31,82.83041935483871]
{"$rows_left_out":11}
{"sheet":"Worksheet","index":14,"n_rows":34,"n_cols":7,"rows_kept":34,"cut":false,"hidden":false,"merged":[[0,0,0,6],[1,0,1,6],[2,0,2,7],[4,5,4,7]]}
["Firm Sales Variance: IRP First Quarter"]
["Data derived from Actual Dths in greybacks and IRP forecast."]
[]
[]
[null,null,null,null,null,"Cumulative"]
["Month/Year","Actual","IRP Forecast (Normal)",null,null,"Actual","IRP Forecast (Normal)"]
["2019-06-01",3012.4411359999999,3304.8550000000005,null,null,{"$f":"B7","v":3012.4411359999999},{"$f":"C7","v":3304.8550000000005}]
["2019-07-01",2628.2336639999999,2562.7410000000004,null,null,{"$f":"F7+B8","v":5640.6747999999998},{"$f":"G7+C8","v":5867.5960000000014}]
["2019-08-01",2555.4106139999999,2567.7429999999999,null,null,{"$f":"F8+B9","v":8196.0854139999992},8435.3390000000018]
["2019-09-01",0,3805.0460000000003,null,null,8196.0854139999992,12240.385000000002]
{"$rows_left_out":25}
{"sheet":"Exhibit 3.1","index":15,"n_rows":32,"n_cols":17,"rows_kept":32,"cut":false,"hidden":false,"merged":[]}
[]
[]
[]
[]
[]
[]
[]
[]
[]
[]
{"$rows_left_out":23}
{"sheet":"Exhibit 3.2","index":16,"n_rows":32,"n_cols":17,"rows_kept":32,"cut":false,"hidden":false,"merged":[]}
[]
[]
[]
[]
[]
[]
[]
[]
[]
[]
{"$rows_left_out":23}
{"sheet":"Exhibit 3.3","index":17,"n_rows":32,"n_cols":17,"rows_kept":32,"cut":false,"hidden":false,"merged":[]}
[]
[]
[]
[]
[]
[]
[]
[]
[]
[]
{"$rows_left_out":23}
{"sheet":"Exhibit 3.4","index":18,"n_rows":54,"n_cols":8,"rows_kept":54,"cut":false,"hidden":false,"merged":[[8,2,8,3],[8,4,8,5],[8,6,8,7]]}
[null,null,null,null,null,null,null,"Dominion Energy Utah"]
[null,null,null,null,null,null,null,"Docket No. 19-057-01"]
[null,null,null,null,null,null,null,"DEU Variance Exhibit 3.4"]
[]
[]
[null,"IRP Variance"]
[]
[null,"Actual Results "]
[null,null,"2019-06-01",null,"2019-07-01",null,"2019-08-01"]
[null,"SUPPLY","Actual","IRP Forecast (Normal)","Actual","IRP Forecast (Normal)","Actual","IRP Forecast (Normal)"]
{"$rows_left_out":45}
{"sheet":"Ex 4 Purchase Gas","index":19,"n_rows":23,"n_cols":13,"rows_kept":23,"cut":false,"hidden":false,"merged":[[5,6,5,7]]}
["Purchase Gas Variance (Brady Included) MDths"]
[]
[]
[]
[]
[null,null,null,null,null,null,"Cumulative"]
["Month/Year","Actual","IRP Forecast (Normal)",null,"Month/Year","Actual","IRP Forecast (Normal)",null,"Month/Year","DTHS","MDTHS","$'S","$1,000'S"]
[{"$f":"'Ex 1 HDD'!A8","v":"2019-06-01"},{"$f":"K8","v":0},777.38300000000004,null,{"$f":"A8","v":"2019-06-01"},{"$f":"K8","v":0},{"$f":"C8","v":777.38300000000004},null,{"$f":"A8","v":"2019-06-01"},0,{"$f":"J8/1000","v":0},0,{"$f":"L8/1000","v":0}]
[{"$f":"'Ex 1 HDD'!A9","v":"2019-07-01"},{"$f":"K9","v":0},0,null,"2019-07-01",{"$f":"F8+K9","v":0},{"$f":"G8+C9","v":777.38300000000004},null,"2019-07-01",0,{"$f":"J9/1000","v":0},0,0]
[{"$f":"'Ex 1 HDD'!A10","v":"2019-08-01"},0,0,null,"2019-08-01",0,777.38300000000004,null,"2019-08-01",0,{"$f":"J10/1000","v":0},0,0]
{"$rows_left_out":14}
{"sheet":"Exhibit 4.1","index":20,"n_rows":32,"n_cols":17,"rows_kept":32,"cut":false,"hidden":false,"merged":[]}
[]
[]
[]
[]
[]
[]
[]
[]
[]
[]
{"$rows_left_out":23}
{"sheet":"Exhibit 4.2","index":21,"n_rows":31,"n_cols":17,"rows_kept":31,"cut":false,"hidden":false,"merged":[]}
[]
[]
[]
[]
[]
[]
[]
[]
[]
[]
{"$rows_left_out":22}
{"sheet":"Exhibit 4.3","index":22,"n_rows":32,"n_cols":17,"rows_kept":32,"cut":false,"hidden":false,"merged":[]}
[]
[]
[]
[]
[]
[]
[]
[]
[]
[]
{"$rows_left_out":23}
{"sheet":"Ex 5 Purchase Gas Cost","index":23,"n_rows":21,"n_cols":6,"rows_kept":21,"cut":false,"hidden":false,"merged":[[1,0,1,6],[0,0,0,6],[2,0,2,7],[5,4,5,5]]}
["Purchase Gas Cost Variance ($1,000's)"]
[]
[]
[]
[]
[null,null,null,null,"Cumulative"]
["Month/Year","Actual","IRP Forecast (Normal)",null,"Actual","IRP Forecast (Normal)"]
[{"$f":"'Ex 1 HDD'!A8","v":"2019-06-01"},{"$f":"'Ex 4 Purchase Gas'!M8","v":0},1683.7280000000001,null,{"$f":"B8","v":0},{"$f":"C8","v":1683.7280000000001}]
[{"$f":"'Ex 1 HDD'!A9","v":"2019-07-01"},{"$f":"'Ex 4 Purchase Gas'!M9","v":0},0,null,{"$f":"E8+B9","v":0},{"$f":"C9+F8","v":1683.7280000000001}]
[{"$f":"'Ex 1 HDD'!A10","v":"2019-08-01"},{"$f":"'Ex 4 Purchase Gas'!M10","v":0},0,null,0,{"$f":"C10+F9","v":1683.7280000000001}]
{"$rows_left_out":12}
{"sheet":"Exhibit 5.1","index":24,"n_rows":32,"n_cols":17,"rows_kept":32,"cut":false,"hidden":false,"merged":[]}
[]
[]
[]
[]
[]
[]
[]
[]
[]
[]
{"$rows_left_out":23}
{"sheet":"Exhibit 5.2","index":25,"n_rows":33,"n_cols":17,"rows_kept":33,"cut":false,"hidden":false,"merged":[]}
[]
[]
[]
[]
[]
[]
[]
[]
[]
[]
{"$rows_left_out":24}
{"sheet":"Exhibit 5.3","index":26,"n_rows":32,"n_cols":17,"rows_kept":32,"cut":false,"hidden":false,"merged":[]}
[]
[]
[]
[]
[]
[]
[]
[]
[]
[]
{"$rows_left_out":23}
{"sheet":"Ex 6 Purch Gas Unit Cost","index":27,"n_rows":47,"n_cols":13,"rows_kept":47,"cut":false,"hidden":false,"merged":[[0,0,0,5],[1,0,1,7],[2,0,2,7],[46,2,46,13]]}
["Purchase Gas Unit Cost Variance ($1,000's)"]
[]
[]
[]
[]
[null,null,null,null,"Actual","Actual","Actual",null,"Normal","Normal","Normal"]
["Month/Year","Actual $/Dth","IRP Forecast (Normal) $/Dth",null,"Dth","Cost","$/Dth",null,"Dth","Cost","$/Dth",null,"May Forward Strip"]
[{"$f":"'Ex 1 HDD'!A8","v":"2019-06-01"},{"$f":"G8","v":0},{"$f":"K8","v":2.1658924880014099},null,{"$f":"'Ex 4 Purchase Gas'!B8","v":0},{"$f":"'Ex 4 Purchase Gas'!M8","v":0},{"$f":"IFERROR(F8/E8,0)","v":0},null,{"$f":"'Ex 4 Purchase Gas'!C8","v":777.38300000000004},{"$f":"'Ex 5 Purchase Gas Cost'!C8","v":1683.7280000000001},{"$f":"IFERROR(J8/I8,0)","v":2.1658924880014099},null,2.17]
[{"$f":"'Ex 1 HDD'!A9","v":"2019-07-01"},0,0,null,{"$f":"'Ex 4 Purchase Gas'!B9","v":0},{"$f":"'Ex 4 Purchase Gas'!M9","v":0},{"$f":"IFERROR(F9/E9,0)","v":0},null,{"$f":"'Ex 4 Purchase Gas'!C9","v":0},{"$f":"'Ex 5 Purchase Gas Cost'!C9","v":0},{"$f":"IFERROR(J9/I9,0)","v":0},null,2.4900000000000002]
[{"$f":"'Ex 1 HDD'!A10","v":"2019-08-01"},0,0,null,{"$f":"'Ex 4 Purchase Gas'!B10","v":0},{"$f":"'Ex 4 Purchase Gas'!M10","v":0},0,null,{"$f":"'Ex 4 Purchase Gas'!C10","v":0},{"$f":"'Ex 5 Purchase Gas Cost'!C10","v":0},0,null,2.6]
{"$rows_left_out":38}
{"sheet":"Exhibit 6.1","index":28,"n_rows":32,"n_cols":17,"rows_kept":32,"cut":false,"hidden":false,"merged":[]}
[]
[]
[]
[]
[]
[]
[]
[]
[]
[]
{"$rows_left_out":23}
{"sheet":"Exhibit 6.2","index":29,"n_rows":32,"n_cols":17,"rows_kept":32,"cut":false,"hidden":false,"merged":[]}
[]
[]
[]
[]
[]
[]
[]
[]
[]
[]
{"$rows_left_out":23}
{"sheet":"Ex 7 Co. Owned Gas","index":30,"n_rows":21,"n_cols":17,"rows_kept":21,"cut":false,"hidden":false,"merged":[[0,0,0,7],[2,14,2,19],[1,0,1,7],[2,0,2,10]]}
["Cost-of-Service Gas Variance (MDths)"]
[]
[]
[]
[]
[null,null,null,null,null,null,null,"Cumulative"]
["Month/Year","Actual","IRP Forecast (Normal)","Full Production","Shut-in Est. Month","Shut-in Daily",null,"Actual","IRP Forecast (Normal)",null,"Days in Mo.","Dthms","Dthms/Day"]
[{"$f":"'Ex 1 HDD'!A8","v":"2019-06-01"},5977.3370000000004,5747.91,5747.91,{"$f":"D8-C8","v":0},{"$f":"(E8/30)*1000","v":0},null,{"$f":"B8","v":5977.3370000000004},{"$f":"C8","v":5747.91},null,{"$f":"DAY(EOMONTH(A8,0))","v":30},{"$f":"C8","v":5747.91},{"$f":"L8/K8","v":191.59700000000001},null,null,null,5754.4783839995334]
[{"$f":"'Ex 1 HDD'!A9","v":"2019-07-01"},6115.5940000000019,5860.6560000000009,5860.6560000000009,0,{"$f":"(E9/30)*1000","v":0},null,{"$f":"H8+B9","v":12092.931000000002},{"$f":"I8+C9","v":11608.566000000001},null,{"$f":"DAY(EOMONTH(A9,0))","v":31},{"$f":"C9","v":5860.6560000000009},{"$f":"L9/K9","v":189.05341935483872},null,null,null,5867.4130191810464]
[{"$f":"'Ex 1 HDD'!A10","v":"2019-08-01"},6095.2299999999977,5556.3469999999998,5980.0830501543187,423.73605015431895,14124.535005143965,null,18188.161,17164.913,null,31,5556.3469999999998,179.23699999999999,null,null,null,5986.08520467781]
{"$rows_left_out":12}
{"sheet":"Exhibit 7.1","index":31,"n_rows":33,"n_cols":17,"rows_kept":33,"cut":false,"hidden":false,"merged":[]}
[]
[]
[]
[]
[]
[]
[]
[]
[]
[]
{"$rows_left_out":24}
{"sheet":"Exhibit 7.2","index":32,"n_rows":32,"n_cols":17,"rows_kept":32,"cut":false,"hidden":false,"merged":[]}
[]
[]
[]
[]
[]
[]
[]
[]
[]
[]
{"$rows_left_out":23}
{"sheet":"Exhibit 7.3","index":33,"n_rows":32,"n_cols":17,"rows_kept":32,"cut":false,"hidden":false,"merged":[]}
[]
[]
[]
[]
[]
[]
[]
[]
[]
[]
{"$rows_left_out":23}
{"sheet":"Ex 8 New Drill","index":34,"n_rows":19,"n_cols":13,"rows_kept":19,"cut":false,"hidden":false,"merged":[[0,0,0,9],[1,0,1,9],[2,0,2,9]]}
["Isolated New Drill Component (MDths)"]
[]
[]
[]
[]
[null,null,null,null,null,null,null,null,null,"Cumulative",null,"Cumulative"]
["Month/Year","ND Actual","ND IRP Forecast (Normal)","Legacy Actual","Legacy IRP Forecast (Normal)",null,null,"Prod Actual","Prod Normal","ND Actual","ND IRP Forecast (Normal)","Legacy Actual","Legacy IRP Forecast (Normal)"]
[{"$f":"'Ex 1 HDD'!A8","v":"2019-06-01"},131.35599999999999,214.34700000000001,{"$f":"H8-B8","v":5845.9810000000007},{"$f":"I8-C8","v":5533.5630000000001},null,null,{"$f":"'Ex 7 Co. Owned Gas'!B8","v":5977.3370000000004},{"$f":"'Ex 7 Co. Owned Gas'!C8","v":5747.91},{"$f":"B8","v":131.35599999999999},{"$f":"C8","v":214.34700000000001},{"$f":"D8","v":5845.9810000000007},{"$f":"E8","v":5533.5630000000001}]
[{"$f":"'Ex 1 HDD'!A9","v":"2019-07-01"},118.494,255.97,5997.1000000000022,5604.6860000000006,null,null,{"$f":"'Ex 7 Co. Owned Gas'!B9","v":6115.5940000000019},{"$f":"'Ex 7 Co. Owned Gas'!C9","v":5860.6560000000009},{"$f":"B8+B9","v":249.85},{"$f":"K8+C9","v":470.31700000000001},11843.081000000002,11138.249]
[{"$f":"'Ex 1 HDD'!A10","v":"2019-08-01"},107.49299999999999,223.12799999999999,5987.7369999999974,5333.2190000000001,null,null,{"$f":"'Ex 7 Co. Owned Gas'!B10","v":6095.2299999999977},{"$f":"'Ex 7 Co. Owned Gas'!C10","v":5556.3469999999998},{"$f":"J9+B10","v":357.34299999999996},693.44499999999994,17830.817999999999,16471.468000000001]
{"$rows_left_out":10}
{"sheet":"Exhibit 8.1","index":35,"n_rows":32,"n_cols":17,"rows_kept":32,"cut":false,"hidden":false,"merged":[]}
[]
[]
[]
[]
[]
[]
[]
[]
[]
[]
{"$rows_left_out":23}
{"sheet":"Exhibit 8.2","index":36,"n_rows":32,"n_cols":17,"rows_kept":32,"cut":false,"hidden":false,"merged":[]}
[]
[]
[]
[]
[]
[]
[]
[]
[]
[]
{"$rows_left_out":23}
{"sheet":"Exhibit 8.3","index":37,"n_rows":32,"n_cols":17,"rows_kept":32,"cut":false,"hidden":false,"merged":[]}
[]
[]
[]
[]
[]
[]
[]
[]
[]
[]
{"$rows_left_out":23}
{"sheet":"Normal Purchase %","index":38,"n_rows":34,"n_cols":15,"rows_kept":34,"cut":false,"hidden":true,"merged":[[1,0,1,8]]}
[]
["Source:  The whole numbers come from Purchase Gas and Company Owned Gas sheets.  The percentages are then calculated from those numbers."]
[null,2,3,4,5,6,7,8,9]
["Month","Actual Purchase Mdth","Normal Purchase Mdth","Actual Company Mdth","Normal Company Mdths","Actual Purchase as Percent of Total","Normal Purchase as Percent of Total","Actual Cost-of-Service as Percent of Total","Normal Cost-of-Service as Percent of Total",null,"Check Should = 100%","Check Should = 100%"]
[{"$f":"'Ex 1 HDD'!A8","v":"2019-06-01"},{"$f":"'Ex 4 Purchase Gas'!B8","v":0},{"$f":"'Ex 4 Purchase Gas'!C8","v":777.38300000000004},{"$f":"'Ex 7 Co. Owned Gas'!B8","v":5977.3370000000004},{"$f":"'Ex 7 Co. Owned Gas'!C8","v":5747.91},{"$f":"IFERROR(B5/(B5+D5),0)","v":0},{"$f":"C5/(C5+E5)","v":0.11913380747807034},{"$f":"IFERROR(D5/(D5+B5),0)","v":1},{"$f":"E5/(E5+C5)","v":0.88086619252192966},null,{"$f":"F5+H5","v":1},{"$f":"G5+I5","v":1}]
[{"$f":"'Ex 1 HDD'!A9","v":"2019-07-01"},{"$f":"'Ex 4 Purchase Gas'!B9","v":0},{"$f":"'Ex 4 Purchase Gas'!C9","v":0},{"$f":"'Ex 7 Co. Owned Gas'!B9","v":6115.5940000000019},{"$f":"'Ex 7 Co. Owned Gas'!C9","v":5860.6560000000009},{"$f":"IFERROR(B6/(B6+D6),0)","v":0},0,{"$f":"IFERROR(D6/(D6+B6),0)","v":1},1,null,1,1]
[{"$f":"'Ex 1 HDD'!A10","v":"2019-08-01"},{"$f":"'Ex 4 Purchase Gas'!B10","v":0},{"$f":"'Ex 4 Purchase Gas'!C10","v":0},{"$f":"'Ex 7 Co. Owned Gas'!B10","v":6095.2299999999977},{"$f":"'Ex 7 Co. Owned Gas'!C10","v":5556.3469999999998},0,0,1,1,null,1,1]
[{"$f":"'Ex 1 HDD'!A11","v":"2019-09-01"},{"$f":"'Ex 4 Purchase Gas'!B11","v":0},{"$f":"'Ex 4 Purchase Gas'!C11","v":0},{"$f":"'Ex 7 Co. Owned Gas'!B11","v":0},{"$f":"'Ex 7 Co. Owned Gas'!C11","v":5611.686999999999},0,0,0,1,null,0,1]
[{"$f":"'Ex 1 HDD'!A12","v":"2019-10-01"},{"$f":"'Ex 4 Purchase Gas'!B12","v":0},{"$f":"'Ex 4 Purchase Gas'!C12","v":4222.72},{"$f":"'Ex 7 Co. Owned Gas'!B12","v":0},{"$f":"'Ex 7 Co. Owned Gas'!C12","v":5658.2239999999993},0,0.42735997694147448,0,0.57264002305852557,null,0,1]
[{"$f":"'Ex 1 HDD'!A13","v":"2019-11-01"},{"$f":"'Ex 4 Purchase Gas'!B13","v":0},{"$f":"'Ex 4 Purchase Gas'!C13","v":4431.0640000000003},{"$f":"'Ex 7 Co. Owned Gas'!B13","v":0},{"$f":"'Ex 7 Co. Owned Gas'!C13","v":5360.5049999999992},0,0.45253870957759684,0,0.5474612904224031,null,{"$f":"F10+H10","v":0},1]
{"$rows_left_out":25}
{"sheet":"IRP Pruch Cover Sheet","index":39,"n_rows":15,"n_cols":5,"rows_kept":15,"cut":false,"hidden":true,"merged":[]}
[null,2,3,4,5]
[null,{"$f":"'Normal Purchase %'!F24","v":"Actual Purchase as Percent of Total"},{"$f":"'Normal Purchase %'!G24","v":"Normal Purchase as Percent of Total"},{"$f":"'Normal Purchase %'!H24","v":"Actual Cost-of-Service as Percent of Total"},{"$f":"'Normal Purchase %'!I24","v":"Normal Cost-of-Service as Percent of Total"}]
[]
[{"$f":"'Normal Purchase %'!E25","v":"2019-06-01"},{"$f":"VLOOKUP($A4,'Normal Purchase %'!$E$25:$I$27,'IRP Pruch Cover Sheet'!B$1,FALSE)","v":0},{"$f":"VLOOKUP($A4,'Normal Purchase %'!$E$25:$I$27,'IRP Pruch Cover Sheet'!C$1,FALSE)","v":0.11913380747807034},{"$f":"VLOOKUP($A4,'Normal Purchase %'!$E$25:$I$27,'IRP Pruch Cover Sheet'!D$1,FALSE)","v":1},{"$f":"VLOOKUP($A4,'Normal Purchase %'!$E$25:$I$27,'IRP Pruch Cover Sheet'!E$1,FALSE)","v":0.88086619252192966}]
[{"$f":"'Normal Purchase %'!E26","v":"2019-07-01"},{"$f":"VLOOKUP($A5,'Normal Purchase %'!$E$25:$I$27,'IRP Pruch Cover Sheet'!B$1,FALSE)","v":0},{"$f":"VLOOKUP($A5,'Normal Purchase %'!$E$25:$I$27,'IRP Pruch Cover Sheet'!C$1,FALSE)","v":0},{"$f":"VLOOKUP($A5,'Normal Purchase %'!$E$25:$I$27,'IRP Pruch Cover Sheet'!D$1,FALSE)","v":1},{"$f":"VLOOKUP($A5,'Normal Purchase %'!$E$25:$I$27,'IRP Pruch Cover Sheet'!E$1,FALSE)","v":1}]
[{"$f":"'Normal Purchase %'!E27","v":"2019-08-01"},{"$f":"VLOOKUP($A6,'Normal Purchase %'!$E$25:$I$27,'IRP Pruch Cover Sheet'!B$1,FALSE)","v":0},{"$f":"VLOOKUP($A6,'Normal Purchase %'!$E$25:$I$27,'IRP Pruch Cover Sheet'!C$1,FALSE)","v":0},{"$f":"VLOOKUP($A6,'Normal Purchase %'!$E$25:$I$27,'IRP Pruch Cover Sheet'!D$1,FALSE)","v":1},{"$f":"VLOOKUP($A6,'Normal Purchase %'!$E$25:$I$27,'IRP Pruch Cover Sheet'!E$1,FALSE)","v":1}]
[]
[{"$f":"'Normal Purchase %'!E29","v":"Q1"},{"$f":"VLOOKUP($A$8,'Normal Purchase %'!$E$29:$I$32,'IRP Pruch Cover Sheet'!B$1,FALSE)","v":0},{"$f":"VLOOKUP($A$8,'Normal Purchase %'!$E$29:$I$32,'IRP Pruch Cover Sheet'!C$1,FALSE)","v":4.332684066743743E-2},{"$f":"VLOOKUP($A$8,'Normal Purchase %'!$E$29:$I$32,'IRP Pruch Cover Sheet'!D$1,FALSE)","v":1},{"$f":"VLOOKUP($A$8,'Normal Purchase %'!$E$29:$I$32,'IRP Pruch Cover Sheet'!E$1,FALSE)","v":0.95667315933256247}]
[]
[]
{"$rows_left_out":6}
{"sheet":"Shut-In","index":40,"n_rows":75,"n_cols":11,"rows_kept":75,"cut":false,"hidden":true,"merged":[[0,0,0,1],[1,0,1,1]]}
["Actual Data from Jennifer Beasley"]
["Estimates…See Company Nom Groups herein"]
[]
[null,"June","July","August","Total Dth for Quarter",null,null,"September","October","November","Total Dth for Quarter"]
["Estimated Shut-in (dth/day)",0,0,13668.904843687707,{"$f":"SUM(B5:D5)","v":13668.904843687707},null,"Estimated Shut-in (dth/day)",{"$f":"H41/30","v":0},{"$f":"I41/30","v":0},0,{"$f":"K41","v":0}]
["Actual Shut-in  (dth/day)",0,0,0,0,null,"Acutal Shut-in  (dth/day)",{"$f":"H75/30","v":0},{"$f":"I75/31","v":0},0,{"$f":"K75","v":0}]
[]
[]
[]
[1,59,{"$f":"C5","v":0},0,null,null,{"$f":"A10","v":1}]
{"$rows_left_out":66}
{"sheet":"Deleted Exhibit 2.5","index":41,"n_rows":32,"n_cols":17,"rows_kept":32,"cut":false,"hidden":true,"merged":[]}
[]
[]
[]
[]
[]
[]
[]
[]
[]
[]
{"$rows_left_out":23}
{"sheet":"Deleted Exhibit 2.6","index":42,"n_rows":32,"n_cols":17,"rows_kept":32,"cut":false,"hidden":true,"merged":[]}
[]
[]
[]
[]
[]
[]
[]
[]
[]
[]
{"$rows_left_out":22}