{"text_format":"1","workbook":"xlsx","n_sheets":45,"sheets":["Control Panel","Monthly Inputs","Other Inputs","CET & DSM WY","WY Tariff Sheets","Calculations","CET & DSM","UT Tariff Sheets PT","UT Tariff Sheets","Utah Summary-by class","UT Summary - by cost","WY Summary - by cost","Model Checks","Royalty Detail","SDR#1","SDR#2","SDR#3","SDR#4","Wy SDR#1","Current Exh Updated Exh","Ut 1.1 p1","Ut 1.1 p2","Ut 1.2 p1","Ut 1.2 p2","Ut 1.2 p3","Ut 1.2 p4","Ut 1.2 p5","Ut 1.3 Redacted","Ut 1.4 p1","Ut 1.4 p2","Ut 1.5 p1","Ut 1.5 p2","Ut 1.5 p3","Ut 1.6","Ut 1.7 Tot","Ut 1.7 p1","LEG - PR","Ut 1.7 Source","Ut 1.11","Ut 1.8 p1","Ut Storage","Ex 1.1 Data","Expenses","Rate Base","RevRun Fcst"],"not_rendered":{"charts":0,"images":2,"macros":1,"external_links":2,"defined_names":347,"comments":0,"pivot_tables":0},"unopened":[],"bounds":{"document_bytes":16777216,"sheet_cells":100000,"rows_first":2000,"rows_last":500,"rows_between":2000,"halvings":0,"cell_chars":16384,"cell_head_chars":4096},"cells_cut":0,"cells_raw":0,"read":"whole","date_system":"1900"}

{"sheet":"Control Panel","index":0,"n_rows":41,"n_cols":10,"rows_kept":41,"cut":false,"hidden":false,"merged":[[28,2,28,4],[1,2,1,7]]}
["GO TO"]
["Utah",null,"FILING INFORMATION",null,null,null,null,null,null,"Model Checks"]
[1.1000000000000001,null,null,null,null,null,null,null,null,"(Must Be 0)"]
[1.2,null,null,null,"UTAH",null,null,null,null,{"$f":"'Model Checks'!D7","v":1.1446631550788879}]
["1.3 pg 1",null,null,"Current Case No.","19-057-18",null,null,null,null,"(If this is not 0, or very close, go to"]
["1.3 pg 2",null,null,"Filing Date","2019-08-30",null,null,null,null,"the \"Model Checks\""]
[null,null,null,"Test-Year Ending","2020-09-30",null,null,null,null,"Tab and find the"]
["1.4 pg 1",null,null,"Proposed Effective Date","2020-10-01",null,null,null,null,"problem.)"]
["1.4 pg 2",null,null,"Prior Case No. ","19-057-04"]
["1.4 pg 3",null,null,null,null,null,null,null,null,"Go To"]
[1.5,null,"Total Increase (Decrease)",null,{"$f":"'Utah Summary-by class'!Q24","v":11352448.553800004},null,{"$f":"E11-F11","v":11352448.553800004},null,null,"Model Checks'"]
["1.6 pg 1"]
["1.6 pg 2"]
["1.6 pg 3",null,"Typical Customer's Bill",null,null,null,null,null,null,"Old Ut Data color"]
["1.7 pg 1"]
["1.7 pg 2",null,null,"Previous",{"$f":"'Ut 1.6'!F30","v":623.47},null,null,null,null,"New Data color"]
[1.8,null,null,"Proposed",{"$f":"'Ut 1.6'!H30","v":631.70999999999992}]
[1.9,null,null,"Difference",{"$f":"'Ut 1.6'!J30","v":8.2399999999998954},null,{"$f":"E18-F18","v":8.2399999999998954}]
["Monthly Inputs",null,null,"% Difference",{"$f":"'Ut 1.6'!J32","v":1.32},null,{"$f":"E19-F19","v":1.32}]
["Other Inputs"]
["Expenses"]
["Rate Base"]
[]
[]
[]
[]
[]
[]
[null,null,"Exhibit Headings"]
[]
[null,null,"UTAH"]
[null,null,null,null,"Dominion Energy Utah"]
[null,null,null,null,{"$f":"\"Docket No. \"&E5","v":"Docket No. 19-057-18"}]
[]
[]
[]
[]
[]
[null,null,"Test-Year (enter as text)"]
[null,null,null,"from","2019-10-01"]
[null,null,null,"to","2020-09-30"]

{"sheet":"Monthly Inputs","index":1,"n_rows":128,"n_cols":19,"rows_kept":128,"cut":false,"hidden":false,"merged":[[1,6,1,17]]}
["MONTHLY INPUTS"]
[null,null,null," ",null,null,"TEST-YEAR COLUMNS",null,null,null,null,null,null,null,null,null,null,null,"12-Month"]
[null,null,null,null,"Aug19","Sep19","Oct19","Nov19","Dec19","Jan20","Feb20","Mar20","Apr20","May20","Jun20","Jul20","Aug20","Sep20",{"$f":"+R3","v":"Sep20"}]
[null,null,null,null,8,9,10,11,12,1,2,3,4,5,6,7,8,9]
["QGC Company Produced Gas In MDth",null,null,null,null,null,null,null,"Updated:","2019-08-05"]
["WEXPRO I"]
[null,"Company Production In Dth",null,null,4507108.6708456278,4267514.9800777435,4510066,4273743,4462731,4358163,4113328.9999999995,4291851.0000000009,4070250,4130934.9999999995,3931044,4000312,4001024.0000000005,3914310,{"$f":"SUM(G7:R7)","v":50057758}]
[null,"Birch Cr Gathering",null,null,0,0,0,0,0,0,0,0,0,0,0,0,0,{"$f":"R7/$S$7*$S$8","v":0},{"$f":"'Other Inputs'!$D$172","v":0}]
[null,"Gathering",null,null,3068601.438776053,2905477.4500052091,{"$f":"G7/$S$7*$S$9","v":3159956.2107033236},2994377.6290191445,3126791.1689425954,3053526.0989766954,2881984.325776184,3007064.9127669693,2851801.2300962345,2894319.8856206839,2754267.2108009146,2802799.5042979494,2803298.3636986818,2742542.6135932659,{"$f":"+'Ex 1.1 Data'!E1","v":35072729.154292643}]
[null,null,null,null,null,null,null,null,null,null,null,null,null,null,null,null," "," "," "]
[null,null,null,null,null,null,null,null,null,null,null,null,null,null,null,null,null,null," "]
["WEXPRO II"]
[null,"Company Production In Dth",null,null,1059733.9015007019,1017635.9901428223,1148158,1086762,1099931,1075453,982880,1028537,975834,989735,940995,956076,998334,896292,{"$f":"SUM(G13:R13)","v":12178987}]
[null,"Samson Gathering",null,null,938881.45957502106,901584.40943368443,{"$f":"G13/$S$13*$S$14","v":962497.47047327983},911029.38446318591,922068.91838505247,901549.08306426485,823945.40975961264,862219.53841559775,818038.76870763663,829691.93607401731,788833.33759639703,801475.69548808748,836900.4524529475,751358.94433121302,{"$f":"+'Ex 1.1 Data'!L1","v":10209608.939211292}]
[null,null,null,null,null,null,null,null,null,null,null,null,null,null,null,null,null,null," "]
[null,null,null,null,null,null,null,null,null,null,null,null,null,null,null,null,null,null," "]
[null,null,null,null,null,null,null,null,null,null,null,null,null,null,null,null,null,null," "]
[null,null,null,null,null,null,null,null,null,null,null,null,null,null,null,null," "," "]
[null,null,null,null,null,null,null,null,null,null,null,null,null,null,null,null,null,null," "]
[null,null,null,null,null,null,null,null,null,null,null,null,null,null,null,null,null,null," "]
[null,null,null,1000,null,null,null,null,null,null,null,null,null,null,null,null,null,null," "]
[]
[null,"Injections in Dth"]
[null,null,"Chalk Creek",null,0,0,132000,76600,0,0,0,0,0,0,0,0,0,93650,{"$f":"SUM(G24:R24)","v":302250}]
[null,null,"Clay Basin",null,{"$f":"2543589.72167969+15000*31+500000","v":3508589.7216796898},{"$f":"1816826.72119141+1750000","v":3566826.72119141},2812405,1500000,0,0,0,0,0,1412351.9999999998,2700000,1910379.9999999998,1945949.9999999998,2400000,14681087]
[null,null,"Coalville",null,0,22993.125915527344,310000,50186,0,0,0,0,0,0,0,0,0,50190,410376]
[null,null,"Leroy",null,0,36504.894256591797,443966,0,0,0,0,0,0,0,0,0,0,0,443966]
[null,null,"Spire",null,362173.00415039063,350489.990234375,238343,0,0,0,0,0,335461,353119,341730,353120,353120,341730,2316623]
[null,null,"Total Injections",null,2905762.7258300781,2226814.7315979004,{"$f":"SUM(G24:G28)","v":3936714},1626786,0,0,0,0,335461,1765470.9999999998,3041730,2263500,2299070,2885570,{"$f":"SUM(G29:R29)","v":18154302}]
[]
[null,"Withdrawls In Dth"]
[null,null,"Chalk Creek",null,0,0,0,0,0,60079,0,300107,0,0,0,0,0,0,{"$f":"SUM(G32:R32)","v":360186}]
[null,null,"Clay Basin",null,0,0,0,957328,3317046.0000000005,3160049.9999999995,3190046.0000000005,1500000,0,0,0,0,0,0,12124470]
[null,null,"Coalville",null,0,0,0,0,0,78940,0,364543,0,0,0,0,0,0,443483]
[null,null,"Leroy",null,0,0,0,0,0,184023,0,921900,0,0,0,0,0,0,1105923]
[null,null,"Spire",null,0,0,0,498000,514600,514600,481400,0,0,0,0,0,0,0,2008600]
[null,null,"Total Withdrawls",null,0,0,{"$f":"SUM(G32:G36)","v":0},1455328,3831646.0000000005,3997691.9999999995,3671446.0000000005,3086550,0,0,0,0,0,0,16042662]
[]
[null,"Lost & Unaccounted for on QPC"]
[]
[]
["Injection and Withdrawl Used, Lost and Unaccounted For"]
[null,null,null,"Gas Use"]
[null,null,null,"%"]
[null,"Injections in Dth"]
[null,null,"Chalk Creek",{"$f":"'Other Inputs'!E147","v":9.9000000000000008E-3},{"$f":"E24*-$D46","v":0},0,{"$f":"G24*-$D46","v":-1306.8000000000002},{"$f":"H24*-$D46","v":-758.34},0,0,0,0,0,0,0,0,0,-927.1350000000001,{"$f":"SUM(G46:R46)","v":-2992.2750000000005}]
[null,null,"Clay Basin",{"$f":"'Other Inputs'!E156","v":2.5000000000000001E-2},-87714.743041992246,-89170.668029785258,{"$f":"G25*-$D47","v":-70310.125},{"$f":"H25*-$D47","v":-37500},0,0,0,0,0,-35308.799999999996,-67500,-47759.5,-48648.75,-60000,{"$f":"SUM(G47:R47)","v":-367027.17499999999}]
[null,null,"Coalville",{"$f":"'Other Inputs'!E159","v":1.0800000000000001E-2},{"$f":"E26*-$D48","v":0},-248.32575988769531,{"$f":"G26*-$D48","v":-3348},-542.00880000000006,0,0,0,0,0,0,0,0,0,-542.05200000000002,{"$f":"SUM(G48:R48)","v":-4432.0608000000002}]
[null,null,"Leroy",{"$f":"'Other Inputs'!E153","v":2.9499999999999998E-2},{"$f":"E27*-$D49","v":0},-1076.894380569458,-13096.996999999999,0,0,0,0,0,0,0,0,0,0,0,{"$f":"SUM(G49:R49)","v":-13096.996999999999}]
[null,null,"Ryckman",{"$f":"'Other Inputs'!E150","v":2.5000000000000001E-2},{"$f":"E28*-$D50","v":-9054.3251037597656},-8762.249755859375,-5958.5750000000007,0,0,0,0,0,-8386.5249999999996,-8827.9750000000004,-8543.25,-8828,-8828,-8543.25,{"$f":"SUM(G50:R50)","v":-57915.574999999997}]
[null,null,"Total Injections",null,{"$f":"SUM(E46:E50)","v":-96769.068145752011},-99258.137926101786,-94020.497000000003,-38800.3488,0,0,0,0,-8386.5249999999996,-44136.774999999994,-76043.25,-56587.5,-57476.75,-70012.437000000005,{"$f":"SUM(S46:S50)","v":-445464.08279999997}]
[]
[null,"Withdrawls In Dth"]
[null,null,"Chalk Creek",{"$f":"'Other Inputs'!E148","v":1.84E-2},{"$f":"E32*-$D54","v":0},0,{"$f":"G32*-$D54","v":0},0,0,-1105.4536000000001,0,-5521.9687999999996,0,0,0,0,0,0,{"$f":"SUM(G54:R54)","v":-6627.4223999999995}]
[null,null,"Clay Basin",{"$f":"'Other Inputs'!E157","v":1.55E-2},{"$f":"E33*-$D55","v":0},0,0,-14838.584000000001,-51414.213000000003,-48980.774999999994,-49445.713000000003,-23250,0,0,0,0,0,0,{"$f":"SUM(G55:R55)","v":-187929.285}]
[null,null,"Coalville",{"$f":"'Other Inputs'!E160","v":2.3900000000000001E-2},{"$f":"E34*-$D56","v":0},0,0,0,0,-1886.6660000000002,0,-8712.5776999999998,0,0,0,0,0,0,{"$f":"SUM(G56:R56)","v":-10599.243699999999}]
[null,null,"Leroy",{"$f":"'Other Inputs'!E154","v":2.4299999999999999E-2},{"$f":"E35*-$D57","v":0},0,0,0,0,-4471.7588999999998,0,-22402.17,0,0,0,0,0,0,{"$f":"SUM(G57:R57)","v":-26873.928899999999}]
[null,null,"Ryckman",{"$f":"'Other Inputs'!E151","v":0},{"$f":"E36*-$D58","v":0},0,0,0,0,0,0,0,0,0,0,0,0,0,{"$f":"SUM(G58:R58)","v":0}]
[null,null,"Total Withdrawls",null,{"$f":"SUM(E54:E58)","v":0},0,{"$f":"SUM(G54:G58)","v":0},-14838.584000000001,-51414.213000000003,-56444.653499999993,-49445.713000000003,-59886.716499999995,0,0,0,0,0,0,{"$f":"SUM(S54:S58)","v":-232029.88}]
[]
[null,"QPC Transportation Loss"]
[null,null,"Chalk Creek",{"$f":"'Other Inputs'!$E$268","v":1.5699999999999999E-2},{"$f":"E32*-$D62","v":0},0,{"$f":"G32*-$D62","v":0},{"$f":"H32*-$D62","v":0},0,-943.24029999999993,0,-4711.6798999999992,0,0,0,0,0,0,{"$f":"SUM(G62:R62)","v":-5654.9201999999987}]
[null,null,"Clay Basin",{"$f":"'Other Inputs'!$E$268","v":1.5699999999999999E-2},{"$f":"E33*-$D63","v":0},0,{"$f":"G33*-$D63","v":0},-15030.049599999998,-52077.622200000005,-49612.784999999989,-50083.722200000004,-23549.999999999996,0,0,0,0,0,0,{"$f":"SUM(G63:R63)","v":-190354.179}]
[null,null,"Coalville",{"$f":"'Other Inputs'!$E$268","v":1.5699999999999999E-2},{"$f":"E34*-$D64","v":0},0,0,0,0,-1239.3579999999999,0,-5723.3250999999991,0,0,0,0,0,0,{"$f":"SUM(G64:R64)","v":-6962.6830999999993}]
[null,null,"Leroy",{"$f":"'Other Inputs'!$E$268","v":1.5699999999999999E-2},{"$f":"E35*-$D65","v":0},0,0,0,0,-2889.1610999999998,0,-14473.829999999998,0,0,0,0,0,0,{"$f":"SUM(G65:R65)","v":-17362.991099999999}]
[null,null,"Ryckman",{"$f":"'Other Inputs'!$E$268","v":1.5699999999999999E-2},{"$f":"E36*-$D66","v":0},0,0,-7818.5999999999995,-8079.2199999999993,-8079.2199999999993,-7557.98,0,0,0,0,0,0,0,{"$f":"SUM(G66:R66)","v":-31535.02}]
[null,null,"Total Withdrawls",null,{"$f":"SUM(E62:E66)","v":0},0,{"$f":"SUM(G62:G66)","v":0},-22848.649599999997,-60156.842200000006,-62763.764399999985,-57641.7022,-48458.834999999992,0,0,0,0,0,0,-251869.7934]
[]
[]
[null,"Total Injections & Withdrawls",null,null,{"$f":"E51+E59","v":-96769.068145752011},-99258.137926101786,{"$f":"G51+G59","v":-94020.497000000003},{"$f":"H51+H59","v":-53638.932800000002},-51414.213000000003,-56444.653499999993,-49445.713000000003,-59886.716499999995,-8386.5249999999996,-44136.774999999994,-76043.25,-56587.5,-57476.75,-70012.437000000005,{"$f":"S51+S59","v":-677493.96279999998}]
[]
[null,null,null,null,null,null,null,null,null,null,null,null,null,null,null,null,null,"Fuel Factor",{"$f":"-S70/(S37+S29)","v":1.9811523701343779E-2}]
[]
[null,null,null,null,null,null,null,null,null,null,null,null,null,null,null,null,null,null,"12-Month"]
[null,null,null,null,{"$f":"E3","v":"Aug19"},"Sep19",{"$f":"G3","v":"Oct19"},{"$f":"H3","v":"Nov19"},"Dec19","Jan20","Feb20","Mar20","Apr20","May20","Jun20","Jul20","Aug20","Sep20","Total"]
[]
[null,null,null,null,null,null,null,null,"Updated:","2019-08-07","EXH 1.2"]
["Natural Gas Spot Price Forecast - Average of GI, Cera & Pira",null,null,null,null,null,"(Forecast --->)"]
[null,"Kern River Opal, Wyoming",null,null,2.0002681739130437,1.9556849999999999,1.88,2.11,2.42,2.4,2.2400000000000002,1.8,1.75,1.64,1.59,1.83,1.88,1.7]
[]
[]
[null,"Spot Purchases from IRP",null,null,null,null,4222.72,4431.0640000000003,4395.820999999999,4949.8760000000011,4467.1480000000001,5104.5399999999991,3985.4520000000002,2600.38,1639.95,0,0,1246.9860000000001,{"$f":"SUM(G82:R82)","v":37043.936999999998}]
[null,null,"In DTH",null,null,null,{"$f":"G82*1000","v":4222720},{"$f":"H82*1000","v":4431064},4395820.9999999991,4949876.0000000009,4467148,{"$f":"L82*1000","v":5104539.9999999991},{"$f":"M82*1000","v":3985452},2600380,{"$f":"O82*1000","v":1639950},0,0,1246986,{"$f":"SUM(G83:R83)","v":37043937}]
[null,null,"In $",null,null,null,{"$f":"G83*G79","v":7938713.5999999996},9349545.0399999991,10637886.819999997,11879702.400000002,{"$f":"K83*K79","v":10006411.520000001},9188171.9999999981,6974541,4264623.2,2607520.5,0,0,2119876.1999999997,{"$f":"SUM(G84:R84)","v":74966992.280000001}]
[]
[]
["CONTRACT PURCHASES",null,null,null,null,null,null,null,"Updated:","2019-08-19"]
[null,"RESET FORMULAS TO WORKSHEET"]
[null,"Peaking Purchases (DTH)",null,null,null,null,0,1000000,4000000,5000000,3000000,0,0,0,0,0,0,0,{"$f":"SUM(G89:R89)","v":13000000}]
[null,"Peaking Purchases ($)",null,null,null,null,0,2170248.2535714288,8680993.0142857153,10851241.267857144,6510744.760714286,0,0,0,0,0,0,0,{"$f":"SUM(G90:R90)","v":28213227.296428572}]
[null,null,null,null,null,null,null,null,null,null,null,null," "]
[null,"Term Purchases (DTH)",null,null,null,null,930000,1110000,2077000,2077000,1943000,930000,900000,0,0,0,0,0,{"$f":"SUM(G92:R92)","v":9967000}]
[null,"Term Purchases ($)",null,null,null,null,1973995.68,2569666.7280000001,5332390.5751999998,5289964.7439999999,4631167.2496000007,1898464.8000000005,1791540.0000000002,0,0,0,0,0,{"$f":"SUM(G93:R93)","v":23487189.776799999}]
[null,"Stabilization Costs (Winter Months - Oct to Mar)",null,null,null,null,0,0,0,0,0,0,0,0,0,0,0,0,{"$f":"SUM(G94:R94)","v":0}]
[]
[]
[null,"Total Purchases (DTH)",null,null,0,0,{"$f":"G89+G92","v":930000},{"$f":"H89+H92","v":2110000},6077000,7077000,4943000,{"$f":"L89+L92","v":930000},900000,0,0,0,0,0,{"$f":"SUM(G97:R97)","v":22967000}]
[null,"Total Purchases ($)",null,null,0,0,1973995.68,4739914.9815714285,14013383.589485716,16141206.011857145,11141912.010314286,{"$f":"L90+L93","v":1898464.8000000005},1791540.0000000002,0,0,0,0,0,{"$f":"SUM(G98:R98)","v":51700417.073228568}]
[]
[]
["Typical Customer Monthly Usage in Dth"]
[null,"Utah",null,null,null,null,{"$f":"VLOOKUP(MONTH(H3),$F$116:$G$127,2,FALSE)","v":6.3},11.5,14.9,12.5,10.1,8.3000000000000007,4.4000000000000004,3.1,2,1.8,2,{"$f":"VLOOKUP(MONTH(G3),$F$116:$G$127,2,FALSE)","v":3.1},{"$f":"SUM(G102:R102)","v":80}]
[null,"Wyoming",null,null,null,null,{"$f":"VLOOKUP(MONTH(H3),$F$116:$H$127,3,FALSE)","v":0},0,0,0,0,0,0,0,0,0,0,{"$f":"VLOOKUP(MONTH(G3),$F$116:$H$127,3,FALSE)","v":0},{"$f":"SUM(G103:R103)","v":0}]
[]
["INPUTS FROM WEXPRO",null,null,null,null,null,{"$f":"G3","v":"Oct19"},{"$f":"H3","v":"Nov19"},"Dec19","Jan20","Feb20","Mar20","Apr20","May20","Jun20","Jul20","Aug20","Sep20","12-Month"]
[null,null,null,null,null,null,null,null,null,null,null,null,null,null,null,null,null,null,"Total"]
["Wexpro I Operator Fee (Wexpro forecast)",null,null,null,"Updated:","2019-08-19",14859104.005244102,14565282.504038252,14474469.933741035,14519360.695875259,14219918.77355185,14182504.265721787,13979078.03978613,14205625.602853157,13892652.501877975,13728783.581454454,13509837.532991933,13368204.314018697,{"$f":"SUM(G107:R107)","v":169504821.75115463}]
[]
["Wexpro II Operator Fee (Wexpro forecast)",null,null,null,"Updated:","2019-08-19",3062547.5727996528,3008995.6741448482,2971908.479418878,2942803.2177546881,2868625.6580266925,2817070.7398981163,2764974.974390497,2729455.8983315174,2700485.1618160126,2670796.6516151805,2751303.7828549244,2890131.233675919,{"$f":"SUM(G109:R109)","v":34179099.044726923}]
[]
[]
[]
[]
[]
[null,null,null,null,null,"Typical UPC","UT"]
[null,null,null,null,null,1,14.9]
[null,null,null,null,null,2,12.5]
[null,null,null,null,null,3,10.1]
[null,null,null,null,null,4,8.3000000000000007]
[null,null,null,null,null,5,4.4000000000000004]
[null,null,null,null,null,6,3.1]
[null,null,null,null,null,7,2]
[null,null,null,null,null,8,1.8]
[null,null,null,null,null,9,2]
[null,null,null,null,null,10,3.1]
[null,null,null,null,null,11,6.3]
[null,null,null,null,null,12,11.5]
[null,null,null,null,null,"Total",{"$f":"SUM(G116:G127)","v":80}]

{"sheet":"Other Inputs","index":2,"n_rows":319,"n_cols":10,"rows_kept":319,"cut":false,"hidden":false,"merged":[[0,7,0,8],[1,0,1,6]]}
[]
["INPUT SECTION",null,null,null,null,null,null,null,null,"Source"]
["INPUTS FROM QUESTAR PIPELINE TARIFF AND CONTRACTS"]
[]
[null,"Storage Commodity Rates",null,null,"Rate","Effective"]
[null,"  Peaking Injections",null,null,3.8719999999999997E-2,"2019-01-01",null,null,null,"QPC Tariff Statement of Rates"]
[null,"  Peaking Withdrawals",null,null,3.8719999999999997E-2,{"$f":"$F$6","v":"2019-01-01"},null,null,null,{"$f":"J6","v":"QPC Tariff Statement of Rates"}]
[null,"  Spire Injections",null,null,1.4999999999999999E-2,{"$f":"$F$6","v":"2019-01-01"}]
[null,"  Spire Withdrawals",null,null,0.01,"2019-01-01"]
[null,"  Clay Basin Injections",null,null,1.0489999999999999E-2,"2019-01-01",null,null,null,"QPC Tariff Statement of Rates"]
[null,"  Clay Basin Withdrawals",null,null,1.7809999999999999E-2,{"$f":"$F$6","v":"2019-01-01"},null,null,null,{"$f":"J10","v":"QPC Tariff Statement of Rates"}]
[]
[null,"Storage Field Reservation Charges"]
[null,"  Peaking Storage Fields Demand (Leroy, Chalk Creek, Coalville)",null,null,2.8737499999999998,{"$f":"$F$6","v":"2019-01-01"},null,null,null,{"$f":"$J$6","v":"QPC Tariff Statement of Rates"}]
[null,"  Spire",null,null,0.09,{"$f":"$F$6","v":"2019-01-01"}]
[null,"  Clay Basin Demand",null,null,2.85338,{"$f":"$F$6","v":"2019-01-01"},null,null,null,{"$f":"$J$6","v":"QPC Tariff Statement of Rates"}]
[null,"  Clay Basin Capacity",null,null,2.3779999999999996E-2,{"$f":"$F$6","v":"2019-01-01"},null,null,null,{"$f":"$J$6","v":"QPC Tariff Statement of Rates"}]
[]
[null,"Peak Hour Service"]
[null,"Kern River",null,28752,3,{"$f":"+F21*E21/E20","v":11.653333333333334}]
[null,"mid Nov - mid Feb",null,null,{"$f":"16+31+31+14","v":92},0.38]
[]
[null,"Dominion Energy Questar Pipeline",null,{"$f":"(142000+49000)/24*8","v":63666.666666666664},3,{"$f":"(1044762+360516)/(D23*E23)","v":7.3574764397905756}]
[null,"mid Nov - mid Feb",null,null,{"$f":"16+31+31+14","v":92},{"$f":"+F23/E24*E23","v":0.23991770999317094}]
[]
[null,null,null,null,null,null,null,null,null,"used in Exhibit 1.3"]
[null,"FIRM TRANSPORTATION",null,"Contract Dth","Months","Maximum Rate","Effective"]
[null,"  T-1 Transportation - Yearly (MT241)",null,{"$f":"798902","v":798902},12,5.2880399999999996,"2019-01-01",null,null,{"$f":"$J$6","v":"QPC Tariff Statement of Rates"}]
[null,"  T-1 Transportation - Yearly (Mainline 104)",null,30000,12,5.2880399999999996,{"$f":"$G$28","v":"2019-01-01"},null,null,{"$f":"$J$6","v":"QPC Tariff Statement of Rates"}]
[null,"  T-1 Transportation - Yearly (Tieline 112)",null,12000,12,5.2880399999999996,{"$f":"$G$28","v":"2019-01-01"},null,null,{"$f":"$J$6","v":"QPC Tariff Statement of Rates"}]
[null,"  T-1 Transportation - Nov-Mar",null,75000,5,6.8088699999999998,{"$f":"$G$28","v":"2019-01-01"}]
[null,"  T-1 Transportation - Yearly (Hyrum)",null,100000,11,5.2880399999999996,{"$f":"$G$28","v":"2019-01-01"},null,null,"Begins November 2019"]
[null,"Total Yearly T-1 Transportation",null,{"$f":"SUM(D28:D32)","v":1015902},12]
[]
[null,"  No-Notice Transportation (BASE TARIFF RATE)",null,203542,12,0.86753000000000002,{"$f":"$G$28","v":"2019-01-01"},null,null,{"$f":"$J$6","v":"QPC Tariff Statement of Rates"}]
[]
[null,"TRANSPORTATION COMMODITY"]
[null,"PIPELINE USAGE CHARGE TO VOLUMETRIC RELEASES"]
[null,"QPC Commodity"]
[null,"  QPC Firm Transportation Usage Charge (Max & Min) (BASE TARIFF RATE)",null,null,null,2.6700000000000001E-3,"2019-01-01",null,null,{"$f":"$J$6","v":"QPC Tariff Statement of Rates"}]
[null,"  QPC  (ANNUAL CHARGE ADJUSTMENT)",null,null,null,1.2999999999999999E-3,"2019-10-01",null,null,"FERC Website"]
[]
[null,null,null,null,"Current","Proposed"]
[null,"INTER TRANS (T-2 PIPELINE BASE TARIFF) MAX",null,"Base Tariff",0.17652000000000001,0.17652000000000001,"2019-01-01",null,null,{"$f":"$J$6","v":"QPC Tariff Statement of Rates"}]
[null,null,null,"Annual Charge",1.2999999999999999E-3,1.2999999999999999E-3,"2019-10-01",null,null,"ferc.gov"]
[null,null,null,"Total",{"$f":"SUM(E44:E45)","v":0.17782000000000001},{"$f":"SUM(F44:F45)","v":0.17782000000000001}]
[]
[]
[null,"Utah",null,null,{"$f":"ROUND((E46)/(1-$E265),5)","v":0.17862},{"$f":"ROUND((F46)/(1-E265),5)","v":0.17862},null,null,null,"Before Adjustment for Bad Debt (Transport grossed up for QGC fuel)"]
[null,"Wyoming",null,null,null,{"$f":"ROUND((F46)/(1-E266),5)","v":0.18053}]
[]
["INPUTS FROM KERN RIVER PIPELINE TARIFF AND CONTRACTS"]
[null,"Kern River 2003 Expansion",null,"Contract Dth","Months","Maximum Rate","Effective"]
[null,null,null,null,null,0.17960000000000001,"2019-04-01",null,null,"KR Tariff 5-A"]
[null,"Jan - Dec      #20029",null,33000,12,{"$f":"(F54*(E58-153))/E55","v":3.1879000000000004}]
[null,"November - March     #20029",null,50000,5,{"$f":"F55","v":3.1879000000000004}]
[null,"Jan - Dec    #1829",null,1885,12,{"$f":"F58*E58/E57","v":15.832549999999999}]
[null,"Days in Tariff Rate",null,null,366,0.51910000000000001,{"$f":"G54","v":"2019-04-01"}]
[]
[null,"Citadel Energy Marketing"]
[null,"Dec - Feb      #20017",null,56925,3,{"$f":"+E62*F62/E61","v":8.7966666666666651}]
[null,"Days in Tariff Rate",null,null,{"$f":"31+31+29","v":91},0.28999999999999998]
[null,"Nov & Mar     #20017",null,6000,2,{"$f":"+F64*E64/E63","v":8.8449999999999989}]
[null,"Days in Tariff Rate",null,null,{"$f":"30+31","v":61},0.28999999999999998]
[null,"Nov - Mar     #20024",null,27000,5,{"$f":"+F66*E66/E65","v":8.8159999999999989}]
[null,"Days in Tariff Rate",null,null,{"$f":"30+31+31+29+31","v":152},0.28999999999999998]
[]
[null,"Kern River 2003 Expansion",null,null,"Days in TEST PERIOD"]
[null,"Jan - Dec",0.67353660204454602,{"$f":"D55+D57","v":34885},366,4.4000000000000003E-3,{"$f":"G58","v":"2019-04-01"},null,null,"KR Tariff 5-A"]
[null,"November - March",{"$f":"C69","v":0.67353660204454602},{"$f":"D56","v":50000},{"$f":"30+31+31+29+31","v":152},4.4000000000000003E-3,{"$f":"G58","v":"2019-04-01"},null,null,"KR Tariff 5-A"]
[]
[null,"Kern River Original System Period Two Rates #20017"]
[null,"Dec - Feb      #20017",{"$f":"+C69","v":0.67353660204454602},56925,{"$f":"31+31+29","v":91},4.4000000000000003E-3,{"$f":"+G70","v":"2019-04-01"},null,null,"KR Tariff 5.01"]
[null,"Nov & Mar     #20017",{"$f":"+C69","v":0.67353660204454602},6000,61,4.4000000000000003E-3,{"$f":"+G70","v":"2019-04-01"},null,null,"KR Tariff 5.01"]
[null,"Kern River 2002 Expansion Period Two Rates #20024"]
[null,"Nov - Mar     #20024",{"$f":"+C69","v":0.67353660204454602},27000,{"$f":"30+31+31+29+31","v":152},4.4000000000000003E-3,{"$f":"+G70","v":"2019-04-01"}]
[]
[]
["INPUTS FROM TARIFF"]
[]
[]
["Current SNG Rates"]
[null,"UTAH",null,null,"Current SNG Base","Current SNG Amort.","Current SNG Total",null,null,"Effective"]
[null,"GS",null,"Winter",1.1390899999999999,2.5899999999999999E-2,{"$f":"E84+F84","v":1.16499},null,null,"2019-08-01"]
[null,null,null,"Summer",0.53481999999999996,1.2160000000000001E-2,{"$f":"E85+F85","v":0.54697999999999991},null,null,{"$f":"J84","v":"2019-08-01"}]
[]
[null,"FS",null,"Winter",1.1094299999999999,2.5229999999999999E-2,{"$f":"E87+F87","v":1.13466},null,null,"2019-08-01"]
[null,null,null,"Summer",0.53481999999999996,1.2160000000000001E-2,{"$f":"E88+F88","v":0.54697999999999991},null,null,{"$f":"J87","v":"2019-08-01"}]
[]
[null,"NGV",null,null,0.82198000000000004,1.8700000000000001E-2,{"$f":"E90+F90","v":0.84068000000000009},null,null,"2019-08-01"]
[]
[null,"(This includes bad debt adjustment) IS",null,null,0.17907000000000001,0,{"$f":"E92+F92","v":0.17907000000000001},null,null,"2019-08-01"]
[]
["Current Rates"]
[null,"Utah GS",null,null,null,null,null,null,null,"Effective"]
[null,"Block 1",null,"Summer",null,null,5.9028700000000001,null,null,"2019-08-01"]
[null,"Block 2",null,"Summer",null,null,4.7660400000000003,null,null,"2019-08-01"]
[null,"Block 1",null,"Winter",null,null,7.1727999999999996,null,null,"2019-08-01"]
[null,"Block 2",null,"Winter",null,null,6.0359699999999998,null,null,"2019-08-01"]
[null,"#1 BSF",null,null,null,null,6.75,null,null,"2019-08-01"]
[]
[null,"Wyoming GS"]
[null,"Block 1",null,null,null,null,6.46035,null,null,"2019-06-01"]
[null,"Block 2",null,null,null,null,6.2042999999999999,null,null,"2019-06-01"]
[null,"BSF",null,null,null,null,12,null,null,"2019-06-01"]
[]
["INPUTS FROM PREVIOUS PASS THROUGH CASE"]
[null,"PRIOR PERIOD COMPANY PRODUCTION AVERAGE GAS COST"]
[null,null,null,null,"PROPOSED","PRIOR CASE","Most Recent"]
[null,"VOLUMES DTH",null,null,{"$f":"+'Monthly Inputs'!S7+'Monthly Inputs'!S13","v":62236745},68888319,"EXH 1.1"]
[null,"AMOUNT",null,null,{"$f":"+D195+D216","v":223281987.82511812},256382692,"EXH 1.1"]
[null,"AVG COST",null,null,{"$f":"+E111/E110","v":3.5876231609657303},{"$f":"ROUND(+F111/F110,5)","v":3.7217199999999999}]
[]
[null,"Utah Cost of Gas by Component"]
[null,"Unit Cost Of Gas (Line 7)",null,null,null,3.2163499999999998]
[null,"191 Account Amortization (Line 8)",null,null,null,6.9220000000000004E-2]
[null,"Total Unit Cost In Rates (Line 9)",null,null,null,{"$f":"SUM(F115:F116)","v":3.2855699999999999}]
[]
[null,"I-2 Commodity Cost (excluding bad debt) ",null,null,0]
[]
[null,"Wyoming Cost of Gas by Component"]
[null,"Unit Cost Of Gas (Line 9)",null,null,null,4.0227599999999999]
[null,"191 Account Amortization (Line 10)",null,null,null,0.26601999999999998]
[null,"Total Unit Cost In Rates (Line 11)",null,null,null,{"$f":"F122+F123","v":4.28878}]
[]
[]
[]
[]
["INPUTS FROM 191 ACCOUNT MONTH END BALANCE ACTUAL OR FORECAST",null,null,null,"Utah","Wyoming"]
[null,null,null,null,2019,"2019-07-31"]
[]
[null,null,null,"current yr /mo(text)"]
[null,"July 2019 191 account (Actual/Forecast)",null,2019,53500538,1142631.74]
[null,"Supplier Non-Gas Cost Under (Over) Collected through July 2019 (act/fcst)",null,"July",3746511]
[null,"Commodity Cost Under (Over) Collected during YEAR  (Act/Fcst)",null,null,{"$f":"E133-E134","v":49754027}]
[]
[null,"SPRING SNG Amortization Balance March 2019",null,-17559983,-20000000,{"$f":"+D137-E137","v":2440017}]
[]
["INPUTS FROM IRP"]
[null,"#1  Peak Day Demand Forecast",null,null,2019,"Source"]
[null,"Utah",null,null,{"$f":"E143-E142","v":1182617},"2019 IRP"]
[null,"Wyoming",null,null,37416]
[null,"System Total Peak Day Demand Forecast",null,null,1220033,"2019-2020 Heating Season"]
[]
[]
["STORAGE FIELD INPUTS",null,null,null,"Storage"]
[null,"Chalk Creek Injections Factor",null,null,9.9000000000000008E-3]
[null,"Chalk Creek Withdrawls Factor",null,null,1.84E-2]
[]
[null,"Spire Injections Factor",null,null,2.5000000000000001E-2]
[null,"Spire Withdrawls Factor",null,null,0]
[]
[null,"Leroy Injections Factor",null,null,2.9499999999999998E-2]
[null,"Leroy Withdrawls Factor",null,null,2.4299999999999999E-2]
[]
[null,"Clay Basin Injections Factor",null,null,2.5000000000000001E-2]
[null,"Clay Basin Withdrawls Factor",null,null,1.55E-2]
[]
[null,"Coalville Injections Factor",null,null,1.0800000000000001E-2]
[null,"Coalville Withdrawls Factor",null,null,2.3900000000000001E-2]
[]
[null,"QPC Storage Field Reservation Charges",null,null,"Monthly Dth"]
[null,"  Peaking Storage Fields Maximum Daily Withdrawal Qty (Leroy, Chalk Creek, Coalville)",null,null,184625]
[null,"  Ryckman Maximum Storage Qty",null,null,{"$f":"2500000","v":2500000}]
[null,"  Clay Basin Minimum Required Deliverability",null,null,111827]
[null,"  Clay Basin Capacity",null,null,13419000]
[]
["OTHER INPUTS",null,null,"Revenue"," "]
[null,"OTHER GATHERING"]
[]
[]
[]
[null,"Total Forecasted Birch Creek",null,269835.70372000005,"2019-07-31"]
[]
[null,"Other gathering ",null,1638069.2432000001,"2019-07-31"]
[null,"Total Gathering",null,{"$f":"SUM(D173:D175)","v":1907904.9469200002}]
[]
[null,"Other Transportation",null,3792842.5483999993,"2019-07-31"]
[]
[null,"Forecast Future Contracts Premium over spot price",null,null,0.02,"Verified with Tina 8/19/19"]
[]
[null,null,null,"Commodity","Demand"]
[null,null,null,"Charge","Charge","Effective"]
[null,"Gathering Rates -System wide Gathering agreement #163 (SWGA)",null,8260977.6868611174,12340512,"2019-01-01"]
[]
[]
[null,"Gathering Rate Wexpro II",null,2549704.1390458588]
[]
[]
["OTHER INPUTS",null,null,"Volume (Dth)","Revenue"]
["WEXPRO I"]
[null,"Questar Gas Production  1/",null,"Current"]
[null,"Test-Year Royalties",null,{"$f":"'Royalty Detail'!I1432","v":15728560.619890928}]
[null,"Operator Service Fee",null,{"$f":"'Monthly Inputs'!S107","v":169504821.75115463}]
[null,"Total Questar Gas Production Costs",null,{"$f":"SUM(D193:D194)","v":185233382.37104556}]
[]
[null,"Total Questar Gas Production Dth",null,{"$f":"'Royalty Detail'!F1437","v":50057758}]
[null,null,null,null,null,"Hot","Hot"]
[null,"Other Revenue Credits",null,1,2,2,2,null,1]
[null,null,null,"Historical","Forecast",{"$f":"HLOOKUP(F$199,$D$199:$E$207,$I200)","v":"Forecast"},{"$f":"HLOOKUP(G$199,$D$199:$E$207,$I200)","v":"Forecast"},null,2]
[null,null,null,"12 Mo Ending","12 Mo Ending","Utah","Wyoming",null,3]
[null,"483  Sales for Resale",null,null,2269440.7199999997,{"$f":"HLOOKUP(F$199,$D$199:$E$207,$I202)","v":2269440.7199999997},2269440.7199999997,null,4]
[null,"490  Incidental Plant Prod Sales",null,null,3053672.9999999995,3053672.9999999995,3053672.9999999995,null,5]
[null,"492  Incidental Gasoline_Oil Sales",null,null,542819.13233315689,542819.13233315689,542819.13233315689,null,6]
[null,"4951 Overriding Royalty Revenue from Celsius",null,null,7921111.0185845168,7921111.0185845168,7921111.0185845168,null,7]
[null,"4952 Oil Revenue Received from Wexpro",null,null,0,0,0,null,8]
[null,"758001 Gas Well Royalities - Other",null,null,-89510.874921737588,-89510.874921737588,-89510.874921737588,null,9]
[]
[]
[null,"Total Other Revenue Credits",null,{"$f":"SUM(D202:D207)","v":0},{"$f":"SUM(E202:E207)","v":13697532.995995935},{"$f":"SUM(F202:F207)","v":13697532.995995935},{"$f":"SUM(G202:G207)","v":13697532.995995935}]
[]
["WEXPRO II"]
[null,"Questar Gas Production  1/",null,"Current"]
[null,"Test-Year Royalties",null,{"$f":"'Royalty Detail'!I1687","v":3869506.4093456282}]
[null,"Operator Service Fee",null,{"$f":"'Monthly Inputs'!S109","v":34179099.044726923}]
[null,"Total Questar Gas Production Costs",null,{"$f":"SUM(D214:D215)","v":38048605.45407255}]
[]
[null,"Total Questar Gas Production Dth",null,{"$f":"'Royalty Detail'!F1692","v":12178987},null,null,null,null,null,"this formula changes each time"]
[null,null,null,null,null,"Hot","Hot"]
[null,"Other Revenue Credits",null,1,2,2,2,null,1]
[null,null,null,"Historical","Forecast",{"$f":"HLOOKUP(F$199,$D$199:$E$207,$I221)","v":"Forecast"},{"$f":"HLOOKUP(G$199,$D$199:$E$207,$I221)","v":"Forecast"},null,2]
[null,null,null,"12 Mo Ending","12 Mo Ending","Utah","Wyoming",null,3]
[null,"483  Sales for Resale",null,null,0,{"$f":"HLOOKUP(F$220,$D$220:$E$228,$I223)","v":0},0,null,4]
[null,"490  Incidental Plant Prod Sales",null,null,480000,480000,480000,null,5]
[null,"492  Incidental Gasoline_Oil Sales",null,null,1457997.7251352277,1457997.7251352277,1457997.7251352277,null,6]
[null,"4951 Overriding Royalty Revenue from Celsius",null,null,0,0,0,null,7]
[null,"4952 Oil Revenue Received from Wexpro",null,null,-216209.26795399844,-216209.26795399844,-216209.26795399844,null,8]
[null,"758001 Gas Well Royalities - Other",null,null,-237507.82942452858,-237507.82942452858,-237507.82942452858,null,9]
[]
[]
[null,"Total Other Revenue Credits",null,{"$f":"SUM(D223:D228)","v":0},{"$f":"SUM(E223:E229)","v":1484280.6277567006},{"$f":"SUM(F223:F228)","v":1484280.6277567006},{"$f":"SUM(G223:G228)","v":1484280.6277567006}]
[]
[null,null,null,null,"Proceeds","Dths","Price"]
[null,"Sales of Wexpro Gas",null,null,0,0,0]
[]
["SUMMARY INPUTS FROM REVRUN, RATE BASE, EXPENSES, ETC."]
[]
[null,"Supplier Non-Gas Costs Recovered at Current Rates  3/",null,null,{"$f":"'RevRun Fcst'!T$199","v":112213609.31}]
[null,"MT Supplier Non-Gas",null,null,{"$f":"'RevRun Fcst'!T142","v":0}]
[null,"Net Supplier Non-Gas",null,null,{"$f":"E238-E239","v":112213609.31}]
[null,"UT Current Int Sales SNG Rate   -   not including Bad Debt adj.",null,null,{"$f":"'RevRun Fcst'!T102+'RevRun Fcst'!T93","v":130911},0.17862]
[]
[null,null,null,null,{"$f":"'Rate Base'!$U$8","v":"2019-07-31"},"update to most current"]
[null,"Account 164-1 - Gas Stored Underground",null,"Dth","Ending Balance","$ per Dth"]
[null,null,null,{"$f":"'Rate Base'!T285","v":-6908613},{"$f":"'Rate Base'!T206","v":33521823.379999973},{"$f":"+E245/D245","v":-4.8521784879251415}]
[]
[]
["UT CET and DSM AMORTIZATION FILING INPUTS"]
[null,null,null,null,"Base DNG","Current DNG"]
[null,"GS Rates (Base rates are before CET, DSM, & EA Amortizations)",null,"Summer Blk 1",1.7266999999999999,2.0703200000000002]
[null,null,null,"Summer Blk 2",0.72670000000000001,0.93349000000000004]
[null,null,null,"Winter Blk 1",2.3494899999999999,2.7222400000000002]
[null,null,null,"Winter Blk 2",1.3494900000000001,1.58541]
[]
[]
[]
["MISCELLANEOUS INPUTS"]
[null,"Test-Year",null,{"$f":"'Control Panel'!E40","v":"2019-10-01"},{"$f":"'Control Panel'!E41","v":"2020-09-30"}]
[]
[null,"Wexpro Red. @ 6.3%",null,null,-6.3E-2]
[]
[null,"Pre-Tax Rate of Return %",null,"WYO",9.1600000000000001E-2,"2015-03-01"]
[null,"Pre-Tax Rate of Return %",null,"UTAH",9.3299999999999994E-2,"2018-03-01"]
[]
[null,"QGC Lost & Unaccounted For % (Utah",null,null,4.4999999999999997E-3,"2016-06-01"]
[null,"QGC Lost & Unaccounted For % (Wyoming)",null,null,1.4999999999999999E-2]
[null,"Gathering Lost & Unaccounted For",null,null,2.1420999999999999E-2,"2016-06-01"]
[null,"QPC Lost & Unaccounted For %",null,null,1.5699999999999999E-2,"2010-04-23"]
[null,"TOTAL",null,null,{"$f":"SUM(E267:E268)","v":3.7121000000000001E-2}]
[]
[null,"Capacity Release Credits",null,null,3857070.84]
[null,"Capacity Release Credit Sharing % in Utah",null,null,0.9,null,null,null,null,"Docket 97-057-03 Stipulation"]
[null,"Capacity Release Credits for Utah",null,null,{"$f":"E271*E272","v":3471363.7560000001}]
[]
[]
[null,"Bad Debt Allowance ",null,null,2.5000000000000001E-3,"verified 9/13/18"]
[]
[null,"30010-135-GR-14"]
[null,null,null,"Non Gas $","Volume - Dth"]
[null,"Wyoming Interruptible Sales",null,33703,170055]
[null,"Wyoming Transportation",null,{"$f":"61957+31917","v":93874},{"$f":"151090+416661","v":567751}]
[null,"Total",null,{"$f":"D280+D281","v":127577},{"$f":"SUM(E280:E281)","v":737806}]
[]
[]
[null,null,null,"DNG Revenue","Dth"]
[null,"12 Months Wyoming IC & IT Volumes and Non-Gas Revenues",null,82276,424210,"Actual - 12 Months Ending July 2019"]
[null,"12 Months Wyoming IS Volumes and Non-Gas Revenues",null,49772,93156,"Actual - 12 Months Ending July 2019"]
[]
[]
[null,"Wyoming Average Customers"]
[null,"GS",null,{"$f":"+'RevRun Fcst'!T243","v":27768}]
[null,"FS",null,{"$f":"+'RevRun Fcst'!T252","v":26}]
[null,"NGV",null,{"$f":"+'RevRun Fcst'!T261","v":1}]
[null,"IS",null,{"$f":"+'RevRun Fcst'!T279","v":4}]
[]
[]
[null,"Transportation Imbalance Charge","Timeframe:","02/01/19-07/31/19",null,{"$f":"+F319","v":353640}]
[]
[]
[null,null,null,null,null,"GL Component"]
[null,null,null,null,2,55388.25]
[null,null,null,null,2,3580.13]
[null,null,null,null,2,397.88]
[null,null,null,null,3,50624.62]
[null,null,null,null,3,3484.2]
[null,null,null,null,3,1216]
[null,null,null,null,4,55794.74]
[null,null,null,null,4,2758.7]
[null,null,null,null,4,510.8]
[null,null,null,null,5,62724.6]
[null,null,null,null,5,4780.3999999999996]
[null,null,null,null,5,114.41]
[null,null,null,null,6,53732.15]
[null,null,null,null,6,5222.68]
[null,null,null,null,6,150.41999999999999]
[null,null,null,null,7,47019.43]
[null,null,null,null,7,6040.75]
[null,null,null,null,7,99.84]
[null,null,null,null,null,{"$f":"SUM(F301:F318)","v":353640}]

{"sheet":"CET & DSM WY","index":3,"n_rows":113,"n_cols":19,"rows_kept":113,"cut":false,"hidden":true,"merged":[[5,5,5,6],[0,0,0,9],[2,11,2,12],[3,0,3,6],[4,3,4,4],[4,5,4,6],[7,14,7,18],[8,0,8,9],[9,15,9,18],[13,1,13,3],[13,5,13,6],[13,8,13,9],[13,11,13,12],[79,0,79,6],[97,0,97,6],[21,0,21,8],[28,0,28,8],[33,0,33,8],[38,0,38,8],[43,0,43,6],[61,0,61,6]]}
["Rate Caclulation for the CET and DSM Amortizations WY"]
[]
[null,null,null,null,null,null,null,null,null,null,null,"Solver Cells"]
["CET Amortization % Calculation",null,null,null,null,null,null,null,null,null,null,"% Change","Difference"]
[null,"Balance","Date","GS Dth",null,"Amortization per Dth",null,null,null,null,null,{"$f":"J20/D20","v":{"$error":"#REF!"}},{"$f":"G20-B11","v":{"$error":"#REF!"}},null,"-> Difference should be at 0 (Use Goal Seek to Get Difference to Equal 0."]
["DSM Balance",{"$f":"'Other Inputs'!#REF!","v":{"$error":"#REF!"}},{"$f":"'Other Inputs'!#REF!","v":{"$error":"#REF!"}},{"$f":"B20","v":{"$error":"#REF!"}},null,{"$f":"B6/D6","v":{"$error":"#REF!"}}]
[]
[null,null,null,null,null,null,null,null,null,null,null,null,null,null,"Typical Bill Rates"]
["CET Amortization Calculation"]
[null,"Balance","Date","DNG Rev",null,"New DNG",null,null,"% Change",null,null,null,null,null,"Current","Proposed"]
["CET Balance",{"$f":"'Other Inputs'!#REF!","v":{"$error":"#REF!"}},{"$f":"'Other Inputs'!#REF!","v":{"$error":"#REF!"}},{"$f":"D20","v":{"$error":"#REF!"}},null,{"$f":"D11+B11","v":{"$error":"#REF!"}},null,null,{"$f":"L5","v":{"$error":"#REF!"}},null,null,null,null,null,"Effective",null,null,"SNG &","CET, DSM"]
[null,null,null,null,null,null,null,null,null,null,null,null,null,null,{"$f":"'Other Inputs'!$J$103","v":"2019-06-01"},"CET Only","DSM Only","Commodity","Commodity"]
[null,null,null,null,null,null,null,null,null,null,null,null,null,null,"BSF","BSF","BSF","BSF","BSF"]
[null,"Revenue Calculation",null,null,null,"CET Amortization",null,null,"Total DNG",null,null,"REVRUN Calculation",null,null,{"$f":"'Other Inputs'!$G$105","v":12},{"$f":"'Other Inputs'!$G$105","v":12},{"$f":"'Other Inputs'!$G$105","v":12},{"$f":"'Other Inputs'!$G$105","v":12},{"$f":"#REF!","v":{"$error":"#REF!"}}]
["WY GS","Dth","Base DNG","DNG Revenue",null,"CET Rate","Revenue",null,"DNG Rate","Revenue",null,"CET Rate","CET Amort"]
["Block 1 ",{"$f":"'Other Inputs'!#REF!","v":{"$error":"#REF!"}},{"$f":"'Other Inputs'!#REF!","v":{"$error":"#REF!"}},{"$f":"B16*C16","v":{"$error":"#REF!"}},null,{"$f":"ROUND((G16/B16),5)","v":{"$error":"#REF!"}},{"$f":"D16*$L$5","v":{"$error":"#REF!"}},null,{"$f":"C16+F16","v":{"$error":"#REF!"}},{"$f":"I16*B16","v":{"$error":"#REF!"}},null,{"$f":"ROUND(F16,5)","v":{"$error":"#REF!"}},{"$f":"B16*L16","v":{"$error":"#REF!"}},null,{"$f":"'Other Inputs'!$G$96","v":5.9028700000000001},{"$f":"J24","v":{"$error":"#REF!"}},{"$f":"J31","v":{"$error":"#REF!"}},{"$f":"J36","v":{"$error":"#REF!"}},{"$f":"J41","v":{"$error":"#REF!"}}]
["Block 2 ",{"$f":"'Other Inputs'!#REF!","v":{"$error":"#REF!"}},{"$f":"'Other Inputs'!#REF!","v":{"$error":"#REF!"}},{"$f":"B17*C17","v":{"$error":"#REF!"}},null,{"$f":"ROUND((G17/B17),5)","v":{"$error":"#REF!"}},{"$f":"D17*$L$5","v":{"$error":"#REF!"}},null,{"$f":"C17+F17","v":{"$error":"#REF!"}},{"$f":"I17*B17","v":{"$error":"#REF!"}},null,{"$f":"ROUND(F17,5)","v":{"$error":"#REF!"}},{"$f":"B17*L17","v":{"$error":"#REF!"}}]
[null,null,null,null,null,null,null,null,null,null,null,null,null,null,{"$f":"'Other Inputs'!$G$103","v":6.46035},{"$f":"J24","v":{"$error":"#REF!"}},{"$f":"J31","v":{"$error":"#REF!"}},{"$f":"J36","v":{"$error":"#REF!"}},{"$f":"J41","v":{"$error":"#REF!"}}]
[]
["GS-1 Block Rev",{"$f":"SUM(B16:B19)","v":{"$error":"#REF!"}},null,{"$f":"SUM(D16:D19)","v":{"$error":"#REF!"}},null,null,{"$f":"SUM(G16:G19)","v":{"$error":"#REF!"}},null,null,{"$f":"B11","v":{"$error":"#REF!"}},null,null,{"$f":"SUM(M16:M19)","v":{"$error":"#REF!"}}]
[]
["Total Rate Calculation With CET Amortization Only",null,null,null,null,null,null,null,null,{"$f":"'Control Panel'!#REF!","v":{"$error":"#REF!"}},null,{"$f":"'Other Inputs'!$J$103","v":"2019-06-01"}]
["WY GS","Total DNG","CET","DSM",null,"Total DNG","Core Commodity Cost",null,null,"Total Rate",null,"Total Rate"]
["Block 1 ",{"$f":"$C$16","v":{"$error":"#REF!"}},{"$f":"$F$16","v":{"$error":"#REF!"}},6.7919999999999994E-2,null,{"$f":"SUM(B24:D24)","v":{"$error":"#REF!"}},4.9688400000000001,null,null,{"$f":"SUM(F24:G24)","v":{"$error":"#REF!"}},null,{"$f":"'Other Inputs'!G103","v":6.46035},{"$f":"J24-L24","v":{"$error":"#REF!"}}]
["Block 2 ",{"$f":"$C$17","v":{"$error":"#REF!"}},{"$f":"$F$17","v":{"$error":"#REF!"}},{"$f":"$D$24","v":6.7919999999999994E-2},null,{"$f":"SUM(B25:D25)","v":{"$error":"#REF!"}},{"$f":"G24","v":4.9688400000000001},null,null,{"$f":"SUM(F25:G25)","v":{"$error":"#REF!"}},null,{"$f":"'Other Inputs'!$G$104","v":6.2042999999999999},{"$f":"J25-L25","v":{"$error":"#REF!"}}]
[]
[]
[]
["Total Rate Calculation With DSM Amortization Only",null,null,null,null,null,null,null,null,{"$f":"J22","v":{"$error":"#REF!"}},null,{"$f":"'Other Inputs'!$J$103","v":"2019-06-01"}]
["WY GS","Base DNG","CET","DSM",null,"Total DNG","Core Commodity Cost",null,null,"Total Rate",null,"Total Rate"]
["Block 1 ",{"$f":"$C$16","v":{"$error":"#REF!"}},4.505E-2,{"$f":"$F$6","v":{"$error":"#REF!"}},null,{"$f":"ROUND(SUM(B31:D31),5)","v":{"$error":"#REF!"}},{"$f":"G24","v":4.9688400000000001},null,null,{"$f":"SUM(F31:I31)","v":{"$error":"#REF!"}},null,{"$f":"'Other Inputs'!$G$96","v":5.9028700000000001},{"$f":"J31-L31","v":{"$error":"#REF!"}}]
["Block 2 ",{"$f":"$C$17","v":{"$error":"#REF!"}},2.8479999999999998E-2,{"$f":"$F$6","v":{"$error":"#REF!"}},null,{"$f":"ROUND(SUM(B32:D32),5)","v":{"$error":"#REF!"}},{"$f":"G25","v":4.9688400000000001},null,null,{"$f":"SUM(F32:I32)","v":{"$error":"#REF!"}},null,{"$f":"'Other Inputs'!$G$104","v":6.2042999999999999},{"$f":"J32-L32","v":{"$error":"#REF!"}}]
[]
["Total Rate Calculation With Core Commodity Cost Changes Only",null,null,null,null,null,null,null,null,{"$f":"J22","v":{"$error":"#REF!"}},null,{"$f":"'Other Inputs'!$J$103","v":"2019-06-01"}]
["WY GS","Base DNG","CET","DSM",null,"Total DNG","Core Commodity Cost",null,null,"Total Rate",null,"Total Rate"]
["Block 1 ",{"$f":"$C$16","v":{"$error":"#REF!"}},{"$f":"C31","v":4.505E-2},{"$f":"D24","v":6.7919999999999994E-2},null,{"$f":"SUM(B36:D36)","v":{"$error":"#REF!"}},{"$f":"#REF!","v":{"$error":"#REF!"}},null,null,{"$f":"SUM(F36:I36)","v":{"$error":"#REF!"}},null,{"$f":"'Other Inputs'!$G$96","v":5.9028700000000001},{"$f":"J36-L36","v":{"$error":"#REF!"}}]
["Block 2 ",{"$f":"$C$17","v":{"$error":"#REF!"}},{"$f":"C32","v":2.8479999999999998E-2},{"$f":"D25","v":6.7919999999999994E-2},null,{"$f":"SUM(B37:D37)","v":{"$error":"#REF!"}},{"$f":"#REF!","v":{"$error":"#REF!"}},null,null,{"$f":"SUM(F37:I37)","v":{"$error":"#REF!"}},null,{"$f":"'Other Inputs'!$G$104","v":6.2042999999999999},{"$f":"J37-L37","v":{"$error":"#REF!"}}]
[]
["Total Rate Calculation",null,null,null,null,null,null,null,null,{"$f":"J29","v":{"$error":"#REF!"}},null,{"$f":"'Other Inputs'!$J$103","v":"2019-06-01"}]
["WY GS","Base DNG","CET","DSM",null,"Total DNG","Core Commodity Cost",null,null,"Total Rate",null,"Total Rate"]
["Block 1 ",{"$f":"$C$16","v":{"$error":"#REF!"}},{"$f":"$F$16","v":{"$error":"#REF!"}},{"$f":"$F$6","v":{"$error":"#REF!"}},null,{"$f":"SUM(B41:D41)","v":{"$error":"#REF!"}},{"$f":"#REF!","v":{"$error":"#REF!"}},null,null,{"$f":"SUM(F41:I41)","v":{"$error":"#REF!"}},null,{"$f":"'Other Inputs'!$G$96","v":5.9028700000000001},{"$f":"J41-L41","v":{"$error":"#REF!"}}]
["Block 2 ",{"$f":"$C$17","v":{"$error":"#REF!"}},{"$f":"$F$17","v":{"$error":"#REF!"}},{"$f":"$F$6","v":{"$error":"#REF!"}},null,{"$f":"SUM(B42:D42)","v":{"$error":"#REF!"}},{"$f":"#REF!","v":{"$error":"#REF!"}},null,null,{"$f":"SUM(F42:I42)","v":{"$error":"#REF!"}},null,{"$f":"'Other Inputs'!$G$104","v":6.2042999999999999},{"$f":"J42-L42","v":{"$error":"#REF!"}}]
[]
["Typical Customer Difference - CET Amortization Only"]
[null,"Typical"]
["GS","Dth",{"$f":"O12","v":"2019-06-01"},{"$f":"J39","v":{"$error":"#REF!"}},null,"Change","% Change"]
["January",14.7,{"$f":"ROUND($O$14+(B47*$O$18),2)","v":106.97},{"$f":"ROUND($P$14+(B47*$P$18),2)","v":{"$error":"#REF!"}},null,{"$f":"D47-C47","v":{"$error":"#REF!"}}]
["February",14.1,{"$f":"ROUND($O$14+(B48*$O$18),2)","v":103.09},{"$f":"ROUND($P$14+(B48*$P$18),2)","v":{"$error":"#REF!"}},null,{"$f":"D48-C48","v":{"$error":"#REF!"}}]
["March",11.8,{"$f":"ROUND($O$14+(B49*$O$18),2)","v":88.23},{"$f":"ROUND($P$14+(B49*$P$18),2)","v":{"$error":"#REF!"}},null,{"$error":"#REF!"}]
["April",9.4,{"$f":"ROUND($O$14+(B50*$O$16),2)","v":67.489999999999995},{"$f":"ROUND($P$14+(B50*$P$16),2)","v":{"$error":"#REF!"}},null,{"$error":"#REF!"}]
["May",5.8,46.24,{"$f":"ROUND($P$14+(B51*$P$16),2)","v":{"$error":"#REF!"}},null,{"$error":"#REF!"}]
["June",3.7,33.840000000000003,{"$error":"#REF!"},null,{"$error":"#REF!"}]
["July",2.2999999999999998,25.58,{"$error":"#REF!"},null,{"$error":"#REF!"}]
["August",1.7,22.03,{"$error":"#REF!"},null,{"$error":"#REF!"}]
["September",2.1,24.4,{"$error":"#REF!"},null,{"$error":"#REF!"}]
["October",4.0999999999999996,36.200000000000003,{"$error":"#REF!"},null,{"$error":"#REF!"}]
["November",8,{"$f":"ROUND($O$14+(B57*$O$18),2)","v":63.68},{"$f":"ROUND($P$14+(B57*$P$18),2)","v":{"$error":"#REF!"}},null,{"$error":"#REF!"}]
["December",12.3,{"$f":"ROUND($O$14+(B58*$O$18),2)","v":91.46},{"$f":"ROUND($P$14+(B58*$P$18),2)","v":{"$error":"#REF!"}},null,{"$error":"#REF!"}]
[null,{"$f":"SUM(B47:B58)","v":89.999999999999986},{"$f":"SUM(C47:C58)","v":709.21},{"$f":"SUM(D47:D58)","v":{"$error":"#REF!"}},null,{"$f":"SUM(F47:F58)","v":{"$error":"#REF!"}},{"$f":"F59/C59","v":{"$error":"#REF!"}}]
[]
[]
["Typical Customer Difference - DSM Amortization Only"]
[null,"Typical"]
["GS","Dth",{"$f":"C46","v":"2019-06-01"},{"$f":"D46","v":{"$error":"#REF!"}},null,"Change","% Change"]
["January",14.7,{"$f":"ROUND($O$14+(B65*$O$18),2)","v":106.97},{"$f":"ROUND($Q$14+(B65*$Q$18),2)","v":{"$error":"#REF!"}},null,{"$f":"D65-C65","v":{"$error":"#REF!"}}]
["February",14.1,{"$f":"ROUND($O$14+(B66*$O$18),2)","v":103.09},{"$f":"ROUND($Q$14+(B66*$Q$18),2)","v":{"$error":"#REF!"}},null,{"$f":"D66-C66","v":{"$error":"#REF!"}}]
["March",11.8,{"$f":"ROUND($O$14+(B67*$O$18),2)","v":88.23},{"$f":"ROUND($Q$14+(B67*$Q$18),2)","v":{"$error":"#REF!"}},null,{"$error":"#REF!"}]
["April",9.4,{"$f":"ROUND($O$14+(B68*$O$16),2)","v":67.489999999999995},{"$f":"ROUND($Q$14+(B68*$Q$16),2)","v":{"$error":"#REF!"}},null,{"$error":"#REF!"}]
["May",5.8,46.24,{"$error":"#REF!"},null,{"$error":"#REF!"}]
["June",3.7,33.840000000000003,{"$error":"#REF!"},null,{"$error":"#REF!"}]
["July",2.2999999999999998,25.58,{"$error":"#REF!"},null,{"$error":"#REF!"}]
["August",1.7,22.03,{"$error":"#REF!"},null,{"$error":"#REF!"}]
["September",2.1,24.4,{"$error":"#REF!"},null,{"$error":"#REF!"}]
["October",4.0999999999999996,36.200000000000003,{"$error":"#REF!"},null,{"$error":"#REF!"}]
["November",8,{"$f":"ROUND($O$14+(B75*$O$18),2)","v":63.68},{"$f":"ROUND($Q$14+(B75*$Q$18),2)","v":{"$error":"#REF!"}},null,{"$error":"#REF!"}]
["December",12.3,{"$f":"ROUND($O$14+(B76*$O$18),2)","v":91.46},{"$f":"ROUND($Q$14+(B76*$Q$18),2)","v":{"$error":"#REF!"}},null,{"$error":"#REF!"}]
[null,{"$f":"SUM(B65:B76)","v":89.999999999999986},{"$f":"SUM(C65:C76)","v":709.21},{"$f":"SUM(D65:D76)","v":{"$error":"#REF!"}},null,{"$f":"SUM(F65:F76)","v":{"$error":"#REF!"}},{"$f":"F77/C77","v":{"$error":"#REF!"}}]
[]
[]
["Typical Customer Difference - SNG and Commodity Changes Only"]
[null,"Typical"]
["GS","Dth",{"$f":"C64","v":"2019-06-01"},{"$f":"D64","v":{"$error":"#REF!"}},null,"Change","% Change"]
["January",14.7,{"$f":"ROUND($O$14+(B83*$O$18),2)","v":106.97},{"$f":"ROUND($R$14+(B83*$R$18),2)","v":{"$error":"#REF!"}},null,{"$f":"D83-C83","v":{"$error":"#REF!"}}]
["February",14.1,{"$f":"ROUND($O$14+(B84*$O$18),2)","v":103.09},{"$f":"ROUND($R$14+(B84*$R$18),2)","v":{"$error":"#REF!"}},null,{"$f":"D84-C84","v":{"$error":"#REF!"}}]
["March",11.8,{"$f":"ROUND($O$14+(B85*$O$18),2)","v":88.23},{"$f":"ROUND($R$14+(B85*$R$18),2)","v":{"$error":"#REF!"}},null,{"$error":"#REF!"}]
["April",9.4,{"$f":"ROUND($O$14+(B86*$O$16),2)","v":67.489999999999995},{"$f":"ROUND($R$14+(B86*$R$16),2)","v":{"$error":"#REF!"}},null,{"$error":"#REF!"}]
["May",5.8,46.24,{"$error":"#REF!"},null,{"$error":"#REF!"}]
["June",3.7,33.840000000000003,{"$error":"#REF!"},null,{"$error":"#REF!"}]
["July",2.2999999999999998,25.58,{"$error":"#REF!"},null,{"$error":"#REF!"}]
["August",1.7,22.03,{"$error":"#REF!"},null,{"$error":"#REF!"}]
["September",2.1,24.4,{"$error":"#REF!"},null,{"$error":"#REF!"}]
["October",4.0999999999999996,36.200000000000003,{"$error":"#REF!"},null,{"$error":"#REF!"}]
["November",8,{"$f":"ROUND($O$14+(B93*$O$18),2)","v":63.68},{"$f":"ROUND($R$14+(B93*$R$18),2)","v":{"$error":"#REF!"}},null,{"$error":"#REF!"}]
["December",12.3,{"$f":"ROUND($O$14+(B94*$O$18),2)","v":91.46},{"$f":"ROUND($R$14+(B94*$R$18),2)","v":{"$error":"#REF!"}},null,{"$error":"#REF!"}]
[null,{"$f":"SUM(B83:B94)","v":89.999999999999986},{"$f":"SUM(C83:C94)","v":709.21},{"$f":"SUM(D83:D94)","v":{"$error":"#REF!"}},null,{"$f":"SUM(F83:F94)","v":{"$error":"#REF!"}},{"$f":"F95/C95","v":{"$error":"#REF!"}}]
[]
[]
["Typical Customer Difference - CET & DSM Amort, SNG and Commodity Changes"]
[null,"Typical"]
["GS","Dth",{"$f":"C46","v":"2019-06-01"},{"$f":"D46","v":{"$error":"#REF!"}},null,"Change","% Change"]
["January",14.7,{"$f":"ROUND($O$14+(B101*$O$18),2)","v":106.97},{"$f":"ROUND($S$14+(B101*$S$18),2)","v":{"$error":"#REF!"}},null,{"$f":"D101-C101","v":{"$error":"#REF!"}}]
["February",14.1,{"$f":"ROUND($O$14+(B102*$O$18),2)","v":103.09},{"$f":"ROUND($S$14+(B102*$S$18),2)","v":{"$error":"#REF!"}},null,{"$f":"D102-C102","v":{"$error":"#REF!"}}]
["March",11.8,{"$f":"ROUND($O$14+(B103*$O$18),2)","v":88.23},{"$f":"ROUND($S$14+(B103*$S$18),2)","v":{"$error":"#REF!"}},null,{"$error":"#REF!"}]
["April",9.4,{"$f":"ROUND($O$14+(B104*$O$16),2)","v":67.489999999999995},{"$f":"ROUND($S$14+(B104*$S$16),2)","v":{"$error":"#REF!"}},null,{"$error":"#REF!"}]
["May",5.8,46.24,{"$error":"#REF!"},null,{"$error":"#REF!"}]
["June",3.7,33.840000000000003,{"$error":"#REF!"},null,{"$error":"#REF!"}]
["July",2.2999999999999998,25.58,{"$error":"#REF!"},null,{"$error":"#REF!"}]
["August",1.7,22.03,{"$error":"#REF!"},null,{"$error":"#REF!"}]
["September",2.1,24.4,{"$error":"#REF!"},null,{"$error":"#REF!"}]
["October",4.0999999999999996,36.200000000000003,{"$error":"#REF!"},null,{"$error":"#REF!"}]
["November",8,{"$f":"ROUND($O$14+(B111*$O$18),2)","v":63.68},{"$f":"ROUND($S$14+(B111*$S$18),2)","v":{"$error":"#REF!"}},null,{"$error":"#REF!"}]
["December",12.3,{"$f":"ROUND($O$14+(B112*$O$18),2)","v":91.46},{"$f":"ROUND($S$14+(B112*$S$18),2)","v":{"$error":"#REF!"}},null,{"$error":"#REF!"}]
[null,{"$f":"SUM(B101:B112)","v":89.999999999999986},{"$f":"SUM(C101:C112)","v":709.21},{"$f":"SUM(D101:D112)","v":{"$error":"#REF!"}},null,{"$f":"SUM(F101:F112)","v":{"$error":"#REF!"}},{"$f":"F113/C113","v":{"$error":"#REF!"}}]

{"sheet":"WY Tariff Sheets","index":4,"n_rows":50,"n_cols":62,"rows_kept":50,"cut":false,"hidden":true,"merged":[[4,2,4,3],[5,2,5,3],[3,11,3,12],[4,11,4,12],[10,51,10,54],[7,19,7,20],[8,19,8,20],[9,19,9,20],[7,17,7,18],[9,17,9,18],[8,58,8,61],[9,58,9,61],[10,58,10,61],[7,21,7,22],[9,21,9,22],[46,25,47,26],[59,43,60,44],[38,50,39,51],[41,31,42,32],[37,1,38,2],[37,16,38,17],[12,51,12,54],[13,51,13,54],[7,44,7,47],[7,51,7,54],[8,51,8,54],[9,51,9,54],[0,57,0,61],[3,17,3,19],[6,44,6,47],[6,51,6,54],[5,17,5,18],[4,17,4,18],[0,16,0,22],[0,25,0,28],[0,31,0,35],[0,37,0,40],[0,43,0,47],[0,50,0,54],[6,17,6,18],[6,19,6,20],[6,21,6,22]]}
[]
[null,null,null,null,null,null,null,null,null,null,null,null,null,null,null,null,null,null,null,"Rates Per Dth Used Each Month"]
[null,"2.02 General Service Rate Schedule (GS)",null,null,null,null,null,null,null,null,"2.02 General Service Rate Schedule (GS)",null,null,null,null,null,"2.03 Firm Sales Service Rate Schedule (FS)",null,null,"Dth = decatherm = 10 therms = 1,000,000 BTU",null,null,null,null,null,"4.02 INTERRUPTIBLE SALES RATE SERVICE  SCHEDULE (IS)",null,null,null,null,null,null,null,null,null,null,null,null,null,null,null,null,null,null,null,null,null,null,null,null,null,null,null,null,null,null,null,"2.04 NATURAL GAS VEHICLE RATE (NGV)"]
[null,null,null,null,null,null,null,null,null,null,null,"Rates Per Dth Used Each Month",null,null,null,null,null,"Summer Rates: Apr. 1 - Oct. 31"]
[null,null,"Rates Per Dth Used Each Month",null,null,null,null,null,null,null,null,"Dth = decatherm = 10 therms = 1,000,000 BTU",null,null,null,null,null,"First",null,"Next",null,"All Over",null,null,null,"IS VOLUMETRIC RATES","Rates Per Dth Used Each Month",null,null,null,null,null,null,null,null,null,null,null,null,null,null,null,null,null,null,null,null,null,null,null,null,null,null,null,null,null,null,"NGV Volumetric Rate"]
[null,null,"Dth = decatherm = 10 therms = 1,000,000 BTU",null,null,null,null,null,null,null,null,"First 45 Dth","All Over 45 Dth",null,null,null,null,80,null,730,null,810,null,null,null,null,"Dth = decatherm = 10 therms = 1,000,000 BTU",null,null,null,null,null,null,null,null,null,null,null,null,null,null,null,null,null,null,null,null,null,null,null,null,null,null,null,null,null,null,null,null,null,null,"Rates Per Dth Used Each Month"]
[null,null,"First 45 Dth","All Over 45 Dth",null,null,null,null,null,null,"Non-Gas Cost",{"$f":"'CET & DSM WY'!B31","v":{"$error":"#REF!"}},{"$f":"'CET & DSM WY'!B32","v":{"$error":"#REF!"}},null,null,null,"Non Gas Cost",{"$f":"#REF!","v":{"$error":"#REF!"}},null,{"$f":"#REF!","v":{"$error":"#REF!"}},null,{"$f":"#REF!","v":{"$error":"#REF!"}},null,null,null,null,"First","Next","All Over",null,null,null,null,null,null,null,null,null,null,null,null,null,null,null,null,null,null,null,null,null,null,null,null,null,null,null,null,null,null,null,null,"Dth = decatherm = 10 therms = 1,000,000 BTU"]
[null,"Non-Gas Cost",{"$f":"'CET & DSM WY'!B24","v":{"$error":"#REF!"}},{"$f":"'CET & DSM WY'!B25","v":{"$error":"#REF!"}},null,null,null,null,null,null,"Conservation Enabling Adjustment",{"$f":"ROUND('CET & DSM WY'!C31,5)","v":4.505E-2},{"$f":"'CET & DSM WY'!C32","v":2.8479999999999998E-2},null,null,null,"Core Service Commodity Cost",{"$f":"#REF!","v":{"$error":"#REF!"}},null,{"$f":"#REF!","v":{"$error":"#REF!"}},null,{"$f":"#REF!","v":{"$error":"#REF!"}},null,null,null,null,48600,72900,121500]
[null,"Conservation Enabling Adjustment",{"$f":"'CET & DSM WY'!C24","v":{"$error":"#REF!"}},{"$f":"'CET & DSM WY'!C25","v":{"$error":"#REF!"}},null,null,null,null,null,null,"Energy Efficiency Services",{"$f":"'CET & DSM WY'!D31","v":{"$error":"#REF!"}},{"$f":"'CET & DSM WY'!D32","v":{"$error":"#REF!"}},null,null,null,null,null,null,null,null,null,null,null,null,"Distribution Non-Gas Rate",{"$f":"#REF!","v":{"$error":"#REF!"}},{"$f":"#REF!","v":{"$error":"#REF!"}},{"$f":"#REF!","v":{"$error":"#REF!"}},null,null,null,null,null,null,null,null,null,null,null,null,null,null,null,null,null,null,null,null,null,null,null,null,null,null,null,null,"Non-Gas Cost",{"$f":"#REF!","v":{"$error":"#REF!"}}]
[null,"Energy Efficiency Services",{"$f":"'CET & DSM WY'!D24","v":6.7919999999999994E-2},{"$f":"'CET & DSM WY'!D25","v":6.7919999999999994E-2},null,null,null,null,null,null,"Core Service Commodity Cost",{"$f":"'CET & DSM WY'!G31","v":4.9688400000000001},{"$f":"ROUND('CET & DSM WY'!G32,5)","v":4.9688400000000001},null,null,null,"Total Rate",{"$f":"SUM(R7:R8)","v":{"$error":"#REF!"}},null,{"$f":"SUM(T7:T8)","v":{"$error":"#REF!"}},null,{"$f":"SUM(V7:V8)","v":{"$error":"#REF!"}},null,null,null,"Upstream Pipeline Cost",{"$f":"#REF!","v":{"$error":"#REF!"}},{"$f":"#REF!","v":{"$error":"#REF!"}},{"$f":"#REF!","v":{"$error":"#REF!"}},null,null,null,null,null,null,null,null,null,null,null,null,null,null,null,null,null,null,null,null,null,null,null,null,null,null,null,null,"Core Commodity Cost",{"$f":"#REF!","v":{"$error":"#REF!"}}]
[null,"Core Service Commodity Cost",{"$f":"'CET & DSM WY'!G24","v":4.9688400000000001},{"$f":"'CET & DSM WY'!G25","v":4.9688400000000001},null,null,null,null,null,null,null,null,null,null,null,null,null,null,null,null,null,null,null,null,null,"Commodity Rate",null,null,null,null,null,null,null,null,null,null,null,null,null,null,null,null,null,null,null,null,null,null,null,null,null,null,null,null,null,null,null,"Total Rate",{"$f":"SUM(BG9:BJ10)","v":{"$error":"#REF!"}}]
[null,null,null,null,null,null,null,null,null,null,"Total Rate",{"$f":"SUM(L7:L10)","v":{"$error":"#REF!"}},{"$f":"SUM(M7:M10)","v":{"$error":"#REF!"}},null,null,null,"Minimum Monthly Distribution Non-Gas Charge",null,null,null,null,null,{"$f":"#REF!","v":{"$error":"#REF!"}}]
[null,"Total Rate",{"$f":"SUM(C8:C11)","v":{"$error":"#REF!"}},{"$f":"SUM(D8:D11)","v":{"$error":"#REF!"}}]
[]
[null,null,null,null,null,null,null,null,null,null,null,null,"BSF Category 1",{"$f":"E16","v":12}]
[null,null,null,"BSF Category 1",{"$f":"'CET & DSM WY'!O14","v":12},null,null,null,null,null,null,null,"BSF Category 2",{"$f":"E17","v":44},null,null,null,null,null,null,"BSF Category 1",null,{"$f":"'Other Inputs'!G105","v":12}]
[null,null,null,"BSF Category 2",44,null,null,null,null,null,null,null,"BSF Category 3",{"$f":"E18","v":86},null,null,null,null,null,null,"BSF Category 2",null,{"$f":"#REF!","v":{"$error":"#REF!"}}]
[null,null,null,"BSF Category 3",86,null,null,null,null,null,null,null,"BSF Category 4",{"$f":"E19","v":555},null,null,null,null,null,null,"BSF Category 3",null,{"$f":"#REF!","v":{"$error":"#REF!"}},null,null,"Total Rate","$","$","$"]
[null,null,null,"BSF Category 4",555,null,null,null,null,null,null,null,null,null,null,null,null,null,null,null,"BSF Category 4",null,{"$f":"#REF!","v":{"$error":"#REF!"}}]
[null,null,null,null,null,null,null,null,null,null,null,null,null,null,null,null,null,null,null,null,null,null,null,null,null,"Minimum Monthly Distribution Non-Gas Charge"]
[]
[]
[null,null,null,null,null,null,null,null,null,null,null,null,null,null,null,null,null,null,null,null,null,null,null,null,null,null,null,null,null,null,null,null,null,null,null,null,null,null,null,null,null,null,null,null,null,null,null,null,null,null,null,null,null,null,null,null,null,{"$f":"B38","v":"Issued by R. W. Jibson, President"},null,null,"Advice No","Section Revision No."]
[null,null,null,null,null,null,null,null,null,null,null,null,null,null,null,null,null,null,null,null,null,null,null,null,null,null,null,"BSF Category 1",{"$f":"'Other Inputs'!G105","v":12}]
[null,null,null,null,null,null,null,null,null,null,null,null,null,null,null,null,null,null,null,null,null,null,null,null,null,null,null,"BSF Category 2",{"$f":"#REF!","v":{"$error":"#REF!"}}]
[null,null,null,null,null,null,null,null,null,null,null,null,null,null,null,null,null,null,null,null,null,null,null,null,null,null,null,"BSF Category 3",{"$f":"#REF!","v":{"$error":"#REF!"}}]
[null,null,null,null,null,null,null,null,null,null,null,null,null,null,null,null,null,null,null,null,null,null,null,null,null,null,null,"BSF Category 4",{"$f":"#REF!","v":{"$error":"#REF!"}}]
[]
[]
[]
[]
[]
[]
[]
[]
[]
[null,null,null,null,null,null,null,null,null,null,"Issued by R. W. Jibson, President",null,"Section Revision No.","Effective Date"]
[null,"Issued by R. W. Jibson, President",null,"Section Revision No.","Effective Date",null,null,null,null,null,null,null,null,null,null,null,{"$f":"B38","v":"Issued by R. W. Jibson, President"},null,null,"Advice No","Section Revision No.",null,"Effective Date"]
[]
[]
[]
[null,"New CET ONLY",null,null,null,null,null,null,null,null,"New DSM ONLY",null,null,null,null,null,"New Pass Through Values"]
[]
[]
[]
[]
[null,null,null,null,null,null,null,null,null,null,null,null,null,null,null,null,null,null,null,null,null,null,null,null,null,{"$f":"B38","v":"Issued by R. W. Jibson, President"},null,null,"Advice No"]
[]
[]
[null,null,null,null,null,null,null,null,null,null,null,null,null,null,null,null,null,null,null,null,null,null,null,null,null,"New Pass Through Values"]

{"sheet":"Calculations","index":5,"n_rows":262,"n_cols":17,"rows_kept":262,"cut":false,"hidden":false,"merged":[[4,0,4,1],[5,0,5,1],[2,3,2,15]]}
["GAS BALANCE FOR 12 MONTHS ENDING: _________________"]
[]
[null,null,null,"SALES VOLUMES IN DEKATHERMS (12 Months of Forecast)"]
[null,null,null,"Forecast","Forecast","Forecast","Forecast","Forecast","Forecast","Forecast","Forecast","Forecast","Forecast","Forecast","Forecast","12-Month"]
["RATE CLASS",null,null,{"$f":"+'Monthly Inputs'!G3","v":"Oct19"},{"$f":"+'Monthly Inputs'!H3","v":"Nov19"},{"$f":"+'Monthly Inputs'!I3","v":"Dec19"},{"$f":"+'Monthly Inputs'!J3","v":"Jan20"},{"$f":"+'Monthly Inputs'!K3","v":"Feb20"},{"$f":"+'Monthly Inputs'!L3","v":"Mar20"},{"$f":"+'Monthly Inputs'!M3","v":"Apr20"},{"$f":"+'Monthly Inputs'!N3","v":"May20"},{"$f":"+'Monthly Inputs'!O3","v":"Jun20"},{"$f":"+'Monthly Inputs'!P3","v":"Jul20"},{"$f":"+'Monthly Inputs'!Q3","v":"Aug20"},{"$f":"+'Monthly Inputs'!R3","v":"Sep20"},"Total",1]
["UTAH",null,null,{"$f":"MONTH(D5)","v":10},{"$f":"MONTH(E5)","v":11},12,1,2,3,4,5,6,7,8,9,null,2]
[null,"GSR",null,{"$f":"'RevRun Fcst'!H21","v":6191522},{"$f":"'RevRun Fcst'!I21","v":11607446},{"$f":"'RevRun Fcst'!J21","v":18378309},{"$f":"'RevRun Fcst'!K21","v":19828276},{"$f":"'RevRun Fcst'!L21","v":16730313},{"$f":"'RevRun Fcst'!M21","v":13186230},{"$f":"'RevRun Fcst'!N21","v":8619471},{"$f":"'RevRun Fcst'!O21","v":5236696},{"$f":"'RevRun Fcst'!P21","v":3066537},{"$f":"'RevRun Fcst'!Q21","v":2464334},{"$f":"'RevRun Fcst'!R21","v":2256237},{"$f":"'RevRun Fcst'!S21","v":2603153},{"$f":"SUM(D7:O7)","v":110168524},3]
[null,"GSC",null,{"$f":"'RevRun Fcst'!H30","v":0},{"$f":"'RevRun Fcst'!I30","v":0},{"$f":"'RevRun Fcst'!J30","v":0},{"$f":"'RevRun Fcst'!K30","v":0},{"$f":"'RevRun Fcst'!L30","v":0},{"$f":"'RevRun Fcst'!M30","v":0},{"$f":"'RevRun Fcst'!N30","v":0},{"$f":"'RevRun Fcst'!O30","v":0},{"$f":"'RevRun Fcst'!P30","v":0},{"$f":"'RevRun Fcst'!Q30","v":0},{"$f":"'RevRun Fcst'!R30","v":0},{"$f":"'RevRun Fcst'!S30","v":0},0,4]
[null,"GSS",null,{"$f":"'RevRun Fcst'!H39","v":0},{"$f":"'RevRun Fcst'!I39","v":0},{"$f":"'RevRun Fcst'!J39","v":0},{"$f":"'RevRun Fcst'!K39","v":0},{"$f":"'RevRun Fcst'!L39","v":0},{"$f":"'RevRun Fcst'!M39","v":0},{"$f":"'RevRun Fcst'!N39","v":0},{"$f":"'RevRun Fcst'!O39","v":0},{"$f":"'RevRun Fcst'!P39","v":0},{"$f":"'RevRun Fcst'!Q39","v":0},{"$f":"'RevRun Fcst'!R39","v":0},{"$f":"'RevRun Fcst'!S39","v":0},0,5]
[null,"F-1",null,{"$f":"'RevRun Fcst'!H48","v":209640},{"$f":"'RevRun Fcst'!I48","v":236570},{"$f":"'RevRun Fcst'!J48","v":286797},{"$f":"'RevRun Fcst'!K48","v":354977},{"$f":"'RevRun Fcst'!L48","v":324886},{"$f":"'RevRun Fcst'!M48","v":275550},{"$f":"'RevRun Fcst'!N48","v":274533},{"$f":"'RevRun Fcst'!O48","v":232701},{"$f":"'RevRun Fcst'!P48","v":226914},{"$f":"'RevRun Fcst'!Q48","v":151829},{"$f":"'RevRun Fcst'!R48","v":137293},{"$f":"'RevRun Fcst'!S48","v":149426},2861116,6]
[null,"F-4",null,{"$f":"'RevRun Fcst'!H75","v":0},{"$f":"'RevRun Fcst'!I75","v":0},{"$f":"'RevRun Fcst'!J75","v":0},{"$f":"'RevRun Fcst'!K75","v":0},{"$f":"'RevRun Fcst'!L75","v":0},{"$f":"'RevRun Fcst'!M75","v":0},{"$f":"'RevRun Fcst'!N75","v":0},{"$f":"'RevRun Fcst'!O75","v":0},{"$f":"'RevRun Fcst'!P75","v":0},{"$f":"'RevRun Fcst'!Q75","v":0},{"$f":"'RevRun Fcst'!R75","v":0},{"$f":"'RevRun Fcst'!S75","v":0},0,7]
[null,"NGV",null,{"$f":"'RevRun Fcst'!H66","v":24022},{"$f":"'RevRun Fcst'!I66","v":23246},{"$f":"'RevRun Fcst'!J66","v":21109},{"$f":"'RevRun Fcst'!K66","v":19319},{"$f":"'RevRun Fcst'!L66","v":21910},{"$f":"'RevRun Fcst'!M66","v":20666},{"$f":"'RevRun Fcst'!N66","v":20255},{"$f":"'RevRun Fcst'!O66","v":22198},{"$f":"'RevRun Fcst'!P66","v":23019},{"$f":"'RevRun Fcst'!Q66","v":21668},{"$f":"'RevRun Fcst'!R66","v":24538},{"$f":"'RevRun Fcst'!S66","v":21971},263921,8]
["Total Firm Sales",null,null,{"$f":"SUM(D7:D12)","v":6425184},11867262,{"$f":"SUM(F7:F12)","v":18686215},20202572,17077109,13482446,8914259,5491595,3316470,2637831,2418068,2774550,{"$f":"SUM(P7:P12)","v":113293561},9]
[null,null,null,null,null,null,null,null,null,null,null,null,null,null,null,null,10]
[null,"I-4",null,{"$f":"'RevRun Fcst'!H102","v":8472},{"$f":"'RevRun Fcst'!I102","v":11833},{"$f":"'RevRun Fcst'!J102","v":18631},{"$f":"'RevRun Fcst'!K102","v":17090},{"$f":"'RevRun Fcst'!L102","v":12135},{"$f":"'RevRun Fcst'!M102","v":13579},{"$f":"'RevRun Fcst'!N102","v":10979},{"$f":"'RevRun Fcst'!O102","v":8294},{"$f":"'RevRun Fcst'!P102","v":8433},{"$f":"'RevRun Fcst'!Q102","v":6398},{"$f":"'RevRun Fcst'!R102","v":7067},{"$f":"'RevRun Fcst'!S102","v":8000},{"$f":"SUM(D15:O15)","v":130911},11]
[null,"IS-4",null,{"$f":"'RevRun Fcst'!H93","v":0},{"$f":"'RevRun Fcst'!I93","v":0},{"$f":"'RevRun Fcst'!J93","v":0},{"$f":"'RevRun Fcst'!K93","v":0},{"$f":"'RevRun Fcst'!L93","v":0},{"$f":"'RevRun Fcst'!M93","v":0},{"$f":"'RevRun Fcst'!N93","v":0},{"$f":"'RevRun Fcst'!O93","v":0},{"$f":"'RevRun Fcst'!P93","v":0},{"$f":"'RevRun Fcst'!Q93","v":0},{"$f":"'RevRun Fcst'!R93","v":0},{"$f":"'RevRun Fcst'!S93","v":0},{"$f":"SUM(D16:O16)","v":0},12]
["Total Interruptible Sales",null,null,{"$f":"SUM(D15:D16)","v":8472},11833,18631,17090,12135,13579,10979,8294,8433,6398,7067,8000,130911,13]
[null,null,null,null,null,null,null,null,null,null,null,null,null,null,null,null,14]
[null,null,null,null,null,null,null,null,null,null,null,null,null,null,null,null,15]
["Total Utah Sales",null,null,{"$f":"+D13+D17","v":6433656},{"$f":"+E13+E17","v":11879095},{"$f":"+F13+F17","v":18704846},{"$f":"+G13+G17","v":20219662},17089244,13496025,8925238,5499889,3324903,2644229,2425135,2782550,{"$f":"+P13+P17","v":113424472},16]
[null,null,null,null,null,null,null,null,null,null,null,null,null,null,null,null,17]
["Total Utah Transportation",null,null,{"$f":"'RevRun Fcst'!H204","v":6925192},{"$f":"'RevRun Fcst'!I204","v":7687087},{"$f":"'RevRun Fcst'!J204","v":9032142},{"$f":"'RevRun Fcst'!K204","v":9308206},{"$f":"'RevRun Fcst'!L204","v":7799181},{"$f":"'RevRun Fcst'!M204","v":7235512},{"$f":"'RevRun Fcst'!N204","v":6923651},{"$f":"'RevRun Fcst'!O204","v":6515141},{"$f":"'RevRun Fcst'!P204","v":6751365},{"$f":"'RevRun Fcst'!Q204","v":8113255},{"$f":"'RevRun Fcst'!R204","v":8212123},{"$f":"'RevRun Fcst'!S204","v":6723872},{"$f":"SUM(D22:O22)","v":91226727},18]
[null,null,null,null,null,null,null,null,null,null,null,null,null,null,null,null,19]
[null,null,null,null,null,null,null,null,null,null,null,null,null,null,null,null,20]
["Total Utah Sales & Trans",null,null,{"$f":"+D20+D22","v":13358848},19566182,27736988,29527868,24888425,20731537,15848889,12015030,10076268,10757484,10637258,9506422,{"$f":"+P20+P22","v":204651199},21]
[null,null,null,null,null,null,null,null,null,null,null,null,null,null,null,null,22]
["WYOMING",null,null,null,null,null,null,null,null,null,null,null,null,null,null,null,23]
["   GS-1",null,null,{"$f":"'RevRun Fcst'!H244","v":225596},{"$f":"'RevRun Fcst'!I244","v":394942},{"$f":"'RevRun Fcst'!J244","v":556529},{"$f":"'RevRun Fcst'!K244","v":596147},{"$f":"'RevRun Fcst'!L244","v":529942},{"$f":"'RevRun Fcst'!M244","v":448950},{"$f":"'RevRun Fcst'!N244","v":326936},{"$f":"'RevRun Fcst'!O244","v":210750},{"$f":"'RevRun Fcst'!P244","v":107772},{"$f":"'RevRun Fcst'!Q244","v":61438},{"$f":"'RevRun Fcst'!R244","v":57538},{"$f":"'RevRun Fcst'!S244","v":91086},{"$f":"SUM(D28:O28)","v":3607626},24]
["   GS-W",null,null,{"$f":"'RevRun Fcst'!H271","v":0},{"$f":"'RevRun Fcst'!I271","v":0},{"$f":"'RevRun Fcst'!J271","v":0},{"$f":"'RevRun Fcst'!K271","v":0},{"$f":"'RevRun Fcst'!L271","v":0},{"$f":"'RevRun Fcst'!M271","v":0},{"$f":"'RevRun Fcst'!N271","v":0},{"$f":"'RevRun Fcst'!O271","v":0},{"$f":"'RevRun Fcst'!P271","v":0},{"$f":"'RevRun Fcst'!Q271","v":0},{"$f":"'RevRun Fcst'!R271","v":0},{"$f":"'RevRun Fcst'!S271","v":0},{"$f":"SUM(D29:O29)","v":0},25]
["   F-1",null,null,{"$f":"'RevRun Fcst'!H253","v":18097},{"$f":"'RevRun Fcst'!I253","v":16648},{"$f":"'RevRun Fcst'!J253","v":21171},{"$f":"'RevRun Fcst'!K253","v":21297},{"$f":"'RevRun Fcst'!L253","v":18948},{"$f":"'RevRun Fcst'!M253","v":16684},{"$f":"'RevRun Fcst'!N253","v":14905},{"$f":"'RevRun Fcst'!O253","v":14685},{"$f":"'RevRun Fcst'!P253","v":9557},{"$f":"'RevRun Fcst'!Q253","v":8689},{"$f":"'RevRun Fcst'!R253","v":9589},{"$f":"'RevRun Fcst'!S253","v":11697},{"$f":"SUM(D30:O30)","v":181967},26]
["   NGV",null,null,{"$f":"'RevRun Fcst'!H262","v":351},{"$f":"'RevRun Fcst'!I262","v":533},{"$f":"'RevRun Fcst'!J262","v":222},{"$f":"'RevRun Fcst'!K262","v":204},{"$f":"'RevRun Fcst'!L262","v":242},{"$f":"'RevRun Fcst'!M262","v":297},{"$f":"'RevRun Fcst'!N262","v":333},{"$f":"'RevRun Fcst'!O262","v":295},{"$f":"'RevRun Fcst'!P262","v":401},{"$f":"'RevRun Fcst'!Q262","v":338},{"$f":"'RevRun Fcst'!R262","v":399},{"$f":"'RevRun Fcst'!S262","v":375},{"$f":"SUM(D31:O31)","v":3990},27]
["Total Firm Sales",null,null,{"$f":"SUM(D28:D31)","v":244044},412123,577922,617648,549132,465931,342174,225730,117730,70465,67526,103158,3793583,28]
[null,null,null,null,null,null,null,null,null,null,null,null,null,null,null,null,29]
["   I-2",null,null,{"$f":"'RevRun Fcst'!H280","v":8719},{"$f":"'RevRun Fcst'!I280","v":15002},{"$f":"'RevRun Fcst'!J280","v":14644},{"$f":"'RevRun Fcst'!K280","v":16875},{"$f":"'RevRun Fcst'!L280","v":15622},{"$f":"'RevRun Fcst'!M280","v":15752},{"$f":"'RevRun Fcst'!N280","v":14302},{"$f":"'RevRun Fcst'!O280","v":10909},{"$f":"'RevRun Fcst'!P280","v":7844},{"$f":"'RevRun Fcst'!Q280","v":5893},{"$f":"'RevRun Fcst'!R280","v":3957},{"$f":"'RevRun Fcst'!S280","v":5079},{"$f":"SUM(D34:O34)","v":134598},30]
["   I-4",null,null,{"$f":"'RevRun Fcst'!H289","v":0},{"$f":"'RevRun Fcst'!I289","v":0},{"$f":"'RevRun Fcst'!J289","v":0},{"$f":"'RevRun Fcst'!K289","v":0},{"$f":"'RevRun Fcst'!L289","v":0},{"$f":"'RevRun Fcst'!M289","v":0},{"$f":"'RevRun Fcst'!N289","v":0},{"$f":"'RevRun Fcst'!O289","v":0},{"$f":"'RevRun Fcst'!P289","v":0},{"$f":"'RevRun Fcst'!Q289","v":0},{"$f":"'RevRun Fcst'!R289","v":0},{"$f":"'RevRun Fcst'!S289","v":0},{"$f":"SUM(D35:O35)","v":0},31]
["Total Interruptible Sales",null,null,{"$f":"SUM(D34:D35)","v":8719},15002,14644,16875,15622,15752,14302,10909,7844,5893,3957,5079,134598,32]
[null,null,null,null,null,null,null,null,null,null,null,null,null,null,null,null,33]
[null,null,null,null,null,null,null,null,null,null,null,null,null,null,null,null,34]
["Total Wyoming Sales",null,null,{"$f":"+D32+D36","v":252763},{"$f":"+E32+E36","v":427125},592566,634523,564754,481683,356476,236639,125574,76358,71483,108237,3928181,35]
[null,null,null,null,null,null,null,null,null,null,null,null,null,null,null,null,36]
["Total Wyoming Transportation",null,null,{"$f":"'RevRun Fcst'!H328","v":49421},{"$f":"'RevRun Fcst'!I328","v":41415},{"$f":"'RevRun Fcst'!J328","v":59747},{"$f":"'RevRun Fcst'!K328","v":35956},{"$f":"'RevRun Fcst'!L328","v":43122},{"$f":"'RevRun Fcst'!M328","v":46289},{"$f":"'RevRun Fcst'!N328","v":30204},{"$f":"'RevRun Fcst'!O328","v":19005},{"$f":"'RevRun Fcst'!P328","v":19460},{"$f":"'RevRun Fcst'!Q328","v":18365},{"$f":"'RevRun Fcst'!R328","v":16464},{"$f":"'RevRun Fcst'!S328","v":41451},{"$f":"SUM(D41:O41)","v":420899},37]
[null,null,null,null,null,null,null,null,null,null,null,null,null,null,null,null,38]
[null,null,null,null,null,null,null,null,null,null,null,null,null,null,null,null,39]
["Total Wyoming Sales & Trans",null,null,{"$f":"+D39+D41","v":302184},468540,652313,670479,607876,527972,386680,255644,145034,94723,87947,149688,4349080,40]
[null,null,null,null,null,null,null,null,null,null,null,null,null,null,null,null,41]
[null,null,null,null,null,null,null,null,null,null,null,null,null,null,null,null,42]
["Total System Sales and Trans",null,null,{"$f":"+D25+D44","v":13661032},20034722,28389301,30198347,25496301,21259509,16235569,12270674,10221302,10852207,10725205,{"$f":"+O25+O44","v":9656110},209000279,43]
[null,null,null,null,null,null,null,null,null,null,null,null,null,null,null,null,44]
["Usage by Season",null,null,null,null,null,null,null,null,null,null,null,null,null,null,null,45]
[null,null,"Month",{"$f":"MONTH(D5)","v":10},11,12,1,2,3,4,5,6,7,8,9,null,46]
["GS",null,"Season (0=Winter, 1=Summer)",{"$f":"IF(D$50<4,0,IF(D$50>10,0,1))","v":1},{"$f":"IF(E$50<4,0,IF(E$50>10,0,1))","v":0},0,0,0,0,1,1,1,1,1,1,"Total",47]
[null,"Winter",null,{"$f":"IF(D51=0,D7+D8,0)","v":0},{"$f":"IF(E51=0,E7+E8,0)","v":11607446},18378309,19828276,16730313,13186230,0,0,0,0,0,0,{"$f":"SUM(D52:O52)","v":79730574},48]
[null,"Summer",null,{"$f":"IF(D51=1,D7+D8,0)","v":6191522},0,0,0,0,0,8619471,5236696,3066537,2464334,2256237,2603153,{"$f":"SUM(D53:O53)","v":30437950},49]
["GSS",null,null,null,null,null,null,null,null,null,null,null,null,null,null,null,50]
[null,"Winter",null,{"$f":"IF(D51=0,D9,0)","v":0},0,0,0,0,0,0,0,0,0,0,0,{"$f":"SUM(D55:O55)","v":0},51]
[null,"Summer",null,{"$f":"IF(D51=1,D9,0)","v":0},0,0,0,0,0,0,0,0,0,0,0,{"$f":"SUM(D56:O56)","v":0},52]
["F-S",null,null,null,null,null,null,null,null,null,null,null,null,null,null,null,53]
[null,"Winter",null,{"$f":"IF(D51=0,D10,0)","v":0},236570,286797,354977,324886,275550,0,0,0,0,0,0,{"$f":"SUM(D58:O58)","v":1478780},54]
[null,"Summer",null,{"$f":"IF(D51=1,D10,0)","v":209640},0,0,0,0,0,274533,232701,226914,151829,137293,149426,{"$f":"SUM(D59:O59)","v":1382336},55]
[null,null,null,null,null,null,null,null,null,null,null,null,null,null,null,null,56]
[null,null,null,null,null,null,null,null,null,null,null,null,null,null,null,null,57]
[null,"Rates: R050201.R1","WYOMING NON-CORE DNG REVENUES FROM DEMAND FORECAST AND CURRENTLY EFFECTIVE I-SALES GAS COST RATES",null,null,null,null,null,null,null,null,null,null,null,null,null,58]
[null,null,null,"Forecast","Forecast","Forecast","Forecast","Forecast","Forecast","Forecast","Forecast","Forecast","Forecast","Forecast","Forecast","12-Month",59]
[null,null,null,{"$f":"D5","v":"Oct19"},{"$f":"E5","v":"Nov19"},{"$f":"F5","v":"Dec19"},"Jan20","Feb20","Mar20","Apr20","May20","Jun20","Jul20","Aug20","Sep20","Total",60]
["I-2 & 1-4 (Non-Gas Revenue) (Yearly)",null,null,{"$f":"'RevRun Fcst'!H273+'RevRun Fcst'!H282","v":3734.5899999999997},{"$f":"'RevRun Fcst'!I273+'RevRun Fcst'!I282","v":5252.63},{"$f":"'RevRun Fcst'!J273+'RevRun Fcst'!J282","v":5166.1399999999994},{"$f":"'RevRun Fcst'!K273+'RevRun Fcst'!K282","v":5705.17},{"$f":"'RevRun Fcst'!L273+'RevRun Fcst'!L282","v":5402.42},{"$f":"'RevRun Fcst'!M273+'RevRun Fcst'!M282","v":5433.84},{"$f":"'RevRun Fcst'!N273+'RevRun Fcst'!N282","v":5083.5199999999995},{"$f":"'RevRun Fcst'!O273+'RevRun Fcst'!O282","v":4263.72},{"$f":"'RevRun Fcst'!P273+'RevRun Fcst'!P282","v":3523.19},{"$f":"'RevRun Fcst'!Q273+'RevRun Fcst'!Q282","v":3051.7999999999997},{"$f":"'RevRun Fcst'!R273+'RevRun Fcst'!R282","v":2584.06},{"$f":"'RevRun Fcst'!S273+'RevRun Fcst'!S282","v":2855.12},{"$f":"SUM(D65:O65)","v":52056.200000000004},61]
["IC (Total Revenue) (Yearly)",null,null,{"$f":"ROUND(D41*$P66/$P41,0)","v":11861},9939,14339,8629,10349,11109,7249,4561,4670,4407,3951,{"$f":"P66-SUM(D66:N66)","v":9947.6199999999808},{"$f":"'RevRun Fcst'!T300+'RevRun Fcst'!T314","v":101011.61999999998},62]
[null,null,null,null,null,null,null,null,null,null,null,null,null,null,null,null,63]
["I-2 Gas Cost (Rate Effective )",null,null,0,{"$f":"+D68","v":0},0,0,0,0,0,0,0,0,0,0,null,64]
["I-4 Gas Cost (Rate Effective )",null,null,0,0,0,0,0,0,0,0,0,0,0,0,null,65]
[null,null,null,null,null,null,null,null,null,null,null,null,null,null,null,null,66]
[null,null,null,null,null,null,null,null,null,null,null,null,null,null,null,null,67]
[null,null,null,"ALLOCATION BASES",null,null,null,null,null,null,null,null,null,null,null,null,68]
[null,null,null,"DEMAND",null,null,"OTHER COST",null,null,null,null,null,null,null,null,null,69]
["Utah Peak Day Demand",null,null,{"$f":"+D76-D75","v":1182617},{"$f":"D74/D76","v":0.96933197708586571},null,"Utah Sales",{"$f":"+P20","v":113424472},{"$f":"H74/H76","v":0.96652669624776189},null,null,null,null,null,null,null,70]
["Wyoming Peak Day Demand",null,null,{"$f":"'Other Inputs'!E142","v":37416},{"$f":"1-E74","v":3.0668022914134285E-2},null,"Wyoming Sales",{"$f":"+P39","v":3928181},{"$f":"1-I74","v":3.3473303752238115E-2},null,null,null,null,null,null,null,71]
["Peak Day Demand",null,null,{"$f":"'Other Inputs'!E143","v":1220033},{"$f":"ROUND(D76/D$76,4)","v":1},null,"Total Sales",{"$f":"+H74+H75","v":117352653},{"$f":"ROUND(H76/H$76,4)","v":1},null,null,null,null,null,null,null,72]
[null,null,null,null,null,null,null,null,null,null,null,null,null,null,null,null,73]
[null,null,null,null,null,null,null,null,null,null,null,null,null,null,null,null,74]
[null,null,null,"Financial Report Information (Latest 12 Months of Actual Expenses and 13 Months of Rate Base)",null,null,null,null,null,null,null,null,null,null,null,null,75]
[null,null,null,"Actual","Actual","Actual","Actual","Actual","Actual","Actual","Actual","Actual","Actual","Actual","Actual",null,76]
["Accounts",null,null,{"$f":"+Expenses!G9","v":"2018-08-01"},{"$f":"+Expenses!H9","v":"2018-09-01"},{"$f":"+Expenses!I9","v":"2018-10-01"},{"$f":"+Expenses!J9","v":"2018-11-01"},{"$f":"+Expenses!K9","v":"2018-12-01"},{"$f":"+Expenses!L9","v":"2019-01-01"},{"$f":"+Expenses!M9","v":"2019-02-01"},{"$f":"+Expenses!N9","v":"2019-03-01"},{"$f":"+Expenses!O9","v":"2019-04-01"},{"$f":"+Expenses!P9","v":"2019-05-01"},{"$f":"+Expenses!Q9","v":"2019-06-01"},{"$f":"+Expenses!R9","v":"2019-07-01"},{"$f":"Expenses!S9","v":"2019-07-01"},77]
["EXPENSES",null,null,null,null,null,null,null,null,null,null,null,null,null,null,null,78]
[null,"Gas Use In Dth (Acct 810 & 812)",null,0,0,0,0,0,0,0,0,0,0,0,0,0,79]
[null,null,null,null,null,null,null,null,null,null,null,null,null,null,null,null,80]
[null,"Other Revenue (Yearly)",null,null,null,null,null,null,null,null,null,null,null,null,null,null,81]
[null,"Sales for Resale (account 483)",null,{"$f":"Expenses!G445","v":104401.96},{"$f":"Expenses!H445","v":101703.17},{"$f":"Expenses!I445","v":107037.77},{"$f":"Expenses!J445","v":103410.19},{"$f":"Expenses!K445","v":286991.75},{"$f":"Expenses!L445","v":117221.98},{"$f":"Expenses!M445","v":117002.1},{"$f":"Expenses!N445","v":135658.85},{"$f":"Expenses!O445","v":88880.37},{"$f":"Expenses!P445","v":54461.640000000007},{"$f":"Expenses!Q445","v":62725.450000000004},{"$f":"Expenses!R445","v":0},{"$f":"Expenses!S445","v":1279495.23},82]
[null,"Incidental Plant Prod Sales (Acct 490)",null,{"$f":"Expenses!G446","v":806783.83},{"$f":"Expenses!H446","v":5924.37},{"$f":"Expenses!I446","v":700363.96000000008},{"$f":"Expenses!J446","v":1446013.29},{"$f":"Expenses!K446","v":565424.75},{"$f":"Expenses!L446","v":193982.52999999997},{"$f":"Expenses!M446","v":42747.119999999995},{"$f":"Expenses!N446","v":209418.63},{"$f":"Expenses!O446","v":141834.57},{"$f":"Expenses!P446","v":200410.18000000002},{"$f":"Expenses!Q446","v":237731.75},{"$f":"Expenses!R446","v":247756.64},{"$f":"Expenses!S446","v":4798391.6199999992},83]
[null,"Gas Processed by Others (account 491)",null,{"$f":"Expenses!G461","v":0},{"$f":"Expenses!H461","v":0},{"$f":"Expenses!I461","v":0},{"$f":"Expenses!J461","v":0},{"$f":"Expenses!K461","v":0},{"$f":"Expenses!L461","v":0},{"$f":"Expenses!M461","v":0},{"$f":"Expenses!N461","v":0},{"$f":"Expenses!O461","v":0},{"$f":"Expenses!P461","v":0},{"$f":"Expenses!Q461","v":0},{"$f":"Expenses!R461","v":0},{"$f":"Expenses!S461","v":0},84]
[null,"Gasoline - Oil Sales (account 492)",null,{"$f":"Expenses!G447","v":199984.13},{"$f":"Expenses!H447","v":177203.97999999998},{"$f":"Expenses!I447","v":199772.08},{"$f":"Expenses!J447","v":203051.07},{"$f":"Expenses!K447","v":126320.59000000001},{"$f":"Expenses!L447","v":440584.14},{"$f":"Expenses!M447","v":756.35},{"$f":"Expenses!N447","v":558792.03},{"$f":"Expenses!O447","v":618797.46},{"$f":"Expenses!P447","v":419615.31999999995},{"$f":"Expenses!Q447","v":5.59},{"$f":"Expenses!R447","v":794619.11999999988},{"$f":"Expenses!S447","v":3739501.8599999994},85]
[null,"Gasoline - Oil Cost (account 758.001)",null,{"$f":"-Expenses!G450","v":0},{"$f":"-Expenses!H450","v":0},{"$f":"-Expenses!I450","v":0},{"$f":"-Expenses!J450","v":0},{"$f":"-Expenses!K450","v":0},{"$f":"-Expenses!L450","v":0},{"$f":"-Expenses!M450","v":-31057.840000000004},{"$f":"-Expenses!N450","v":0},{"$f":"-Expenses!O450","v":0},{"$f":"-Expenses!P450","v":0},{"$f":"-Expenses!Q450","v":0},{"$f":"-Expenses!R450","v":0},{"$f":"-Expenses!S450","v":-31057.840000000004},86]
[null,null,null,null,null,null,null,null,null,null,null,null,null,null,null,null,87]
[null,null,null,null,null,null,null,null,null,null,null,null,null,null,null,null,88]
[null,"Overriding Royalty (account 495-1)",null,{"$f":"Expenses!G448","v":958404.90999999992},{"$f":"Expenses!H448","v":194516.61},{"$f":"Expenses!I448","v":-547226.96},{"$f":"Expenses!J448","v":1295483.8500000001},{"$f":"Expenses!K448","v":700029.49},{"$f":"Expenses!L448","v":880688.37},{"$f":"Expenses!M448","v":1500219.03},{"$f":"Expenses!N448","v":1301702.48},{"$f":"Expenses!O448","v":904140.09},{"$f":"Expenses!P448","v":933608.08},{"$f":"Expenses!Q448","v":855368.95999999985},{"$f":"Expenses!R448","v":198797.73},{"$f":"Expenses!S448","v":9175732.6400000006},89]
[null,"Wexpro Revenue Sharing (account 495-2)",null,{"$f":"Expenses!G449","v":24691},{"$f":"Expenses!H449","v":15189},{"$f":"Expenses!I449","v":3296},{"$f":"Expenses!J449","v":10386},{"$f":"Expenses!K449","v":28291},{"$f":"Expenses!L449","v":20492},{"$f":"Expenses!M449","v":21667},{"$f":"Expenses!N449","v":35775},{"$f":"Expenses!O449","v":10652},{"$f":"Expenses!P449","v":28837},{"$f":"Expenses!Q449","v":12102},{"$f":"Expenses!R449","v":37299},{"$f":"Expenses!S449","v":248677},90]
[null,null,null,null,null,null,null,null,null,null,null,null,null,null,null,"Page 2 of 6",91]
[null,null,"Actual","Actual","Actual","Actual","Actual","Actual","Actual","Actual","Actual","Actual","Actual","Actual","Actual","13-Month",92]
["Accounts",null,{"$f":"'Rate Base'!H8","v":"2018-07-17"},{"$f":"'Rate Base'!I8","v":"2018-08-16"},{"$f":"'Rate Base'!J8","v":"2018-09-01"},{"$f":"'Rate Base'!K8","v":"2018-10-01"},{"$f":"'Rate Base'!L8","v":"2018-11-01"},{"$f":"'Rate Base'!M8","v":"2018-12-01"},{"$f":"'Rate Base'!N8","v":"2019-01-01"},{"$f":"'Rate Base'!O8","v":"2019-02-01"},{"$f":"'Rate Base'!P8","v":"2019-03-01"},{"$f":"'Rate Base'!Q8","v":"2019-04-01"},{"$f":"'Rate Base'!R8","v":"2019-05-01"},{"$f":"'Rate Base'!S8","v":"2019-06-01"},{"$f":"'Rate Base'!T8","v":"2019-07-01"},"Average",93]
["RATE BASE - PRODUCTION",null,null,null,null,null,null,null,null,null,null,null,null,null,null,null,94]
[null,"Acct 164 (Working Gas) - Production",{"$f":"'Rate Base'!H206","v":39219511.989999995},{"$f":"'Rate Base'!I206","v":43502522.789999984},{"$f":"'Rate Base'!J206","v":62143023.659999982},{"$f":"'Rate Base'!K206","v":62647436.719999984},{"$f":"'Rate Base'!L206","v":52783329.589999981},{"$f":"'Rate Base'!M206","v":44167774.479999982},{"$f":"'Rate Base'!N206","v":33177810.05999998},{"$f":"'Rate Base'!O206","v":24117118.759999979},{"$f":"'Rate Base'!P206","v":8155444.2399999797},{"$f":"'Rate Base'!Q206","v":6352626.4299999792},{"$f":"'Rate Base'!R206","v":8741282.3899999782},{"$f":"'Rate Base'!S206","v":19062047.869999975},{"$f":"'Rate Base'!T206","v":33521823.379999973},{"$f":"(((+C99+O99)/2)+SUM(D99:N99))/12","v":33435090.389583316},95]
[null,"Acct 101 - Production",{"$f":"'Rate Base'!H148","v":79968136},{"$f":"'Rate Base'!I148","v":79968136},{"$f":"'Rate Base'!J148","v":79968136},{"$f":"'Rate Base'!K148","v":79968136},{"$f":"'Rate Base'!L148","v":79968136},{"$f":"'Rate Base'!M148","v":79968136},{"$f":"'Rate Base'!N148","v":79968136},{"$f":"'Rate Base'!O148","v":79968136},{"$f":"'Rate Base'!P148","v":79968136},{"$f":"'Rate Base'!Q148","v":79968136},{"$f":"'Rate Base'!R148","v":79968136},{"$f":"'Rate Base'!S148","v":79968136},{"$f":"'Rate Base'!T148","v":79968136},79968136,96]
[" ","Acct 108 - Production",{"$f":"'Rate Base'!H166","v":-69869425},{"$f":"'Rate Base'!I166","v":-69910892},{"$f":"'Rate Base'!J166","v":-69952359},{"$f":"'Rate Base'!K166","v":-69993826},{"$f":"'Rate Base'!L166","v":-70035293},{"$f":"'Rate Base'!M166","v":-70076759},{"$f":"'Rate Base'!N166","v":-70076759},{"$f":"'Rate Base'!O166","v":-70118226},{"$f":"'Rate Base'!P166","v":-70159693},{"$f":"'Rate Base'!Q166","v":-70201160},{"$f":"'Rate Base'!R166","v":-70242627},{"$f":"'Rate Base'!S166","v":-70242627},{"$f":"'Rate Base'!T166","v":-70325561},-70092309.5,97]
[null,"Acct 111 - Production",{"$f":"'Rate Base'!H173","v":-6150277},{"$f":"'Rate Base'!I173","v":-6150277},{"$f":"'Rate Base'!J173","v":-6150277},{"$f":"'Rate Base'!K173","v":-6150277},{"$f":"'Rate Base'!L173","v":-6150277},{"$f":"'Rate Base'!M173","v":-6150277},{"$f":"'Rate Base'!N173","v":-6150277},{"$f":"'Rate Base'!O173","v":-6150277},{"$f":"'Rate Base'!P173","v":-6150277},{"$f":"'Rate Base'!Q173","v":-6150277},{"$f":"'Rate Base'!R173","v":-6150277},{"$f":"'Rate Base'!S173","v":-6150277},{"$f":"'Rate Base'!T173","v":-6150277},-6150277,98]
[null,"Acct 2550 - Production",{"$f":"'Rate Base'!H241","v":-1311},{"$f":"'Rate Base'!I241","v":-1311},{"$f":"'Rate Base'!J241","v":-1311},{"$f":"'Rate Base'!K241","v":-1311},{"$f":"'Rate Base'!L241","v":-1311},{"$f":"'Rate Base'!M241","v":0},{"$f":"'Rate Base'!N241","v":0},{"$f":"'Rate Base'!O241","v":0},{"$f":"'Rate Base'!P241","v":0},{"$f":"'Rate Base'!Q241","v":0},{"$f":"'Rate Base'!R241","v":0},{"$f":"'Rate Base'!S241","v":0},{"$f":"'Rate Base'!T241","v":0},-491.625,99]
[null,"Acct 2820 - Production",{"$f":"'Rate Base'!H248","v":1861750},{"$f":"'Rate Base'!I248","v":-10016752},{"$f":"'Rate Base'!J248","v":-8372698},{"$f":"'Rate Base'!K248","v":-8172642},{"$f":"'Rate Base'!L248","v":-8133451},{"$f":"'Rate Base'!M248","v":-7045486},{"$f":"'Rate Base'!N248","v":-7045486},{"$f":"'Rate Base'!O248","v":-8226119},{"$f":"'Rate Base'!P248","v":-8610267},{"$f":"'Rate Base'!Q248","v":-8240231},{"$f":"'Rate Base'!R248","v":-8638495},{"$f":"'Rate Base'!S248","v":-8638495},{"$f":"'Rate Base'!T248","v":-9435062},-7910564.833333333,100]
[null,"Acct 2821 - Production",{"$f":"'Rate Base'!H255","v":-700755.31},{"$f":"'Rate Base'!I255","v":-700755.31},{"$f":"'Rate Base'!J255","v":-700755.31},{"$f":"'Rate Base'!K255","v":-700755.31},{"$f":"'Rate Base'!L255","v":-700755.31},{"$f":"'Rate Base'!M255","v":-700755.31},{"$f":"'Rate Base'!N255","v":-700755.31},{"$f":"'Rate Base'!O255","v":-700755.31},{"$f":"'Rate Base'!P255","v":-700755.31},{"$f":"'Rate Base'!Q255","v":-700755.31},{"$f":"'Rate Base'!R255","v":-700755.31},{"$f":"'Rate Base'!S255","v":-700755.31},{"$f":"'Rate Base'!T255","v":-700755.31},-700755.31000000017,101]
[null,null,null,null,null,null,null,null,null,null,null,null,null,null,null,null,102]
[null,null,null,"Production",null,null,null,"Acct 101","Acct 108","Acct 111","Acct 2550","Acct 2820","Acct 2821","Total",null,null,103]
[null,"Depreciation - Acct 403",null,{"$f":"Expenses!S385","v":497603},null,"Thirteen month average",null,{"$f":"P100","v":79968136},{"$f":"P101","v":-70092309.5},{"$f":"P102","v":-6150277},{"$f":"P103","v":-491.625},{"$f":"P104","v":-7910564.833333333},{"$f":"P105","v":-700755.31000000017},{"$f":"SUM(H108:M108)","v":-4886262.2683333335},null,null,104]
[null,"Amortization & Depletion - Acct 404",null,{"$f":"Expenses!S392","v":0},null,{"$f":"CONCATENATE(\"Wexpro Red. @ \",-'Other Inputs'!E260*100,\" %\")","v":"Wexpro Red. @ 6.3 %"},null,{"$f":"H108*'Other Inputs'!$E$260","v":-5037992.568},{"$f":"I108*'Other Inputs'!$E$260","v":4415815.4984999998},{"$f":"J108*'Other Inputs'!$E$260","v":387467.451},null,null,null,{"$f":"SUM(H109:M109)","v":-234709.61850000022},null,null,105]
[null,"Utah Pre-Tax Return on Production Assets",null,{"$f":"+N111","v":-477786.67704154999},null,null,null,null,null,null,null,null,{"$f":"SUM(N108:N109)","v":-5120971.8868333334},null,null,null,106]
[null,"Utah Production Cost",null,{"$f":"SUM(D108:D110)","v":19816.322958450008},null,null,null,null,null,null,null,null,{"$f":"\"Utah Pre-Tax Rate of Return on Production Assets (\"&'Other Inputs'!E263&\")\"","v":"Utah Pre-Tax Rate of Return on Production Assets (0.0933)"},{"$f":"M110*'Other Inputs'!E263","v":-477786.67704154999},null,null,107]
[null,null,null,null,null,null,null,null,null,null,null,null,{"$f":"\"Wyoming Pre-Tax Rate of Return on Production Assets (\"&'Other Inputs'!E262&\")\"","v":"Wyoming Pre-Tax Rate of Return on Production Assets (0.0916)"},{"$f":"M110*'Other Inputs'!E262","v":-469081.02483393333},null,null,108]
[null,null,null,null,null,null,null,null,null,null,null,null,null,null,null,null,109]
["TACTICAL PLAN INFORMATION (IRP)",null,null,null,null,null,null,null,null,null,null,null,null,null,null,"12-Month",110]
[null,null,null,{"$f":"D5","v":"Oct19"},{"$f":"E5","v":"Nov19"},"Dec19","Jan20","Feb20","Mar20","Apr20","May20","Jun20","Jul20","Aug20","Sep20","Total",111]
["COMPANY PRODUCTION",null,null,null,null,null,null,null,null,null,null,null,null,null,null,null,112]
[null,"Prior Company",null,null,null,null,null,null,null,null,null,null,null,null,null,null,113]
[null,"D24 Wells",null,null,null,null,null,null,null,null,null,null,null,null,null,null,114]
[null,"Brady & Powel",null,null,null,null,null,null,null,null,null,null,null,null,null,null,115]
[null,"Total Company Production Wexpro I & II",null,{"$f":"'Monthly Inputs'!G7+'Monthly Inputs'!G13","v":5658224},{"$f":"'Monthly Inputs'!H7+'Monthly Inputs'!H13","v":5360505},{"$f":"'Monthly Inputs'!I7+'Monthly Inputs'!I13","v":5562662},{"$f":"'Monthly Inputs'!J7+'Monthly Inputs'!J13","v":5433616},{"$f":"'Monthly Inputs'!K7+'Monthly Inputs'!K13","v":5096209},{"$f":"'Monthly Inputs'!L7+'Monthly Inputs'!L13","v":5320388.0000000009},{"$f":"'Monthly Inputs'!M7+'Monthly Inputs'!M13","v":5046084},{"$f":"'Monthly Inputs'!N7+'Monthly Inputs'!N13","v":5120670},{"$f":"'Monthly Inputs'!O7+'Monthly Inputs'!O13","v":4872039},{"$f":"'Monthly Inputs'!P7+'Monthly Inputs'!P13","v":4956388},{"$f":"'Monthly Inputs'!Q7+'Monthly Inputs'!Q13","v":4999358},{"$f":"'Monthly Inputs'!R7+'Monthly Inputs'!R13","v":4810602},{"$f":"SUM(D120:O120)","v":62236745},116]
[null,null,null,null,null,null,null,null,null,null,null,null,null,null,null,null,117]
["STORAGE INJECTIONS",null,null,null,null,null,null,null,null,null,null,null,null,null,null,null,118]
[null,"Chalk Creek",null,{"$f":"'Monthly Inputs'!G24","v":132000},{"$f":"'Monthly Inputs'!H24","v":76600},{"$f":"'Monthly Inputs'!I24","v":0},{"$f":"'Monthly Inputs'!J24","v":0},{"$f":"'Monthly Inputs'!K24","v":0},{"$f":"'Monthly Inputs'!L24","v":0},{"$f":"'Monthly Inputs'!M24","v":0},{"$f":"'Monthly Inputs'!N24","v":0},{"$f":"'Monthly Inputs'!O24","v":0},{"$f":"'Monthly Inputs'!P24","v":0},{"$f":"'Monthly Inputs'!Q24","v":0},{"$f":"'Monthly Inputs'!R24","v":93650},{"$f":"SUM(D123:O123)","v":302250},119]
[null,"Coalville",null,{"$f":"'Monthly Inputs'!G26","v":310000},{"$f":"'Monthly Inputs'!H26","v":50186},{"$f":"'Monthly Inputs'!I26","v":0},{"$f":"'Monthly Inputs'!J26","v":0},{"$f":"'Monthly Inputs'!K26","v":0},{"$f":"'Monthly Inputs'!L26","v":0},{"$f":"'Monthly Inputs'!M26","v":0},{"$f":"'Monthly Inputs'!N26","v":0},{"$f":"'Monthly Inputs'!O26","v":0},{"$f":"'Monthly Inputs'!P26","v":0},{"$f":"'Monthly Inputs'!Q26","v":0},{"$f":"'Monthly Inputs'!R26","v":50190},{"$f":"SUM(D124:O124)","v":410376},120]
[null,"Leroy",null,{"$f":"'Monthly Inputs'!G27","v":443966},{"$f":"'Monthly Inputs'!H27","v":0},{"$f":"'Monthly Inputs'!I27","v":0},{"$f":"'Monthly Inputs'!J27","v":0},{"$f":"'Monthly Inputs'!K27","v":0},{"$f":"'Monthly Inputs'!L27","v":0},{"$f":"'Monthly Inputs'!M27","v":0},{"$f":"'Monthly Inputs'!N27","v":0},{"$f":"'Monthly Inputs'!O27","v":0},{"$f":"'Monthly Inputs'!P27","v":0},{"$f":"'Monthly Inputs'!Q27","v":0},{"$f":"'Monthly Inputs'!R27","v":0},{"$f":"SUM(D125:O125)","v":443966},121]
[null,"Ryckman",null,{"$f":"'Monthly Inputs'!G28","v":238343},{"$f":"'Monthly Inputs'!H28","v":0},{"$f":"'Monthly Inputs'!I28","v":0},{"$f":"'Monthly Inputs'!J28","v":0},{"$f":"'Monthly Inputs'!K28","v":0},{"$f":"'Monthly Inputs'!L28","v":0},{"$f":"'Monthly Inputs'!M28","v":335461},{"$f":"'Monthly Inputs'!N28","v":353119},{"$f":"'Monthly Inputs'!O28","v":341730},{"$f":"'Monthly Inputs'!P28","v":353120},{"$f":"'Monthly Inputs'!Q28","v":353120},{"$f":"'Monthly Inputs'!R28","v":341730},{"$f":"SUM(D126:O126)","v":2316623},122]
[null,"Total Peaking Storage",null,{"$f":"SUM(D123:D126)","v":1124309},{"$f":"SUM(E123:E126)","v":126786},0,0,0,0,335461,353119,341730,353120,353120,485570,3473215,123]
[null,"Clay Basin",null,{"$f":"'Monthly Inputs'!G25","v":2812405},{"$f":"'Monthly Inputs'!H25","v":1500000},{"$f":"'Monthly Inputs'!I25","v":0},{"$f":"'Monthly Inputs'!J25","v":0},{"$f":"'Monthly Inputs'!K25","v":0},{"$f":"'Monthly Inputs'!L25","v":0},{"$f":"'Monthly Inputs'!M25","v":0},{"$f":"'Monthly Inputs'!N25","v":1412351.9999999998},{"$f":"'Monthly Inputs'!O25","v":2700000},{"$f":"'Monthly Inputs'!P25","v":1910379.9999999998},{"$f":"'Monthly Inputs'!Q25","v":1945949.9999999998},{"$f":"'Monthly Inputs'!R25","v":2400000},{"$f":"SUM(D128:O128)","v":14681087},124]
[null,"Total Storage Injections",null,{"$f":"SUM(D127:D128)","v":3936714},{"$f":"SUM(E127:E128)","v":1626786},0,0,0,0,335461,1765470.9999999998,3041730,2263500,2299070,2885570,{"$f":"SUM(P127:P128)","v":18154302},125]
["STORAGE WITHDRAWLS",null,null,null,null,null,null,null,null,null,null,null,null,null,null,null,126]
[null,"Chalk Creek",null,{"$f":"'Monthly Inputs'!G32","v":0},{"$f":"'Monthly Inputs'!H32","v":0},{"$f":"'Monthly Inputs'!I32","v":0},{"$f":"'Monthly Inputs'!J32","v":60079},{"$f":"'Monthly Inputs'!K32","v":0},{"$f":"'Monthly Inputs'!L32","v":300107},{"$f":"'Monthly Inputs'!M32","v":0},{"$f":"'Monthly Inputs'!N32","v":0},{"$f":"'Monthly Inputs'!O32","v":0},{"$f":"'Monthly Inputs'!P32","v":0},{"$f":"'Monthly Inputs'!Q32","v":0},{"$f":"'Monthly Inputs'!R32","v":0},{"$f":"SUM(D131:O131)","v":360186},127]
[null,"Coalville",null,{"$f":"'Monthly Inputs'!G34","v":0},{"$f":"'Monthly Inputs'!H34","v":0},{"$f":"'Monthly Inputs'!I34","v":0},{"$f":"'Monthly Inputs'!J34","v":78940},{"$f":"'Monthly Inputs'!K34","v":0},{"$f":"'Monthly Inputs'!L34","v":364543},{"$f":"'Monthly Inputs'!M34","v":0},{"$f":"'Monthly Inputs'!N34","v":0},{"$f":"'Monthly Inputs'!O34","v":0},{"$f":"'Monthly Inputs'!P34","v":0},{"$f":"'Monthly Inputs'!Q34","v":0},{"$f":"'Monthly Inputs'!R34","v":0},{"$f":"SUM(D132:O132)","v":443483},128]
[null,"Leroy",null,{"$f":"'Monthly Inputs'!G35","v":0},{"$f":"'Monthly Inputs'!H35","v":0},{"$f":"'Monthly Inputs'!I35","v":0},{"$f":"'Monthly Inputs'!J35","v":184023},{"$f":"'Monthly Inputs'!K35","v":0},{"$f":"'Monthly Inputs'!L35","v":921900},{"$f":"'Monthly Inputs'!M35","v":0},{"$f":"'Monthly Inputs'!N35","v":0},{"$f":"'Monthly Inputs'!O35","v":0},{"$f":"'Monthly Inputs'!P35","v":0},{"$f":"'Monthly Inputs'!Q35","v":0},{"$f":"'Monthly Inputs'!R35","v":0},{"$f":"SUM(D133:O133)","v":1105923},129]
[null,"Ryckman",null,{"$f":"'Monthly Inputs'!G36","v":0},{"$f":"'Monthly Inputs'!H36","v":498000},{"$f":"'Monthly Inputs'!I36","v":514600},{"$f":"'Monthly Inputs'!J36","v":514600},{"$f":"'Monthly Inputs'!K36","v":481400},{"$f":"'Monthly Inputs'!L36","v":0},{"$f":"'Monthly Inputs'!M36","v":0},{"$f":"'Monthly Inputs'!N36","v":0},{"$f":"'Monthly Inputs'!O36","v":0},{"$f":"'Monthly Inputs'!P36","v":0},{"$f":"'Monthly Inputs'!Q36","v":0},{"$f":"'Monthly Inputs'!R36","v":0},{"$f":"SUM(D134:O134)","v":2008600},130]
[null,"Total Peaking Storage",null,{"$f":"SUM(D131:D134)","v":0},{"$f":"SUM(E131:E134)","v":498000},514600,837642,481400,1586550,0,0,0,0,0,0,3918192,131]
[null,"Clay Basin",null,{"$f":"'Monthly Inputs'!G33","v":0},{"$f":"'Monthly Inputs'!H33","v":957328},{"$f":"'Monthly Inputs'!I33","v":3317046.0000000005},{"$f":"'Monthly Inputs'!J33","v":3160049.9999999995},{"$f":"'Monthly Inputs'!K33","v":3190046.0000000005},{"$f":"'Monthly Inputs'!L33","v":1500000},{"$f":"'Monthly Inputs'!M33","v":0},{"$f":"'Monthly Inputs'!N33","v":0},{"$f":"'Monthly Inputs'!O33","v":0},{"$f":"'Monthly Inputs'!P33","v":0},{"$f":"'Monthly Inputs'!Q33","v":0},{"$f":"'Monthly Inputs'!R33","v":0},{"$f":"SUM(D136:O136)","v":12124470},132]
[null,"Total Storage Withdrawls",null,{"$f":"SUM(D135:D136)","v":0},1455328,3831646.0000000005,3997691.9999999995,3671446.0000000005,3086550,0,0,0,0,0,0,16042662,133]
[null,null,null,null,null,null,null,null,null,null,null,null,null,null,null,null,134]
[null,null,null,null,null,null,null,null,null,null,null,null,null,null,null,null,135]
["Gas Supply and Demand",null,null,{"$f":"D4","v":"Forecast"},"Forecast","Forecast","Forecast","Forecast","Forecast","Forecast","Forecast","Forecast","Forecast","Forecast","Forecast","12-Month",136]
["Demand",null,null,{"$f":"D5","v":"Oct19"},"Nov19","Dec19","Jan20","Feb20","Mar20","Apr20","May20","Jun20","Jul20","Aug20","Sep20","Total",137]
[null,null,null,null,null,null,null,null,null,null,null,null,null,null,null,null,138]
["Utah Sales",null,null,{"$f":"+D20","v":6433656},{"$f":"+E20","v":11879095},18704846,20219662,17089244,13496025,8925238,5499889,3324903,2644229,2425135,2782550,{"$f":"SUM(D143:O143)","v":113424472},139]
["Wyoming Sales",null,null,{"$f":"+D39","v":252763},427125,592566,634523,564754,481683,356476,236639,125574,76358,71483,108237,{"$f":"SUM(D144:O144)","v":3928181},140]
["Total Sales",null,null,{"$f":"+D143+D144","v":6686419},12306220,19297412,20854185,17653998,13977708,9281714,5736528,3450477,2720587,2496618,2890787,117352653,141]
[null,null,null,null,null,null,null,null,null,null,null,null,null,null,null,null,142]
["Distribution  Use (Offices)",null,null,{"$f":"ROUND(O83,0)","v":0},{"$f":"ROUND(D83,0)","v":0},{"$f":"ROUND(E83,0)","v":0},0,0,0,0,0,0,0,0,0,{"$f":"SUM(D147:O147)","v":0},143]
["Distribution Lost and Unaccounted for",null,null,{"$f":"+D150-D145-D147","v":30225},{"$f":"+E150-E145-E147","v":55628},87231,94268,79802,63184,41957,25931,15597,12298,11286,{"$f":"+O150-O145-O147","v":13067},{"$f":"SUM(D148:O148)","v":530474},144]
[null,null,null,null,null,null,null,null,null,null,null,null,null,null,null,null,145]
["Total City Gate",null,null,{"$f":"ROUND((D145+D147)/(1-'Other Inputs'!$E$265),0)","v":6716644},{"$f":"ROUND((E145+E147)/(1-'Other Inputs'!$E$265),0)","v":12361848},{"$f":"ROUND((F145+F147)/(1-'Other Inputs'!$E$265),0)","v":19384643},{"$f":"ROUND((G145+G147)/(1-'Other Inputs'!$E$265),0)","v":20948453},{"$f":"ROUND((H145+H147)/(1-'Other Inputs'!$E$265),0)","v":17733800},{"$f":"ROUND((I145+I147)/(1-'Other Inputs'!$E$265),0)","v":14040892},{"$f":"ROUND((J145+J147)/(1-'Other Inputs'!$E$265),0)","v":9323671},{"$f":"ROUND((K145+K147)/(1-'Other Inputs'!$E$265),0)","v":5762459},{"$f":"ROUND((L145+L147)/(1-'Other Inputs'!$E$265),0)","v":3466074},{"$f":"ROUND((M145+M147)/(1-'Other Inputs'!$E$265),0)","v":2732885},{"$f":"ROUND((N145+N147)/(1-'Other Inputs'!$E$265),0)","v":2507904},{"$f":"ROUND((O145+O147)/(1-'Other Inputs'!$E$265),0)","v":2903854},{"$f":"SUM(D150:O150)","v":117883127},146]
[null,null,null,null,null,null,null,null,null,null,null,null,null,null,null,null,147]
["Peaking Injection",null,null,{"$f":"+D127","v":1124309},126786,0,0,0,0,335461,353119,341730,353120,353120,485570,{"$f":"SUM(D152:O152)","v":3473215},148]
["Clay Basin Injection",null,null,{"$f":"+D128","v":2812405},1500000,0,0,0,0,0,1412351.9999999998,2700000,1910379.9999999998,1945949.9999999998,2400000,{"$f":"SUM(D153:O153)","v":14681087},149]
["Storage Lost & Unaccounted For",null,null,{"$f":"-'Monthly Inputs'!G51","v":94020.497000000003},{"$f":"-'Monthly Inputs'!H51","v":38800.3488},{"$f":"-'Monthly Inputs'!I51","v":0},{"$f":"-'Monthly Inputs'!J51","v":0},{"$f":"-'Monthly Inputs'!K51","v":0},{"$f":"-'Monthly Inputs'!L51","v":0},{"$f":"-'Monthly Inputs'!M51","v":8386.5249999999996},{"$f":"-'Monthly Inputs'!N51","v":44136.774999999994},{"$f":"-'Monthly Inputs'!O51","v":76043.25},{"$f":"-'Monthly Inputs'!P51","v":56587.5},{"$f":"-'Monthly Inputs'!Q51","v":57476.75},{"$f":"-'Monthly Inputs'!R51","v":70012.437000000005},{"$f":"SUM(D154:O154)","v":445464.08279999997},150]
["Total Demand",null,null,{"$f":"SUM(D150:D154)","v":10747378.497},{"$f":"SUM(E150:E154)","v":14027434.3488},19384643,20948453,{"$f":"SUM(H150:H154)","v":17733800},14040892,9667518.5250000004,7572066.7750000004,6583847.25,5052972.5,4864450.75,{"$f":"SUM(O150:O154)","v":5859436.4369999999},{"$f":"SUM(D155:O155)","v":136482893.0828},151]
[null,null,null,null,null,null,null,null,null,null,null,null,null,null,null,null,152]
[null,null,null,"Forecast","Forecast","Forecast","Forecast","Forecast","Forecast","Forecast","Forecast","Forecast","Forecast","Forecast","Forecast","12-Month",153]
["Supply",null,null,{"$f":"D5","v":"Oct19"},"Nov19","Dec19","Jan20","Feb20","Mar20","Apr20","May20","Jun20","Jul20","Aug20","Sep20","Total",154]
["Company Production",null,null,{"$f":"+D120","v":5658224},{"$f":"+E120","v":5360505},5562662,5433616,5096209,5320388.0000000009,5046084,5120670,4872039,4956388,4999358,4810602,{"$f":"SUM(D159:O159)","v":62236745},155]
["Co Prod Lost & Unaccounted For",null,null,{"$f":"ROUND(D159*(-'Other Inputs'!$E$267-'Other Inputs'!$E$268),0)","v":-210039},{"$f":"ROUND(E159*(-'Other Inputs'!$E$267-'Other Inputs'!$E$268),0)","v":-198987},{"$f":"ROUND(F159*(-'Other Inputs'!$E$267-'Other Inputs'!$E$268),0)","v":-206492},{"$f":"ROUND(G159*(-'Other Inputs'!$E$267-'Other Inputs'!$E$268),0)","v":-201701},{"$f":"ROUND(H159*(-'Other Inputs'!$E$267-'Other Inputs'!$E$268),0)","v":-189176},{"$f":"ROUND(I159*(-'Other Inputs'!$E$267-'Other Inputs'!$E$268),0)","v":-197498},{"$f":"ROUND(J159*(-'Other Inputs'!$E$267-'Other Inputs'!$E$268),0)","v":-187316},{"$f":"ROUND(K159*(-'Other Inputs'!$E$267-'Other Inputs'!$E$268),0)","v":-190084},{"$f":"ROUND(L159*(-'Other Inputs'!$E$267-'Other Inputs'!$E$268),0)","v":-180855},{"$f":"ROUND(M159*(-'Other Inputs'!$E$267-'Other Inputs'!$E$268),0)","v":-183986},{"$f":"ROUND(N159*(-'Other Inputs'!$E$267-'Other Inputs'!$E$268),0)","v":-185581},{"$f":"ROUND(O159*(-'Other Inputs'!$E$267-'Other Inputs'!$E$268),0)","v":-178574},{"$f":"SUM(D160:O160)","v":-2310289},156]
["Company Production @ City Gate",null,null,{"$f":"SUM(D159:D160)","v":5448185},{"$f":"SUM(E159:E160)","v":5161518},5356170,5231915,4907033,5122890.0000000009,4858768,4930586,4691184,4772402,4813777,4632028,{"$f":"SUM(D161:O161)","v":59926456},157]
[null,null,null,null,null,null,null,null,null,null,null,null,null,null,null,null,158]
["Peaking Withdrawal",null,null,{"$f":"+D135","v":0},498000,514600,837642,481400,1586550,0,0,0,0,0,0,{"$f":"SUM(D163:O163)","v":3918192},159]
["Clay Basin Withdrawal",null,null,{"$f":"+D136","v":0},957328,3317046.0000000005,3160049.9999999995,3190046.0000000005,1500000,0,0,0,0,0,0,{"$f":"SUM(D164:O164)","v":12124470},160]
["QPC Transportation Loss on Storage",null,null,{"$f":"'Monthly Inputs'!G67+'Monthly Inputs'!G59","v":0},{"$f":"'Monthly Inputs'!H67+'Monthly Inputs'!H59","v":-37687.2336},{"$f":"'Monthly Inputs'!I67+'Monthly Inputs'!I59","v":-111571.0552},{"$f":"'Monthly Inputs'!J67+'Monthly Inputs'!J59","v":-119208.41789999997},{"$f":"'Monthly Inputs'!K67+'Monthly Inputs'!K59","v":-107087.4152},{"$f":"'Monthly Inputs'!L67+'Monthly Inputs'!L59","v":-108345.55149999999},{"$f":"'Monthly Inputs'!M67+'Monthly Inputs'!M59","v":0},{"$f":"'Monthly Inputs'!N67+'Monthly Inputs'!N59","v":0},{"$f":"'Monthly Inputs'!O67+'Monthly Inputs'!O59","v":0},{"$f":"'Monthly Inputs'!P67+'Monthly Inputs'!P59","v":0},{"$f":"'Monthly Inputs'!Q67+'Monthly Inputs'!Q59","v":0},{"$f":"'Monthly Inputs'!R67+'Monthly Inputs'!R59","v":0},{"$f":"SUM(D165:O165)","v":-483899.67339999997},161]
["Storage Lost & Unaccounted For",null,null,{"$f":"'Monthly Inputs'!G51","v":-94020.497000000003},{"$f":"'Monthly Inputs'!H51","v":-38800.3488},{"$f":"'Monthly Inputs'!I51","v":0},{"$f":"'Monthly Inputs'!J51","v":0},{"$f":"'Monthly Inputs'!K51","v":0},{"$f":"'Monthly Inputs'!L51","v":0},{"$f":"'Monthly Inputs'!M51","v":-8386.5249999999996},{"$f":"'Monthly Inputs'!N51","v":-44136.774999999994},{"$f":"'Monthly Inputs'!O51","v":-76043.25},{"$f":"'Monthly Inputs'!P51","v":-56587.5},{"$f":"'Monthly Inputs'!Q51","v":-57476.75},{"$f":"'Monthly Inputs'!R51","v":-70012.437000000005},{"$f":"SUM(D166:O166)","v":-445464.08279999997},162]
["Storage Supply @ City Gate",null,null,{"$f":"SUM(D163:D166)","v":-94020.497000000003},{"$f":"SUM(E163:E166)","v":1378840.4176},3720074.9448000006,3878483.5820999998,3564358.5848000003,2978204.4484999999,-8386.5249999999996,-44136.774999999994,-76043.25,-56587.5,-57476.75,-70012.437000000005,15113298.243799999,163]
[null,null,null,null,null,null,null,null,null,null,null,null,null,null,null,null,164]
["Gas Purchased @ City Gate",null,null,{"$f":"D155-D161-D167-D154","v":5299193.4969999995},{"$f":"E155-E161-E167-E154","v":7448275.5823999997},10308398.055199999,11838054.4179,9262408.4151999988,5939797.5515000001,4808750.5250000004,2641480.7750000004,1892663.25,280570.5,50673.75,1227408.4369999999,{"$f":"SUM(D169:O169)","v":60997674.756199986},165]
["   Gas Reimbursement",null,null,{"$f":"+D171-D169","v":84524.503000000492},{"$f":"+E171-E169","v":118803.41760000028},164422.94480000064,188821.58210000023,147739.58480000123,94742.44849999994,76701.474999999627,42133.224999999627,30188.75,4475.5,808.25,19577.563000000082,{"$f":"SUM(D170:O170)","v":972939.24380000215},166]
["Gas Purchased - Dth  ( /.98)",null,null,{"$f":"ROUND(D169/(1-'Other Inputs'!$E$268),0)","v":5383718},{"$f":"ROUND(E169/(1-'Other Inputs'!$E$268),0)","v":7567079},{"$f":"ROUND(F169/(1-'Other Inputs'!$E$268),0)","v":10472821},{"$f":"ROUND(G169/(1-'Other Inputs'!$E$268),0)","v":12026876},{"$f":"ROUND(H169/(1-'Other Inputs'!$E$268),0)","v":9410148},{"$f":"ROUND(I169/(1-'Other Inputs'!$E$268),0)","v":6034540},{"$f":"ROUND(J169/(1-'Other Inputs'!$E$268),0)","v":4885452},{"$f":"ROUND(K169/(1-'Other Inputs'!$E$268),0)","v":2683614},{"$f":"ROUND(L169/(1-'Other Inputs'!$E$268),0)","v":1922852},{"$f":"ROUND(M169/(1-'Other Inputs'!$E$268),0)","v":285046},{"$f":"ROUND(N169/(1-'Other Inputs'!$E$268),0)","v":51482},{"$f":"ROUND(O169/(1-'Other Inputs'!$E$268),0)","v":1246986},{"$f":"SUM(D171:O171)","v":61970614},167]
[null,null,null,null,null,null,null,null,null,null,null,null,null,null,null,null,168]
["Transported Volumes - total",null,null,{"$f":"+D161+D169+D137+D165","v":10747378.497},{"$f":"+E161+E169+E137+E165","v":14027434.3488},{"$f":"+F161+F169+F137+F165","v":19384643},20948453,{"$f":"+H161+H169+H137+H165","v":17733800},14040892,9667518.5250000004,7572066.7750000004,6583847.25,5052972.5,4864450.75,5859436.4369999999,{"$f":"+P161+P169+P137+P165","v":136482893.08279997},169]
["Kern transported volumes",null,null,{"$f":"HLOOKUP(MONTH(D5),kernrivertrans,6,FALSE)","v":728386.05523204361},{"$f":"HLOOKUP(MONTH(E5),kernrivertrans,6,FALSE)","v":2381995.8699606392},3524691.1275253342,3524691.1275253342,{"$f":"HLOOKUP(MONTH(H5),kernrivertrans,6,FALSE)","v":3297291.6999430545},2461395.7322926605,{"$f":"HLOOKUP(MONTH(J5),kernrivertrans,6,FALSE)","v":704889.73086971964},728386.05523204361,704889.73086971964,728386.05523204361,728386.05523204361,704889.73086971964,null,170]
["Storage Fuel %",null,{"$f":"(P154-P166)/(P163+P164+P152+P153)","v":2.6052843919126854E-2},null,null,null,null,null,null,null,null,null,null,null,null,null,171]
[null,null,null,null,null,null,null,null,null,null,null,null,null,null,null,null,172]
["Company Production as % of Total Supply / Demand",null,null,{"$f":"D159/(D171+D159)","v":0.51243015042100382},0.41465636579889947,{"$f":"F159/(F171+F159)","v":0.34689706571358031},0.31119489645538051,{"$f":"H159/(H171+H159)","v":0.35130867108813052},0.46855321319518722,0.50808696660818631,0.65613578388485094,0.71701503379524412,0.94561679113006092,0.98980723998384423,{"$f":"O159/(O171+O159)","v":0.79414479822662087},{"$f":"P159/(P171+P159)","v":0.50107131736051158},173]
[null,null,null,null,null,null,null,null,null,null,null,null,null,null,null,null,174]
["Peak Hour Service",null,null,{"$f":"IF(OR(D6=11,D6=12,D6=1,D6=2),'Other Inputs'!D$20*16*'Other Inputs'!$F$21,0)+IF(OR(D6=11,D6=12,D6=1,D6=2),'Other Inputs'!$D$23*16*'Other Inputs'!$F$24,0)","v":0},{"$f":"IF(OR(E6=11,E6=12,E6=1,E6=2),'Other Inputs'!E$20*16*'Other Inputs'!$F$21,0)+IF(OR(E6=11,E6=12,E6=1,E6=2),'Other Inputs'!$D$23*16*'Other Inputs'!$F$24,0)","v":244414.41391304345},{"$f":"IF(OR(F6=11,F6=12,F6=1,F6=2),'Other Inputs'!F$20*31*'Other Inputs'!$F$21,0)+IF(OR(F6=11,F6=12,F6=1,F6=2),'Other Inputs'!$D$23*31*'Other Inputs'!$F$24,0)","v":473654.86322318832},{"$f":"IF(OR(G6=11,G6=12,G6=1,G6=2),'Other Inputs'!G$20*31*'Other Inputs'!$F$21,0)+IF(OR(G6=11,G6=12,G6=1,G6=2),'Other Inputs'!$D$23*31*'Other Inputs'!$F$24,0)","v":473517.58695652167},{"$f":"IF(OR(H6=11,H6=12,H6=1,H6=2),'Other Inputs'!H$20*14*'Other Inputs'!$F$21,0)+IF(OR(H6=11,H6=12,H6=1,H6=2),'Other Inputs'!$D$23*14*'Other Inputs'!$F$24,0)","v":213846.65217391303},{"$f":"IF(OR(I6=11,I6=12,I6=1,I6=2),'Other Inputs'!I$20*16*'Other Inputs'!$F$21,0)+IF(OR(I6=11,I6=12,I6=1,I6=2),'Other Inputs'!$D$23*16*'Other Inputs'!$F$24,0)","v":0},{"$f":"IF(OR(J6=11,J6=12,J6=1,J6=2),'Other Inputs'!J$20*16*'Other Inputs'!$F$21,0)+IF(OR(J6=11,J6=12,J6=1,J6=2),'Other Inputs'!$D$23*16*'Other Inputs'!$F$24,0)","v":0},{"$f":"IF(OR(K6=11,K6=12,K6=1,K6=2),'Other Inputs'!K$20*16*'Other Inputs'!$F$21,0)+IF(OR(K6=11,K6=12,K6=1,K6=2),'Other Inputs'!$D$23*16*'Other Inputs'!$F$24,0)","v":0},{"$f":"IF(OR(L6=11,L6=12,L6=1,L6=2),'Other Inputs'!L$20*16*'Other Inputs'!$F$21,0)+IF(OR(L6=11,L6=12,L6=1,L6=2),'Other Inputs'!$D$23*16*'Other Inputs'!$F$24,0)","v":0},{"$f":"IF(OR(M6=11,M6=12,M6=1,M6=2),'Other Inputs'!M$20*16*'Other Inputs'!$F$21,0)+IF(OR(M6=11,M6=12,M6=1,M6=2),'Other Inputs'!$D$23*16*'Other Inputs'!$F$24,0)","v":0},{"$f":"IF(OR(N6=11,N6=12,N6=1,N6=2),'Other Inputs'!N$20*16*'Other Inputs'!$F$21,0)+IF(OR(N6=11,N6=12,N6=1,N6=2),'Other Inputs'!$D$23*16*'Other Inputs'!$F$24,0)","v":0},{"$f":"IF(OR(O6=11,O6=12,O6=1,O6=2),'Other Inputs'!O$20*16*'Other Inputs'!$F$21,0)+IF(OR(O6=11,O6=12,O6=1,O6=2),'Other Inputs'!$D$23*16*'Other Inputs'!$F$24,0)","v":0},{"$f":"SUM(D179:O179)","v":1405433.5162666666},175]
[null,null,null,null,null,null,null,null,null,null,null,null,null,null,null,null,176]
["PURCHASES BREAKDOWN",null,null,null,null,null,null,null,null,null,null,null,null,null,null,null,177]
["Spot Market Purchases",null,null,{"$f":"'Monthly Inputs'!G83","v":4222720},{"$f":"'Monthly Inputs'!H83","v":4431064},{"$f":"'Monthly Inputs'!I83","v":4395820.9999999991},{"$f":"'Monthly Inputs'!J83","v":4949876.0000000009},{"$f":"'Monthly Inputs'!K83","v":4467148},{"$f":"'Monthly Inputs'!L83","v":5104539.9999999991},{"$f":"'Monthly Inputs'!M83","v":3985452},{"$f":"'Monthly Inputs'!N83","v":2600380},{"$f":"'Monthly Inputs'!O83","v":1639950},{"$f":"'Monthly Inputs'!P83","v":0},{"$f":"'Monthly Inputs'!Q83","v":0},{"$f":"'Monthly Inputs'!R83","v":1246986},{"$f":"SUM(D182:O182)","v":37043937},178]
["Spot Market Purchases Cost",null,null,{"$f":"'Monthly Inputs'!G84","v":7938713.5999999996},{"$f":"'Monthly Inputs'!H84","v":9349545.0399999991},{"$f":"'Monthly Inputs'!I84","v":10637886.819999997},{"$f":"'Monthly Inputs'!J84","v":11879702.400000002},{"$f":"'Monthly Inputs'!K84","v":10006411.520000001},{"$f":"'Monthly Inputs'!L84","v":9188171.9999999981},{"$f":"'Monthly Inputs'!M84","v":6974541},{"$f":"'Monthly Inputs'!N84","v":4264623.2},{"$f":"'Monthly Inputs'!O84","v":2607520.5},{"$f":"'Monthly Inputs'!P84","v":0},{"$f":"'Monthly Inputs'!Q84","v":0},{"$f":"'Monthly Inputs'!R84","v":2119876.1999999997},{"$f":"SUM(D183:O183)","v":74966992.280000001},179]
[null,null,null,null,null,null,null,null,null,null,null,null,null,null,null,null,180]
["Contract Purchases  (Dth)",null,null,{"$f":"'Monthly Inputs'!G92","v":930000},{"$f":"'Monthly Inputs'!H92","v":1110000},{"$f":"'Monthly Inputs'!I92","v":2077000},{"$f":"'Monthly Inputs'!J92","v":2077000},{"$f":"'Monthly Inputs'!K92","v":1943000},{"$f":"'Monthly Inputs'!L92","v":930000},{"$f":"'Monthly Inputs'!M92","v":900000},{"$f":"'Monthly Inputs'!N92","v":0},{"$f":"'Monthly Inputs'!O92","v":0},{"$f":"'Monthly Inputs'!P92","v":0},{"$f":"'Monthly Inputs'!Q92","v":0},{"$f":"'Monthly Inputs'!R92","v":0},{"$f":"SUM(D185:O185)","v":9967000},181]
["Contract Purchases Cost Including Stabalization Costs",null,null,{"$f":"'Monthly Inputs'!G93+'Monthly Inputs'!G94","v":1973995.68},{"$f":"'Monthly Inputs'!H93+'Monthly Inputs'!H94","v":2569666.7280000001},{"$f":"'Monthly Inputs'!I93+'Monthly Inputs'!I94","v":5332390.5751999998},{"$f":"'Monthly Inputs'!J93+'Monthly Inputs'!J94","v":5289964.7439999999},{"$f":"'Monthly Inputs'!K93+'Monthly Inputs'!K94","v":4631167.2496000007},{"$f":"'Monthly Inputs'!L93+'Monthly Inputs'!L94","v":1898464.8000000005},{"$f":"'Monthly Inputs'!M93+'Monthly Inputs'!M94","v":1791540.0000000002},{"$f":"'Monthly Inputs'!N93+'Monthly Inputs'!N94","v":0},{"$f":"'Monthly Inputs'!O93+'Monthly Inputs'!O94","v":0},{"$f":"'Monthly Inputs'!P93+'Monthly Inputs'!P94","v":0},{"$f":"'Monthly Inputs'!Q93+'Monthly Inputs'!Q94","v":0},{"$f":"'Monthly Inputs'!R93+'Monthly Inputs'!R94","v":0},{"$f":"SUM(D186:O186)","v":23487189.776799999},182]
[null,null,null,null,null,null,null,null,null,null,null,null,null,null,null,null,183]
["Peak Purchases  (Dth)",null,null,{"$f":"'Monthly Inputs'!G89","v":0},{"$f":"'Monthly Inputs'!H89","v":1000000},{"$f":"'Monthly Inputs'!I89","v":4000000},{"$f":"'Monthly Inputs'!J89","v":5000000},{"$f":"'Monthly Inputs'!K89","v":3000000},{"$f":"'Monthly Inputs'!L89","v":0},{"$f":"'Monthly Inputs'!M89","v":0},{"$f":"'Monthly Inputs'!N89","v":0},{"$f":"'Monthly Inputs'!O89","v":0},{"$f":"'Monthly Inputs'!P89","v":0},{"$f":"'Monthly Inputs'!Q89","v":0},{"$f":"'Monthly Inputs'!R89","v":0},{"$f":"SUM(D188:O188)","v":13000000},184]
["Peak Purchases Cost",null,null,{"$f":"'Monthly Inputs'!G90","v":0},{"$f":"'Monthly Inputs'!H90","v":2170248.2535714288},{"$f":"'Monthly Inputs'!I90","v":8680993.0142857153},{"$f":"'Monthly Inputs'!J90","v":10851241.267857144},{"$f":"'Monthly Inputs'!K90","v":6510744.760714286},{"$f":"'Monthly Inputs'!L90","v":0},{"$f":"'Monthly Inputs'!M90","v":0},{"$f":"'Monthly Inputs'!N90","v":0},{"$f":"'Monthly Inputs'!O90","v":0},{"$f":"'Monthly Inputs'!P90","v":0},{"$f":"'Monthly Inputs'!Q90","v":0},{"$f":"'Monthly Inputs'!R90","v":0},{"$f":"SUM(D189:O189)","v":28213227.296428572},185]
[null,null,null,null,null,null,null,null,null,null,null,null,null,null,null,null,186]
["Future Purchases",null,null,{"$f":"+D171-D182-D185-D188","v":230998},{"$f":"+E171-E182-E185-E188","v":1026015},{"$f":"+F171-F182-F185-F188","v":0},{"$f":"+G171-G182-G185-G188","v":0},{"$f":"+H171-H182-H185-H188","v":0},{"$f":"+I171-I182-I185-I188","v":9.3132257461547852E-10},{"$f":"+J171-J182-J185-J188","v":0},{"$f":"+K171-K182-K185-K188","v":83234},282902,{"$f":"+M171-M182-M185-M188","v":285046},51482,0,{"$f":"SUM(D191:O191)","v":1959677.0000000009},187]
["Future Purchases Cost",null,null,{"$f":"ROUND(D191*D199,0)","v":438896},{"$f":"ROUND(E191*E199,0)","v":2185412},{"$f":"ROUND(F191*F199,0)","v":0},{"$f":"ROUND(G191*G199,0)","v":0},{"$f":"ROUND(H191*H199,0)","v":0},0,0,138168,455472,527335,97816,0,{"$f":"SUM(D192:O192)","v":3843099},188]
[null,null,null,null,null,null,null,null,null,null,null,null,null,null,null,null,189]
["Total Purchases Cost",null,null,{"$f":"+D183+D186+D189+D192","v":10351605.279999999},{"$f":"+E183+E186+E189+E192","v":16274872.021571428},{"$f":"+F183+F186+F189+F192","v":24651270.409485713},{"$f":"+G183+G186+G189+G192","v":28020908.411857143},{"$f":"+H183+H186+H189+H192","v":21148323.530314289},11086636.799999999,{"$f":"+J183+J186+J189+J192","v":8766081},4402791.2,3062992.5,527335,97816,{"$f":"+O183+O186+O189+O192","v":2119876.1999999997},130510508.35322858,190]
[null,null,null,null,null,null,null,null,null,null,null,null,null,null,null,null,191]
["Gas Cost",null,null,null,null,null,null,null,null,null,null,null,null,null,null,null,192]
["Gas Cost Purchases",null,null,{"$f":"IF(D171=0,0,ROUND(D194/D171,5))","v":1.92276},{"$f":"IF(E171=0,0,ROUND(E194/E171,5))","v":2.1507499999999999},2.3538299999999999,2.32986,2.2473999999999998,1.8371999999999999,1.7943199999999999,1.64062,1.59294,1.85,1.9,1.7,null,193]
["Gas Cost Injection Rate ",null,null,{"$f":"'Ut Storage'!K27","v":3.2556919907275685},{"$f":"+D198","v":3.2556919907275685},3.2556919907275685,3.2556919907275685,3.2556919907275685,3.2556919907275685,3.2556919907275685,3.2556919907275685,3.2556919907275685,3.2556919907275685,3.2556919907275685,3.2556919907275685,null,194]
[{"$f":"CONCATENATE(\"'Future Contract Price (spot + $\",'Other Inputs'!E180,\")\")","v":"'Future Contract Price (spot + $0.02)"},null,null,{"$f":"+D231+'Other Inputs'!$E$180","v":1.9},{"$f":"+E231+'Other Inputs'!$E$180","v":2.13},{"$f":"+F231+'Other Inputs'!$E$180","v":2.44},{"$f":"+G231+'Other Inputs'!$E$180","v":2.42},{"$f":"+H231+'Other Inputs'!$E$180","v":2.2600000000000002},{"$f":"+I231+'Other Inputs'!$E$180","v":1.82},{"$f":"+J231+'Other Inputs'!$E$180","v":1.77},{"$f":"+K231+'Other Inputs'!$E$180","v":1.66},{"$f":"+L231+'Other Inputs'!$E$180","v":1.61},{"$f":"+M231+'Other Inputs'!$E$180","v":1.85},{"$f":"+N231+'Other Inputs'!$E$180","v":1.9},{"$f":"+O231+'Other Inputs'!$E$180","v":1.72},null,195]
[null,null,null,null,null,null,null,null,null,null,null,null,null,null,null,null,196]
["System Production",null,null,{"$f":"+D161","v":5448185},5161518,5356170,5231915,4907033,5122890.0000000009,4858768,4930586,4691184,4772402,4813777,4632028,{"$f":"SUM(D201:O201)","v":59926456},197]
["System Purchases",null,null,{"$f":"+D169","v":5299193.4969999995},7448275.5823999997,10308398.055199999,11838054.4179,9262408.4151999988,5939797.5515000001,4808750.5250000004,2641480.7750000004,1892663.25,280570.5,50673.75,1227408.4369999999,{"$f":"SUM(D202:O202)","v":60997674.756199986},198]
["System Gathering of Production",null,null,{"$f":"ROUND($P203*D$120/$P$120,0)","v":0},0,0,0,0,0,0,0,0,0,0,0,{"$f":"'Other Inputs'!$D$185","v":0},199]
["System Birch Creek Gathering",null,null,{"$f":"ROUND($P204*D$120/$P$120,0)","v":0},0,0,0,0,0,0,0,0,0,0,0,{"$f":"'Other Inputs'!$D$170","v":0},200]
[null,null,null,null,null,null,null,null,null,null,null,null,null,null,null,null,201]
["Utah Production",null,null,{"$f":"ROUND(D201*$I$74,0)","v":5265816},4988745,5176881,5056786,4742778,4951410,4696129,4765543,4534155,4612654,4652644,4476979,{"$f":"SUM(D206:O206)","v":57920520},202]
["Utah Purchases",null,null,{"$f":"ROUND(D202*$I$74,0)","v":5121812},7198957,9963342,11441796,8952365,5740973,4647786,2553062,1829310,271179,48978,1186323,{"$f":"SUM(D207:O207)","v":58955883},203]
["Utah Gathering",null,null,{"$f":"ROUND(D203*$I$74,0)","v":0},0,0,0,0,0,0,0,0,0,0,0,{"$f":"SUM(D208:O208)","v":0},204]
["Utah Birch Creek Gathering",null,null,{"$f":"ROUND(D204*$I$74,0)","v":0},0,0,0,0,0,0,0,0,0,0,0,{"$f":"SUM(D209:O209)","v":0},205]
[null,null,null,null,null,null,null,null,null,null,null,null,null,null,null,null,206]
["Wyoming Production",null,null,{"$f":"+D201-D206","v":182369},172773,179289,175129,164255,171480.00000000093,162639,165043,157029,159748,161133,155049,{"$f":"SUM(D211:O211)","v":2005936.0000000009},207]
["Wyoming Purchases",null,null,{"$f":"+D202-D207","v":177381.49699999951},249318.58239999972,345056.05519999936,396258.41789999977,310043.41519999877,198824.55150000006,160964.52500000037,88418.775000000373,63353.25,9391.5,1695.75,41085.436999999918,{"$f":"SUM(D212:O212)","v":2041791.7561999978},208]
["Wyoming Gathering",null,null,{"$f":"+D203-D208","v":0},0,0,0,0,0,0,0,0,0,0,0,{"$f":"SUM(D213:O213)","v":0},209]
["Wyoming Birch Creek Gathering",null,null,{"$f":"+D204-D209","v":0},0,0,0,0,0,0,0,0,0,0,0,{"$f":"SUM(D214:O214)","v":0},210]
[]
[]
["I-2, I-4 Averate Gas Cost Calculations"]
["Wyoming"]
[null,"Wyoming I-2 Volumes",null,{"$f":"D34","v":8719},15002,14644,16875,15622,15752,14302,10909,7844,5893,3957,5079,134598]
[null,"Wyoming I-4 Volumes",null,{"$f":"D35","v":0},0,0,0,0,0,0,0,0,0,0,0,0]
[null,null,null,{"$f":"SUM(D219:D220)","v":8719},{"$f":"SUM(E219:E220)","v":15002},14644,16875,15622,15752,14302,10909,7844,5893,3957,5079,134598]
[]
[null,"Global Insight Spot Price Forecast",null,{"$f":"'Monthly Inputs'!G79","v":1.88},{"$f":"'Monthly Inputs'!H79","v":2.11},{"$f":"'Monthly Inputs'!I79","v":2.42},{"$f":"'Monthly Inputs'!J79","v":2.4},{"$f":"'Monthly Inputs'!K79","v":2.2400000000000002},{"$f":"'Monthly Inputs'!L79","v":1.8},{"$f":"'Monthly Inputs'!M79","v":1.75},{"$f":"'Monthly Inputs'!N79","v":1.64},{"$f":"'Monthly Inputs'!O79","v":1.59},{"$f":"'Monthly Inputs'!P79","v":1.83},{"$f":"'Monthly Inputs'!Q79","v":1.88},{"$f":"'Monthly Inputs'!R79","v":1.7}]
[null,null,null,{"$f":"D221*D223","v":16391.719999999998},{"$f":"E221*E223","v":31654.219999999998},35438.479999999996,40500,34993.280000000006,28353.600000000002,25028.5,17890.759999999998,12471.960000000001,10784.19,7439.16,8634.2999999999993,{"$f":"SUM(D224:O224)","v":269580.17}]
[null,null,null,null,null,null,null,null,null,null,null,null,null,null,null,{"$f":"P224/P221","v":2.0028542028856298}]
[null,null,null,null,null,null,null,null,null,null,null,null,null,null,null,{"$f":"1-'Other Inputs'!$E$266","v":0.98499999999999999}]
[null,null,null,null,null,null,null,null,null,null,null,null,null,null,null,{"$f":"1-'Other Inputs'!$E$268","v":0.98429999999999995}]
[null,null,null,null,null,null,null,null,null,null,null,null,null,null,null,{"$f":"P225/P226/P227","v":2.0657873826029372}]
["Utah"]
[null,"Utah I-4 & IS-4 Volumes",null,{"$f":"D15+D16","v":8472},11833,18631,17090,12135,13579,10979,8294,8433,6398,7067,8000,{"$f":"P15+P16","v":130911}]
[null,{"$f":"B223","v":"Global Insight Spot Price Forecast"},null,{"$f":"'Monthly Inputs'!G79","v":1.88},{"$f":"'Monthly Inputs'!H79","v":2.11},{"$f":"'Monthly Inputs'!I79","v":2.42},{"$f":"'Monthly Inputs'!J79","v":2.4},{"$f":"'Monthly Inputs'!K79","v":2.2400000000000002},{"$f":"'Monthly Inputs'!L79","v":1.8},{"$f":"'Monthly Inputs'!M79","v":1.75},{"$f":"'Monthly Inputs'!N79","v":1.64},{"$f":"'Monthly Inputs'!O79","v":1.59},{"$f":"'Monthly Inputs'!P79","v":1.83},{"$f":"'Monthly Inputs'!Q79","v":1.88},{"$f":"'Monthly Inputs'!R79","v":1.7}]
[null,null,null,{"$f":"D230*D231","v":15927.359999999999},{"$f":"E230*E231","v":24967.629999999997},45087.02,41016,27182.400000000001,24442.2,19213.25,13602.16,13408.470000000001,11708.34,13285.96,{"$f":"O230*O231","v":13600},{"$f":"SUM(D232:O232)","v":263440.79000000004}]
[null,null,null,null,null,null,null,null,null,null,null,null,null,null,null,{"$f":"P232/P230","v":2.012365576613119}]
[null,null,null,null,null,null,null,null,null,null,null,null,null,null,null,{"$f":"1-'Other Inputs'!$E$265","v":0.99550000000000005}]
[null,null,null,null,null,null,null,null,null,null,null,null,null,null,null,{"$f":"1-'Other Inputs'!$E$268","v":0.98429999999999995}]
[]
[null,null,null,null,null,null,null,null,null,null,null,null,null,null,null,{"$f":"P233/P234/P235","v":2.0537053299975043}]
[]
[null,null,null,{"$f":"MONTH(D240)","v":10},{"$f":"MONTH(E240)","v":11},{"$f":"MONTH(F240)","v":12},1,2,3,4,5,6,7,8,9]
[null,null,null,{"$f":"+D5","v":"Oct19"},{"$f":"+E5","v":"Nov19"},"Dec19","Jan20","Feb20","Mar20","Apr20","May20","Jun20","Jul20","Aug20","Sep20"]
[null,null,null,{"$f":"VLOOKUP(MONTH(D240),$C$250:$E$261,2,FALSE)","v":31},{"$f":"VLOOKUP(MONTH(E240),$C$250:$E$261,2,FALSE)","v":30},31,31,29,31,30,31,30,31,31,30]
[null,null,null,{"$f":"VLOOKUP(MONTH(D240),$C$250:$E$261,3,FALSE)","v":34885},{"$f":"VLOOKUP(MONTH(E240),$C$250:$E$261,3,FALSE)","v":117885},168810,168810,168810,117885,34885,34885,34885,34885,34885,34885]
[null,null,null,{"$f":"'Other Inputs'!$C$69","v":0.67353660204454602},{"$f":"'Other Inputs'!$C$69","v":0.67353660204454602},{"$f":"'Other Inputs'!$C$69","v":0.67353660204454602},{"$f":"'Other Inputs'!$C$69","v":0.67353660204454602},{"$f":"'Other Inputs'!$C$69","v":0.67353660204454602},{"$f":"'Other Inputs'!$C$69","v":0.67353660204454602},{"$f":"'Other Inputs'!$C$69","v":0.67353660204454602},{"$f":"'Other Inputs'!$C$69","v":0.67353660204454602},{"$f":"'Other Inputs'!$C$69","v":0.67353660204454602},{"$f":"'Other Inputs'!$C$69","v":0.67353660204454602},{"$f":"'Other Inputs'!$C$69","v":0.67353660204454602},{"$f":"'Other Inputs'!$C$69","v":0.67353660204454602}]
[null,null,null,{"$f":"D241*D242*D243","v":728386.05523204361},2381995.8699606392,3524691.1275253342,3524691.1275253342,3297291.6999430545,2461395.7322926605,704889.73086971964,728386.05523204361,704889.73086971964,728386.05523204361,728386.05523204361,704889.73086971964,{"$f":"SUM(D244:O244)","v":20218278.970784351}]
[]
[]
[]
[]
[null,null,"Month","Days","Trans Dths"]
[null,null,1,31,168810]
[null,null,2,29,168810]
[null,null,3,31,117885]
[null,null,4,30,34885]
[null,null,5,31,34885]
[null,null,6,30,34885]
[null,null,7,31,34885]
[null,null,8,31,34885]
[null,null,9,30,34885]
[null,null,10,31,34885]
[null,null,11,30,117885]
[null,null,12,31,168810]
[null,null,"Total",null,{"$f":"SUM(E250:E261)","v":986395}]

{"sheet":"CET & DSM","index":6,"n_rows":119,"n_cols":23,"rows_kept":119,"cut":false,"hidden":true,"merged":[[9,19,9,22],[7,18,7,22],[13,15,13,16],[49,0,49,9],[42,0,42,11],[2,15,2,16],[13,11,13,13],[67,0,67,9],[13,1,13,3],[103,0,103,9],[28,0,28,11],[5,7,5,9],[85,0,85,9],[8,0,8,13],[13,7,13,9],[35,0,35,11],[0,0,0,13],[3,0,3,9],[4,3,4,6],[4,7,4,9],[21,0,21,11]]}
["Rate Caclulation for the CET and DSM Amortizations"]
[]
[null,null,null,null,null,null,null,null,null,null,null,null,null,null,null,"Solver Cells"]
["CET Amortization % Calculation",null,null,null,null,null,null,null,null,null,null,null,null,null,null,"% Change","Difference"]
[null,"Balance","Date","GS Dth",null,null,null,"Amortization per Dth",null,null,null,null,null,null,null,{"$f":"J20/D20","v":{"$error":"#REF!"}},{"$f":"J20-B11","v":{"$error":"#REF!"}},null,"-> Difference should be at 0 (Use Goal Seek to Get Difference to Equal 0."]
["DSM Balance",{"$f":"'Other Inputs'!#REF!","v":{"$error":"#REF!"}},{"$f":"'Other Inputs'!#REF!","v":{"$error":"#REF!"}},{"$f":"B20","v":{"$error":"#REF!"}},null,null,null,{"$f":"ROUND(B6/D6,5)","v":{"$error":"#REF!"}}]
[]
[null,null,null,null,null,null,null,null,null,null,null,null,null,null,null,null,null,null,"Typical Bill Rates"]
["CET Amortization Calculation"]
[null,"Balance","Date","DNG Rev",null,null,null,"New DNG",null,null,null,"% Change",null,null,null,null,null,null,"Current","Proposed"]
["CET Balance",{"$f":"'Other Inputs'!#REF!","v":{"$error":"#REF!"}},{"$f":"'Other Inputs'!#REF!","v":{"$error":"#REF!"}},{"$f":"D20","v":{"$error":"#REF!"}},null,null,null,{"$f":"D11+B11","v":{"$error":"#REF!"}},null,null,null,{"$f":"P5","v":{"$error":"#REF!"}},null,null,null,null,null,null,"Effective",null,null,"SNG &","CET, DSM"]
[null,null,null,null,null,null,null,null,null,null,null,null,null,null,null,null,null,null,{"$f":"'Other Inputs'!$J$96","v":"2019-08-01"},"CET Only","DSM Only","Commodity","Commodity"]
[null,null,null,null,null,null,null,null,null,null,null,null,null,null,null,null,null,null,"BSF","BSF","BSF","BSF","BSF"]
[null,"Revenue Calculation",null,null,null,null,null,"CET Amortization",null,null,null,"Total DNG",null,null,null,"REVRUN Calculation",null,null,{"$f":"'Other Inputs'!$G$100","v":6.75},{"$f":"'Other Inputs'!$G$100","v":6.75},{"$f":"'Other Inputs'!$G$100","v":6.75},{"$f":"'Other Inputs'!$G$100","v":6.75},{"$f":"'Ut 1.7 Source'!$C$12","v":6.75}]
["Utah GS","Dth","Base DNG","DNG Revenue",null,null,null,"CET Rate",null,"Revenue",null,"DNG Rate",null,"Revenue",null,"CET Rate","CET Amort"]
["Block 1 Summer",{"$f":"'Other Inputs'!#REF!","v":{"$error":"#REF!"}},{"$f":"'Other Inputs'!E250","v":1.7266999999999999},{"$f":"B16*C16","v":{"$error":"#REF!"}},null,null,null,{"$f":"ROUND((J16/B16),5)","v":{"$error":"#REF!"}},null,{"$f":"D16*$P$5","v":{"$error":"#REF!"}},null,{"$f":"C16+H16","v":{"$error":"#REF!"}},null,{"$f":"L16*B16","v":{"$error":"#REF!"}},null,{"$f":"ROUND(H16,5)","v":{"$error":"#REF!"}},{"$f":"B16*P16","v":{"$error":"#REF!"}},null,{"$f":"'Other Inputs'!$G$96","v":5.9028700000000001},{"$f":"N24","v":{"$error":"#REF!"}},{"$f":"N31","v":{"$error":"#REF!"}},{"$f":"N38","v":{"$error":"#REF!"}},{"$f":"N45","v":{"$error":"#REF!"}}]
["Block 2 Summer",{"$f":"'Other Inputs'!#REF!","v":{"$error":"#REF!"}},{"$f":"'Other Inputs'!E251","v":0.72670000000000001},{"$f":"B17*C17","v":{"$error":"#REF!"}},null,null,null,{"$f":"ROUND((J17/B17),5)","v":{"$error":"#REF!"}},null,{"$f":"D17*$P$5","v":{"$error":"#REF!"}},null,{"$f":"C17+H17","v":{"$error":"#REF!"}},null,{"$f":"L17*B17","v":{"$error":"#REF!"}},null,{"$f":"ROUND(H17,5)","v":{"$error":"#REF!"}},{"$f":"B17*P17","v":{"$error":"#REF!"}}]
["Block 1 Winter",{"$f":"'Other Inputs'!#REF!","v":{"$error":"#REF!"}},{"$f":"'Other Inputs'!E252","v":2.3494899999999999},{"$f":"B18*C18","v":{"$error":"#REF!"}},null,null,null,{"$f":"ROUND((J18/B18),5)","v":{"$error":"#REF!"}},null,{"$f":"D18*$P$5","v":{"$error":"#REF!"}},null,{"$f":"C18+H18","v":{"$error":"#REF!"}},null,{"$f":"L18*B18","v":{"$error":"#REF!"}},null,{"$f":"ROUND(H18,5)","v":{"$error":"#REF!"}},{"$f":"B18*P18","v":{"$error":"#REF!"}},null,{"$f":"'Other Inputs'!$G$98","v":7.1727999999999996},{"$f":"N26","v":{"$error":"#REF!"}},{"$f":"N33","v":{"$error":"#REF!"}},{"$f":"N40","v":{"$error":"#REF!"}},{"$f":"N47","v":{"$error":"#REF!"}}]
["Block 2 Winter",{"$f":"'Other Inputs'!#REF!","v":{"$error":"#REF!"}},{"$f":"'Other Inputs'!E253","v":1.3494900000000001},{"$f":"B19*C19","v":{"$error":"#REF!"}},null,null,null,{"$f":"ROUND((J19/B19),5)","v":{"$error":"#REF!"}},null,{"$f":"D19*$P$5","v":{"$error":"#REF!"}},null,{"$f":"C19+H19","v":{"$error":"#REF!"}},null,{"$f":"L19*B19","v":{"$error":"#REF!"}},null,{"$f":"ROUND(H19,5)","v":{"$error":"#REF!"}},{"$f":"B19*P19","v":{"$error":"#REF!"}}]
["GS-1 Block Rev",{"$f":"SUM(B16:B19)","v":{"$error":"#REF!"}},null,{"$f":"SUM(D16:D19)","v":{"$error":"#REF!"}},null,null,null,null,null,{"$f":"B11","v":{"$error":"#REF!"}},null,null,null,{"$f":"SUM(N16:N19)","v":{"$error":"#REF!"}},null,null,{"$f":"SUM(Q16:Q19)","v":{"$error":"#REF!"}}]
[]
["Total Rate Calculation With CET Amortization Only",null,null,null,null,null,null,null,null,null,null,null,null,{"$f":"'Control Panel'!E8","v":"2020-10-01"},null,{"$f":"'Other Inputs'!$J$96","v":"2019-08-01"}]
["Utah GS","Base DNG","CET","DSM","Energy Assist","Infrastructure",null,"Total DNG","Base SNG","SNG Amort",null,"Base Gas Cost","191 Amort","Total Rate",null,"Total Rate"]
["Block 1 Summer",{"$f":"$C$16","v":1.7266999999999999},{"$f":"$H$16","v":{"$error":"#REF!"}},0.44103999999999999,1.519E-2,2.9080000000000002E-2,null,{"$f":"SUM(B24:F24)","v":{"$error":"#REF!"}},0.55715000000000003,1.244E-2,null,4.2133900000000004,0.14066999999999999,{"$f":"SUM(H24:M24)","v":{"$error":"#REF!"}},null,{"$f":"'Other Inputs'!$G$96","v":5.9028700000000001},{"$f":"N24-P24","v":{"$error":"#REF!"}}]
["Block 2 Summer",{"$f":"$C$17","v":0.72670000000000001},{"$f":"$H$17","v":{"$error":"#REF!"}},{"$f":"$D$24","v":0.44103999999999999},{"$f":"$E$24","v":1.519E-2},1.0800000000000001E-2,null,{"$f":"SUM(B25:F25)","v":{"$error":"#REF!"}},{"$f":"I24","v":0.55715000000000003},{"$f":"J24","v":1.244E-2},null,{"$f":"L24","v":4.2133900000000004},{"$f":"$M$24","v":0.14066999999999999},{"$f":"SUM(H25:M25)","v":{"$error":"#REF!"}},null,{"$f":"'Other Inputs'!$G$97","v":4.7660400000000003},{"$f":"N25-P25","v":{"$error":"#REF!"}}]
["Block 1 Winter",{"$f":"$C$18","v":2.3494899999999999},{"$f":"$H$18","v":{"$error":"#REF!"}},{"$f":"$D$24","v":0.44103999999999999},{"$f":"$E$24","v":1.519E-2},3.4529999999999998E-2,null,{"$f":"SUM(B26:F26)","v":{"$error":"#REF!"}},1.18665,2.6509999999999999E-2,null,{"$f":"L24","v":4.2133900000000004},{"$f":"$M$24","v":0.14066999999999999},{"$f":"SUM(H26:M26)","v":{"$error":"#REF!"}},null,{"$f":"'Other Inputs'!$G$98","v":7.1727999999999996},{"$f":"N26-P26","v":{"$error":"#REF!"}}]
["Block 2 Winter",{"$f":"$C$19","v":1.3494900000000001},{"$f":"$H$19","v":{"$error":"#REF!"}},{"$f":"$D$24","v":0.44103999999999999},{"$f":"$E$24","v":1.519E-2},1.434E-2,null,{"$f":"SUM(B27:F27)","v":{"$error":"#REF!"}},{"$f":"I26","v":1.18665},{"$f":"J26","v":2.6509999999999999E-2},null,{"$f":"L24","v":4.2133900000000004},{"$f":"$M$24","v":0.14066999999999999},{"$f":"SUM(H27:M27)","v":{"$error":"#REF!"}},null,{"$f":"'Other Inputs'!$G$99","v":6.0359699999999998},{"$f":"N27-P27","v":{"$error":"#REF!"}}]
[]
["Total Rate Calculation With DSM Amortization Only",null,null,null,null,null,null,null,null,null,null,null,null,{"$f":"N22","v":"2020-10-01"},null,{"$f":"'Other Inputs'!$J$96","v":"2019-08-01"}]
["Utah GS","Base DNG","CET","DSM","Energy Assist","Infrastructure",null,"Total DNG","Base SNG","SNG Amort",null,"Commodity","191 Amort","Total Rate",null,"Total Rate"]
["Block 1 Summer",{"$f":"$C$16","v":1.7266999999999999},-5.9900000000000002E-2,{"$f":"$H$6","v":{"$error":"#REF!"}},{"$f":"$E$24","v":1.519E-2},{"$f":"F24","v":2.9080000000000002E-2},null,{"$f":"SUM(B31:F31)","v":{"$error":"#REF!"}},{"$f":"$I$24","v":0.55715000000000003},{"$f":"J24","v":1.244E-2},null,{"$f":"$L$24","v":4.2133900000000004},{"$f":"$M$24","v":0.14066999999999999},{"$f":"SUM(H31:M31)","v":{"$error":"#REF!"}},null,{"$f":"'Other Inputs'!$G$96","v":5.9028700000000001},{"$f":"N31-P31","v":{"$error":"#REF!"}}]
["Block 2 Summer",{"$f":"$C$17","v":0.72670000000000001},-2.2239999999999999E-2,{"$f":"$H$6","v":{"$error":"#REF!"}},{"$f":"$E$24","v":1.519E-2},{"$f":"F25","v":1.0800000000000001E-2},null,{"$f":"SUM(B32:F32)","v":{"$error":"#REF!"}},{"$f":"$I$24","v":0.55715000000000003},{"$f":"J25","v":1.244E-2},null,{"$f":"$L$24","v":4.2133900000000004},{"$f":"$M$24","v":0.14066999999999999},{"$f":"SUM(H32:M32)","v":{"$error":"#REF!"}},null,{"$f":"'Other Inputs'!$G$97","v":4.7660400000000003},{"$f":"N32-P32","v":{"$error":"#REF!"}}]
["Block 1 Winter",{"$f":"$C$18","v":2.3494899999999999},-7.1120000000000003E-2,{"$f":"$H$6","v":{"$error":"#REF!"}},{"$f":"$E$24","v":1.519E-2},{"$f":"F26","v":3.4529999999999998E-2},null,{"$f":"SUM(B33:F33)","v":{"$error":"#REF!"}},{"$f":"$I$26","v":1.18665},{"$f":"J26","v":2.6509999999999999E-2},null,{"$f":"$L$24","v":4.2133900000000004},{"$f":"$M$24","v":0.14066999999999999},{"$f":"SUM(H33:M33)","v":{"$error":"#REF!"}},null,{"$f":"'Other Inputs'!$G$98","v":7.1727999999999996},{"$f":"N33-P33","v":{"$error":"#REF!"}}]
["Block 2 Winter",{"$f":"$C$19","v":1.3494900000000001},-2.9530000000000001E-2,{"$f":"$H$6","v":{"$error":"#REF!"}},{"$f":"$E$24","v":1.519E-2},{"$f":"F27","v":1.434E-2},null,{"$f":"SUM(B34:F34)","v":{"$error":"#REF!"}},{"$f":"$I$26","v":1.18665},{"$f":"J27","v":2.6509999999999999E-2},null,{"$f":"$L$24","v":4.2133900000000004},{"$f":"$M$24","v":0.14066999999999999},{"$f":"SUM(H34:M34)","v":{"$error":"#REF!"}},null,{"$f":"'Other Inputs'!$G$99","v":6.0359699999999998},{"$f":"N34-P34","v":{"$error":"#REF!"}}]
[]
["Total Rate Calculation With SNG and Commodity Changes Only",null,null,null,null,null,null,null,null,null,null,null,null,{"$f":"N22","v":"2020-10-01"},null,{"$f":"'Other Inputs'!$J$96","v":"2019-08-01"}]
["Utah GS","Base DNG","CET","DSM","Energy Assist","Infrastructure",null,"Total DNG","Base SNG","SNG",null,"Commodity","191 Amort","Total Rate",null,"Total Rate"]
["Block 1 Summer",{"$f":"$C$16","v":1.7266999999999999},{"$f":"C31","v":-5.9900000000000002E-2},{"$f":"D24","v":0.44103999999999999},{"$f":"$E$24","v":1.519E-2},{"$f":"F24","v":2.9080000000000002E-2},null,{"$f":"SUM(B38:F38)","v":2.15211},{"$f":"#REF!","v":{"$error":"#REF!"}},{"$f":"#REF!","v":{"$error":"#REF!"}},null,{"$f":"'Ut 1.5 p1'!$F$29","v":3.1488499999999999},{"$f":"'Ut 1.5 p1'!$F$30","v":0.43865337102913732},{"$f":"SUM(H38:M38)","v":{"$error":"#REF!"}},null,{"$f":"'Other Inputs'!$G$96","v":5.9028700000000001},{"$f":"N38-P38","v":{"$error":"#REF!"}}]
["Block 2 Summer",{"$f":"$C$17","v":0.72670000000000001},{"$f":"C32","v":-2.2239999999999999E-2},{"$f":"D25","v":0.44103999999999999},{"$f":"$E$24","v":1.519E-2},{"$f":"F25","v":1.0800000000000001E-2},null,{"$f":"SUM(B39:F39)","v":1.1714899999999999},{"$f":"#REF!","v":{"$error":"#REF!"}},{"$f":"#REF!","v":{"$error":"#REF!"}},null,{"$f":"'Ut 1.5 p1'!$F$29","v":3.1488499999999999},{"$f":"'Ut 1.5 p1'!$F$30","v":0.43865337102913732},{"$f":"SUM(H39:M39)","v":{"$error":"#REF!"}},null,{"$f":"'Other Inputs'!$G$97","v":4.7660400000000003},{"$f":"N39-P39","v":{"$error":"#REF!"}}]
["Block 1 Winter",{"$f":"$C$18","v":2.3494899999999999},{"$f":"C33","v":-7.1120000000000003E-2},{"$f":"D26","v":0.44103999999999999},{"$f":"$E$24","v":1.519E-2},{"$f":"F26","v":3.4529999999999998E-2},null,{"$f":"SUM(B40:F40)","v":2.7691300000000001},{"$f":"#REF!","v":{"$error":"#REF!"}},{"$f":"#REF!","v":{"$error":"#REF!"}},null,{"$f":"'Ut 1.5 p1'!$F$29","v":3.1488499999999999},{"$f":"'Ut 1.5 p1'!$F$30","v":0.43865337102913732},{"$f":"SUM(H40:M40)","v":{"$error":"#REF!"}},null,{"$f":"'Other Inputs'!$G$98","v":7.1727999999999996},{"$f":"N40-P40","v":{"$error":"#REF!"}}]
["Block 2 Winter",{"$f":"$C$19","v":1.3494900000000001},{"$f":"C34","v":-2.9530000000000001E-2},{"$f":"D27","v":0.44103999999999999},{"$f":"$E$24","v":1.519E-2},{"$f":"F27","v":1.434E-2},null,{"$f":"SUM(B41:F41)","v":1.7905300000000002},{"$f":"#REF!","v":{"$error":"#REF!"}},{"$f":"#REF!","v":{"$error":"#REF!"}},null,{"$f":"'Ut 1.5 p1'!$F$29","v":3.1488499999999999},{"$f":"'Ut 1.5 p1'!$F$30","v":0.43865337102913732},{"$f":"SUM(H41:M41)","v":{"$error":"#REF!"}},null,{"$f":"'Other Inputs'!$G$99","v":6.0359699999999998},{"$f":"N41-P41","v":{"$error":"#REF!"}}]
[]
["Total Rate Calculation",null,null,null,null,null,null,null,null,null,null,null,null,{"$f":"N29","v":"2020-10-01"},null,{"$f":"'Other Inputs'!$J$96","v":"2019-08-01"}]
["Utah GS","Base DNG","CET","DSM","Energy Assist","Infrastructure",null,"Total DNG","Base SNG","SNG",null,"Commodity",null,"Total Rate",null,"Total Rate"]
["Block 1 Summer",{"$f":"$C$16","v":1.7266999999999999},{"$f":"$H$16","v":{"$error":"#REF!"}},{"$f":"$H$6","v":{"$error":"#REF!"}},{"$f":"$E$24","v":1.519E-2},{"$f":"F38","v":2.9080000000000002E-2},null,{"$f":"SUM(B45:F45)","v":{"$error":"#REF!"}},{"$f":"I38","v":{"$error":"#REF!"}},{"$f":"#REF!","v":{"$error":"#REF!"}},null,{"$f":"'Ut 1.5 p1'!$F$31","v":3.5875033710291371},null,{"$f":"SUM(H45:L45)","v":{"$error":"#REF!"}},null,{"$f":"'Other Inputs'!$G$96","v":5.9028700000000001},{"$f":"N45-P45","v":{"$error":"#REF!"}}]
["Block 2 Summer",{"$f":"$C$17","v":0.72670000000000001},{"$f":"$H$17","v":{"$error":"#REF!"}},{"$f":"$H$6","v":{"$error":"#REF!"}},{"$f":"$E$24","v":1.519E-2},{"$f":"F39","v":1.0800000000000001E-2},null,{"$f":"SUM(B46:F46)","v":{"$error":"#REF!"}},{"$f":"I39","v":{"$error":"#REF!"}},{"$f":"#REF!","v":{"$error":"#REF!"}},null,{"$f":"$L$45","v":3.5875033710291371},null,{"$f":"SUM(H46:L46)","v":{"$error":"#REF!"}},null,{"$f":"'Other Inputs'!$G$97","v":4.7660400000000003},{"$f":"N46-P46","v":{"$error":"#REF!"}}]
["Block 1 Winter",{"$f":"$C$18","v":2.3494899999999999},{"$f":"$H$18","v":{"$error":"#REF!"}},{"$f":"$H$6","v":{"$error":"#REF!"}},{"$f":"$E$24","v":1.519E-2},{"$f":"F40","v":3.4529999999999998E-2},null,{"$f":"SUM(B47:F47)","v":{"$error":"#REF!"}},{"$f":"I40","v":{"$error":"#REF!"}},{"$f":"#REF!","v":{"$error":"#REF!"}},null,{"$f":"$L$45","v":3.5875033710291371},null,{"$f":"SUM(H47:L47)","v":{"$error":"#REF!"}},null,{"$f":"'Other Inputs'!$G$98","v":7.1727999999999996},{"$f":"N47-P47","v":{"$error":"#REF!"}}]
["Block 2 Winter",{"$f":"$C$19","v":1.3494900000000001},{"$f":"$H$19","v":{"$error":"#REF!"}},{"$f":"$H$6","v":{"$error":"#REF!"}},{"$f":"$E$24","v":1.519E-2},{"$f":"F41","v":1.434E-2},null,{"$f":"SUM(B48:F48)","v":{"$error":"#REF!"}},{"$f":"I41","v":{"$error":"#REF!"}},{"$f":"#REF!","v":{"$error":"#REF!"}},null,{"$f":"$L$45","v":3.5875033710291371},null,{"$f":"SUM(H48:L48)","v":{"$error":"#REF!"}},null,{"$f":"'Other Inputs'!$G$99","v":6.0359699999999998},{"$f":"N48-P48","v":{"$error":"#REF!"}}]
[]
["Typical Customer Difference - CET Amortization Only"]
[null,"Typical"]
["GS","Dth",{"$f":"S12","v":"2019-08-01"},{"$f":"N43","v":"2020-10-01"},null,null,null,"Change",null,"% Change"]
["January",14.9,{"$f":"ROUND($S$14+(B53*$S$18),2)","v":113.62},{"$f":"ROUND($T$14+(B53*$T$18),2)","v":{"$error":"#REF!"}},null,null,null,{"$f":"D53-C53","v":{"$error":"#REF!"}}]
["February",12.5,{"$f":"ROUND($S$14+(B54*$S$18),2)","v":96.41},{"$f":"ROUND($T$14+(B54*$T$18),2)","v":{"$error":"#REF!"}},null,null,null,{"$error":"#REF!"}]
["March",10.1,{"$f":"ROUND($S$14+(B55*$S$18),2)","v":79.2},{"$f":"ROUND($T$14+(B55*$T$18),2)","v":{"$error":"#REF!"}},null,null,null,{"$error":"#REF!"}]
["April",8.3000000000000007,{"$f":"ROUND($S$14+(B56*$S$16),2)","v":55.74},{"$f":"ROUND($T$14+(B56*$T$16),2)","v":{"$error":"#REF!"}},null,null,null,{"$error":"#REF!"}]
["May",4.4000000000000004,32.72,{"$f":"ROUND($T$14+(B57*$T$16),2)","v":{"$error":"#REF!"}},null,null,null,{"$error":"#REF!"}]
["June",3.1,25.05,{"$error":"#REF!"},null,null,null,{"$error":"#REF!"}]
["July",2,18.559999999999999,{"$error":"#REF!"},null,null,null,{"$error":"#REF!"}]
["August",1.8,17.38,{"$error":"#REF!"},null,null,null,{"$error":"#REF!"}]
["September",2,18.559999999999999,{"$error":"#REF!"},null,null,null,{"$error":"#REF!"}]
["October",3.1,25.05,{"$error":"#REF!"},null,null,null,{"$error":"#REF!"}]
["November",6.3,{"$f":"ROUND($S$14+(B63*$S$18),2)","v":51.94},{"$f":"ROUND($T$14+(B63*$T$18),2)","v":{"$error":"#REF!"}},null,null,null,{"$error":"#REF!"}]
["December",11.5,{"$f":"ROUND($S$14+(B64*$S$18),2)","v":89.24},{"$f":"ROUND($T$14+(B64*$T$18),2)","v":{"$error":"#REF!"}},null,null,null,{"$error":"#REF!"}]
[null,{"$f":"SUM(B53:B64)","v":80},{"$f":"SUM(C53:C64)","v":623.47},{"$f":"SUM(D53:D64)","v":{"$error":"#REF!"}},null,null,null,{"$f":"SUM(H53:H64)","v":{"$error":"#REF!"}},null,{"$f":"H65/C65","v":{"$error":"#REF!"}}]
[]
[]
["Typical Customer Difference - DSM Amortization Only"]
[null,"Typical"]
["GS","Dth",{"$f":"C52","v":"2019-08-01"},{"$f":"D52","v":"2020-10-01"},null,null,null,"Change",null,"% Change"]
["January",14.9,{"$f":"ROUND($S$14+(B71*$S$18),2)","v":113.62},{"$f":"ROUND($U$14+(B71*$U$18),2)","v":{"$error":"#REF!"}},null,null,null,{"$f":"D71-C71","v":{"$error":"#REF!"}}]
["February",12.5,{"$f":"ROUND($S$14+(B72*$S$18),2)","v":96.41},{"$f":"ROUND($U$14+(B72*$U$18),2)","v":{"$error":"#REF!"}},null,null,null,{"$error":"#REF!"}]
["March",10.1,{"$f":"ROUND($S$14+(B73*$S$18),2)","v":79.2},{"$f":"ROUND($U$14+(B73*$U$18),2)","v":{"$error":"#REF!"}},null,null,null,{"$error":"#REF!"}]
["April",8.3000000000000007,{"$f":"ROUND($S$14+(B74*$S$16),2)","v":55.74},{"$f":"ROUND($U$14+(B74*$U$16),2)","v":{"$error":"#REF!"}},null,null,null,{"$error":"#REF!"}]
["May",4.4000000000000004,32.72,{"$error":"#REF!"},null,null,null,{"$error":"#REF!"}]
["June",3.1,25.05,{"$error":"#REF!"},null,null,null,{"$error":"#REF!"}]
["July",2,18.559999999999999,{"$error":"#REF!"},null,null,null,{"$error":"#REF!"}]
["August",1.8,17.38,{"$error":"#REF!"},null,null,null,{"$error":"#REF!"}]
["September",2,18.559999999999999,{"$error":"#REF!"},null,null,null,{"$error":"#REF!"}]
["October",3.1,25.05,{"$error":"#REF!"},null,null,null,{"$error":"#REF!"}]
["November",6.3,{"$f":"ROUND($S$14+(B81*$S$18),2)","v":51.94},{"$f":"ROUND($U$14+(B81*$U$18),2)","v":{"$error":"#REF!"}},null,null,null,{"$error":"#REF!"}]
["December",11.5,{"$f":"ROUND($S$14+(B82*$S$18),2)","v":89.24},{"$f":"ROUND($U$14+(B82*$U$18),2)","v":{"$error":"#REF!"}},null,null,null,{"$error":"#REF!"}]
[null,{"$f":"SUM(B71:B82)","v":80},{"$f":"SUM(C71:C82)","v":623.47},{"$f":"SUM(D71:D82)","v":{"$error":"#REF!"}},null,null,null,{"$f":"SUM(H71:H82)","v":{"$error":"#REF!"}},null,{"$f":"H83/C83","v":{"$error":"#REF!"}}]
[]
[]
["Typical Customer Difference - SNG and Commodity Changes Only"]
[null,"Typical"]
["GS-1","Dth",{"$f":"C70","v":"2019-08-01"},{"$f":"D70","v":"2020-10-01"},null,null,null,"Change",null,"% Change"]
["January",14.9,{"$f":"ROUND($S$14+(B89*$S$18),2)","v":113.62},{"$f":"ROUND($V$14+(B89*$V$18),2)","v":{"$error":"#REF!"}},null,null,null,{"$f":"D89-C89","v":{"$error":"#REF!"}}]
["February",12.5,{"$f":"ROUND($S$14+(B90*$S$18),2)","v":96.41},{"$f":"ROUND($V$14+(B90*$V$18),2)","v":{"$error":"#REF!"}},null,null,null,{"$error":"#REF!"}]
["March",10.1,{"$f":"ROUND($S$14+(B91*$S$18),2)","v":79.2},{"$f":"ROUND($V$14+(B91*$V$18),2)","v":{"$error":"#REF!"}},null,null,null,{"$error":"#REF!"}]
["April",8.3000000000000007,{"$f":"ROUND($S$14+(B92*$S$16),2)","v":55.74},{"$f":"ROUND($V$14+(B92*$V$16),2)","v":{"$error":"#REF!"}},null,null,null,{"$error":"#REF!"}]
["May",4.4000000000000004,32.72,{"$error":"#REF!"},null,null,null,{"$error":"#REF!"}]
["June",3.1,25.05,{"$error":"#REF!"},null,null,null,{"$error":"#REF!"}]
["July",2,18.559999999999999,{"$error":"#REF!"},null,null,null,{"$error":"#REF!"}]
["August",1.8,17.38,{"$error":"#REF!"},null,null,null,{"$error":"#REF!"}]
["September",2,18.559999999999999,{"$error":"#REF!"},null,null,null,{"$error":"#REF!"}]
["October",3.1,25.05,{"$error":"#REF!"},null,null,null,{"$error":"#REF!"}]
["November",6.3,{"$f":"ROUND($S$14+(B99*$S$18),2)","v":51.94},{"$f":"ROUND($V$14+(B99*$V$18),2)","v":{"$error":"#REF!"}},null,null,null,{"$error":"#REF!"}]
["December",11.5,{"$f":"ROUND($S$14+(B100*$S$18),2)","v":89.24},{"$f":"ROUND($V$14+(B100*$V$18),2)","v":{"$error":"#REF!"}},null,null,null,{"$error":"#REF!"}]
[null,{"$f":"SUM(B89:B100)","v":80},{"$f":"SUM(C89:C100)","v":623.47},{"$f":"SUM(D89:D100)","v":{"$error":"#REF!"}},null,null,null,{"$f":"SUM(H89:H100)","v":{"$error":"#REF!"}},null,{"$f":"H101/C101","v":{"$error":"#REF!"}}]
[]
[]
["Typical Customer Difference - CET & DSM Amort, SNG and Commodity Changes"]
[null,"Typical"]
["GS-1","Dth",{"$f":"C52","v":"2019-08-01"},{"$f":"D52","v":"2020-10-01"},null,null,null,"Change",null,"% Change"]
["January",14.9,{"$f":"ROUND($S$14+(B107*$S$18),2)","v":113.62},{"$f":"ROUND($W$14+(B107*$W$18),2)","v":{"$error":"#REF!"}},null,null,null,{"$f":"D107-C107","v":{"$error":"#REF!"}}]
["February",12.5,{"$f":"ROUND($S$14+(B108*$S$18),2)","v":96.41},{"$f":"ROUND($W$14+(B108*$W$18),2)","v":{"$error":"#REF!"}},null,null,null,{"$error":"#REF!"}]
["March",10.1,{"$f":"ROUND($S$14+(B109*$S$18),2)","v":79.2},{"$f":"ROUND($W$14+(B109*$W$18),2)","v":{"$error":"#REF!"}},null,null,null,{"$error":"#REF!"}]
["April",8.3000000000000007,{"$f":"ROUND($S$14+(B110*$S$16),2)","v":55.74},{"$f":"ROUND($W$14+(B110*$W$16),2)","v":{"$error":"#REF!"}},null,null,null,{"$error":"#REF!"}]
["May",4.4000000000000004,32.72,{"$error":"#REF!"},null,null,null,{"$error":"#REF!"}]
["June",3.1,25.05,{"$error":"#REF!"},null,null,null,{"$error":"#REF!"}]
["July",2,18.559999999999999,{"$error":"#REF!"},null,null,null,{"$error":"#REF!"}]
["August",1.8,17.38,{"$error":"#REF!"},null,null,null,{"$error":"#REF!"}]
["September",2,18.559999999999999,{"$error":"#REF!"},null,null,null,{"$error":"#REF!"}]
["October",3.1,25.05,{"$error":"#REF!"},null,null,null,{"$error":"#REF!"}]
["November",6.3,{"$f":"ROUND($S$14+(B117*$S$18),2)","v":51.94},{"$f":"ROUND($W$14+(B117*$W$18),2)","v":{"$error":"#REF!"}},null,null,null,{"$error":"#REF!"}]
["December",11.5,{"$f":"ROUND($S$14+(B118*$S$18),2)","v":89.24},{"$f":"ROUND($W$14+(B118*$W$18),2)","v":{"$error":"#REF!"}},null,null,null,{"$error":"#REF!"}]
[null,{"$f":"SUM(B107:B118)","v":80},{"$f":"SUM(C107:C118)","v":623.47},{"$f":"SUM(D107:D118)","v":{"$error":"#REF!"}},null,null,null,{"$f":"SUM(H107:H118)","v":{"$error":"#REF!"}},null,{"$f":"H119/C119","v":{"$error":"#REF!"}}]

{"sheet":"UT Tariff Sheets PT","index":7,"n_rows":51,"n_cols":39,"rows_kept":51,"cut":false,"hidden":true,"merged":[[18,36,18,38],[7,36,7,38],[8,36,8,38],[9,28,9,31],[10,28,10,31],[8,28,8,31],[12,28,12,31],[13,28,13,31],[16,36,16,38],[46,19,47,20],[38,27,39,28],[43,1,44,2],[6,28,6,31],[7,28,7,31],[0,34,0,38],[2,2,2,5],[3,2,3,3],[3,4,3,5],[0,9,0,15],[0,19,0,22],[0,27,0,31],[6,36,6,38],[10,36,10,38],[12,36,12,38],[14,36,14,38],[15,36,15,38],[11,36,11,38]]}
[]
[null,"2.02 GS Rate Schedule",null,null,null,null,null,null,null,"2.03 FS Rate Schedule",null,null,null,null,null,null,null,null,null,null,null,null,null,null,null,null,null,"4.03 ES Rate Schedule",null,null,null,null,null,null,"2.05 NGV Rate Schedule"]
[null,null,"Rates Per Dth Used Each Month",null,null,null,null,null,null,null,null,null,"Rates Per Dth Used Each Month",null,null,null,null,null,null,"4.02 IS Rate Schedule",null,null,null,null,null,null,null,"ES Volumetric Rates",null,null,null,null,null,null,"NGV Volumetric Rate"]
[null,null,"Summer Rates: Apr. 1 - Oct. 31",null,"Winter Rates: Nov. 1 - Mar. 31",null,null,null,null,null,null,null,"Dth = decatherm = 10 therms = 1,000,000 BTU",null,null,null,null,null,null,"IS Volumetric Rates"]
[null,null,"First 45 Dth","All Over 45 Dth","First 45 Dth","All Over 45 Dth",null,null,null,null,"Summer Rates: Apr. 1 - Oct. 31",null,null,"Winter Rates: Nov. 1 - Mar. 31",null,null,null,null,null,null,"Rates Per Dth Used Each Month",null,null,null,null,null,null,null,null,null,"Rates Per Dth Used Each Month",null,null,null,null,null,null,null,"Rates Per Dth Used Each Month"]
[null,"Base DNG ",{"$f":"'CET & DSM'!B38","v":1.7266999999999999},{"$f":"'CET & DSM'!B39","v":0.72670000000000001},{"$f":"'CET & DSM'!B40","v":2.3494899999999999},{"$f":"'CET & DSM'!B41","v":1.3494900000000001},null,null,null,null,"First","Next","All Over","First","Next","All Over",null,null,null,null,"Dth = decatherm = 10 therms = 1,000,000 BTU",null,null,null,null,null,null,null,null,null,"Dth = decatherm = 10 therms = 1,000,000 BTU",null,null,null,null,null,null,null,"Dth = decatherm = 10 therms = 1,000,000 BTU"]
[null,"CET Amortization ",{"$f":"'CET & DSM'!C38","v":-5.9900000000000002E-2},{"$f":"'CET & DSM'!C39","v":-2.2239999999999999E-2},{"$f":"'CET & DSM'!C40","v":-7.1120000000000003E-2},{"$f":"'CET & DSM'!C41","v":-2.9530000000000001E-2},null,null,null,null,200,1800,2000,200,1800,2000,null,null,null,null,"First","Next","All Over",null,null,null,null,"Distribution Non-Gas Rate",{"$f":"'Ut 1.7 Source'!#REF!","v":{"$error":"#REF!"}},null,null,null,null,null,"Base DNG",null,{"$f":"'Ut 1.7 Source'!C52","v":6.86015}]
[null,"DSM Amortization  ",{"$f":"ROUND('CET & DSM'!D38,5)","v":0.44103999999999999},{"$f":"ROUND('CET & DSM'!D39,5)","v":0.44103999999999999},{"$f":"ROUND('CET & DSM'!D40,5)","v":0.44103999999999999},{"$f":"ROUND('CET & DSM'!D41,5)","v":0.44103999999999999},null,null,null,"Base DNG ",{"$f":"'Ut 1.7 Source'!C19","v":0.94110000000000005},{"$f":"'Ut 1.7 Source'!D19","v":0.48792999999999997},{"$f":"'Ut 1.7 Source'!E19","v":1.091E-2},{"$f":"'Ut 1.7 Source'!F19","v":1.41228},{"$f":"'Ut 1.7 Source'!G19","v":0.95911000000000002},{"$f":"'Ut 1.7 Source'!H19","v":0.48208000000000001},null,null,null,null,2000,18000,20000,null,null,null,null,null,null,null,null,null,null,null,"Energy Assistance",null,{"$f":"'Other Inputs'!#REF!","v":{"$error":"#REF!"}}]
[null,"Energy Assistance",{"$f":"'Other Inputs'!#REF!","v":{"$error":"#REF!"}},{"$f":"'Other Inputs'!#REF!","v":{"$error":"#REF!"}},{"$f":"'Other Inputs'!#REF!","v":{"$error":"#REF!"}},{"$f":"'Other Inputs'!#REF!","v":{"$error":"#REF!"}},null,null,null,"Energy Assistance",{"$f":"'Other Inputs'!#REF!","v":{"$error":"#REF!"}},{"$f":"'Other Inputs'!#REF!","v":{"$error":"#REF!"}},{"$f":"'Other Inputs'!#REF!","v":{"$error":"#REF!"}},{"$f":"'Other Inputs'!#REF!","v":{"$error":"#REF!"}},{"$f":"'Other Inputs'!#REF!","v":{"$error":"#REF!"}},{"$f":"'Other Inputs'!#REF!","v":{"$error":"#REF!"}},null,null,null,"Base DNG",{"$f":"'Ut 1.7 Source'!C60","v":0.97450999999999999},{"$f":"'Ut 1.7 Source'!D60","v":0.11831999999999999},{"$f":"'Ut 1.7 Source'!E60","v":0.10639},null,null,null,null,"Base SNG",{"$f":"ROUND(#REF!,5)","v":{"$error":"#REF!"}},null,null,null,null,null,"Distribution Non-Gas Rate",null,{"$f":"SUM(AK7:AM8)","v":{"$error":"#REF!"}}]
[null,"Distribution Non-Gas Rate",{"$f":"SUM(C6:C9)","v":{"$error":"#REF!"}},{"$f":"SUM(D6:D9)","v":{"$error":"#REF!"}},{"$f":"SUM(E6:E9)","v":{"$error":"#REF!"}},{"$f":"SUM(F6:F9)","v":{"$error":"#REF!"}},null,null,null,"Distribution Non-Gas Rate",{"$f":"SUM(K8:K9)","v":{"$error":"#REF!"}},{"$error":"#REF!"},{"$error":"#REF!"},{"$error":"#REF!"},{"$error":"#REF!"},{"$error":"#REF!"},null,null,null,"Energy Assistance",{"$f":"'Other Inputs'!#REF!","v":{"$error":"#REF!"}},{"$f":"'Other Inputs'!#REF!","v":{"$error":"#REF!"}},{"$f":"'Other Inputs'!#REF!","v":{"$error":"#REF!"}},null,null,null,null,"SNG Amortization",{"$f":"ROUND(#REF!,5)","v":{"$error":"#REF!"}}]
[null,null,null,null,null,null,null,null,null,null,null,null,null,null,null,null,null,null,null,"Distribution Non-Gas Rate",{"$f":"SUM(U9:U10)","v":{"$error":"#REF!"}},{"$f":"SUM(V9:V10)","v":{"$error":"#REF!"}},{"$f":"SUM(W9:W10)","v":{"$error":"#REF!"}},null,null,null,null,"Supplier Non-Gas Rate",{"$f":"SUM(AC9:AF10)","v":{"$error":"#REF!"}},null,null,null,null,null,"Base SNG",null,{"$f":"ROUND(#REF!,5)","v":{"$error":"#REF!"}}]
[null,"Base SNG",{"$f":"'CET & DSM'!I38","v":{"$error":"#REF!"}},{"$f":"'CET & DSM'!I39","v":{"$error":"#REF!"}},{"$f":"'CET & DSM'!I40","v":{"$error":"#REF!"}},{"$f":"'CET & DSM'!I41","v":{"$error":"#REF!"}},null,null,null,"Base SNG",{"$f":"ROUND(#REF!,5)","v":{"$error":"#REF!"}},{"$f":"ROUND(#REF!,5)","v":{"$error":"#REF!"}},{"$f":"ROUND(#REF!,5)","v":{"$error":"#REF!"}},{"$f":"ROUND(#REF!,5)","v":{"$error":"#REF!"}},{"$f":"ROUND(#REF!,5)","v":{"$error":"#REF!"}},{"$f":"ROUND(#REF!,5)","v":{"$error":"#REF!"}},null,null,null,"Supplier Non-Gas Rate",{"$f":"ROUND(#REF!/(1-'Other Inputs'!$E$276),5)","v":{"$error":"#REF!"}},{"$f":"ROUND(#REF!/(1-'Other Inputs'!$E$276),5)","v":{"$error":"#REF!"}},{"$f":"ROUND(#REF!/(1-'Other Inputs'!$E$276),5)","v":{"$error":"#REF!"}},null,null,null,null,null,null,null,null,null,null,null,"SNG Amortization",null,{"$f":"ROUND(#REF!,5)","v":{"$error":"#REF!"}}]
[null,"SNG Amortization",{"$f":"'CET & DSM'!J38","v":{"$error":"#REF!"}},{"$f":"'CET & DSM'!J39","v":{"$error":"#REF!"}},{"$f":"'CET & DSM'!J40","v":{"$error":"#REF!"}},{"$f":"'CET & DSM'!J41","v":{"$error":"#REF!"}},null,null,null,"SNG Amortization",{"$f":"ROUND(#REF!,5)","v":{"$error":"#REF!"}},{"$f":"ROUND(#REF!,5)","v":{"$error":"#REF!"}},{"$f":"ROUND(#REF!,5)","v":{"$error":"#REF!"}},{"$f":"ROUND(#REF!,5)","v":{"$error":"#REF!"}},{"$f":"ROUND(#REF!,5)","v":{"$error":"#REF!"}},{"$f":"ROUND(#REF!,5)","v":{"$error":"#REF!"}},null,null,null,null,null,null,null,null,null,null,null,"Commodity Rate","Highest Gas Cost",null,null,null,null,null,"Supplier Non-Gas Rate",null,{"$f":"SUM(AK11:AM12)","v":{"$error":"#REF!"}}]
[null,"Supplier Non-Gas Rate",{"$f":"SUM(C12:C13)","v":{"$error":"#REF!"}},{"$f":"SUM(D12:D13)","v":{"$error":"#REF!"}},{"$f":"SUM(E12:E13)","v":{"$error":"#REF!"}},{"$f":"SUM(F12:F13)","v":{"$error":"#REF!"}},null,null,null,"Supplier Non-Gas Rate",{"$f":"SUM(K12:K13)","v":{"$error":"#REF!"}},{"$error":"#REF!"},{"$error":"#REF!"},{"$error":"#REF!"},{"$error":"#REF!"},{"$error":"#REF!"},null,null,null,null,null,null,null,null,null,null,null,"Total Rate","$"]
[null,null,null,null,null,null,null,null,null,null,null,null,null,null,null,null,null,null,null,null,null,null,null,null,null,null,null,null,null,null,null,null,null,null,"Base Gas Cost",null,{"$f":"ROUND('Ut 1.5 p1'!$F$29,5)","v":3.1488499999999999}]
[null,"Base Gas Cost ",{"$f":"'Ut 1.5 p1'!$F$29","v":3.1488499999999999},{"$f":"'Ut 1.5 p1'!$F$29","v":3.1488499999999999},{"$f":"'Ut 1.5 p1'!$F$29","v":3.1488499999999999},{"$f":"'Ut 1.5 p1'!$F$29","v":3.1488499999999999},null,null,null,"Base Gas Cost ",{"$f":"ROUND('Ut 1.5 p1'!$F$29,5)","v":3.1488499999999999},{"$f":"ROUND('Ut 1.5 p1'!$F$29,5)","v":3.1488499999999999},{"$f":"ROUND('Ut 1.5 p1'!$F$29,5)","v":3.1488499999999999},{"$f":"ROUND('Ut 1.5 p1'!$F$29,5)","v":3.1488499999999999},{"$f":"ROUND('Ut 1.5 p1'!$F$29,5)","v":3.1488499999999999},{"$f":"ROUND('Ut 1.5 p1'!$F$29,5)","v":3.1488499999999999},null,null,null,null,null,null,null,null,null,null,null,"Penalty for failure to interrupt or limit usage when requested by the Company.  See See § 3.02",null,null,null,null,null,null,"Commodity Amortization",null,{"$f":"ROUND('Ut 1.5 p1'!$F$30,5)","v":0.43864999999999998}]
[null,"191 Amortization ",{"$f":"'Ut 1.5 p1'!$F$30","v":0.43865337102913732},{"$f":"'Ut 1.5 p1'!$F$30","v":0.43865337102913732},{"$f":"'Ut 1.5 p1'!$F$30","v":0.43865337102913732},{"$f":"'Ut 1.5 p1'!$F$30","v":0.43865337102913732},null,null,null,"191 Amortization ",{"$f":"ROUND('Ut 1.5 p1'!$F$30,5)","v":0.43864999999999998},{"$f":"ROUND('Ut 1.5 p1'!$F$30,5)","v":0.43864999999999998},{"$f":"ROUND('Ut 1.5 p1'!$F$30,5)","v":0.43864999999999998},{"$f":"ROUND('Ut 1.5 p1'!$F$30,5)","v":0.43864999999999998},{"$f":"ROUND('Ut 1.5 p1'!$F$30,5)","v":0.43864999999999998},{"$f":"ROUND('Ut 1.5 p1'!$F$30,5)","v":0.43864999999999998},null,null,null,null,null,null,null,null,null,null,null,null,null,null,null,null,null,null,"Commodity Rate",null,{"$f":"SUM(AK15:AM16)","v":3.5874999999999999}]
[null,"Commodity Rate",{"$f":"SUM(C16:C17)","v":3.5875033710291371},{"$f":"SUM(D16:D17)","v":3.5875033710291371},{"$f":"SUM(E16:E17)","v":3.5875033710291371},{"$f":"SUM(F16:F17)","v":3.5875033710291371},null,null,null,"Commodity Rate",{"$f":"SUM(K16:K17)","v":3.5874999999999999},3.5874999999999999,3.5874999999999999,3.5874999999999999,3.5874999999999999,3.5874999999999999,null,null,null,"Total Rate","$","$","$"]
[null,null,null,null,null,null,null,null,null,null,null,null,null,null,null,null,null,null,null,null,null,null,null,null,null,null,null,null,null,null,null,null,null,null,"Total Rate",null,{"$f":"SUM(AK9,AK13,AK17)","v":{"$error":"#REF!"}}]
[null,"Total Rate",{"$f":"SUM(C18,C14,C10)","v":{"$error":"#REF!"}},{"$f":"SUM(D18,D14,D10)","v":{"$error":"#REF!"}},{"$f":"SUM(E18,E14,E10)","v":{"$error":"#REF!"}},{"$f":"SUM(F18,F14,F10)","v":{"$error":"#REF!"}},null,null,null,"Total Rate",{"$f":"SUM(K18,K14,K10)","v":{"$error":"#REF!"}},{"$error":"#REF!"},{"$error":"#REF!"},{"$error":"#REF!"},{"$error":"#REF!"},{"$error":"#REF!"},null,null,null,"Minimum Monthly Distribution Non-Gas Charge"]
[null,null,null,null,null,null,null,null,null,null,null,null,null,null,null,null,null,null,null,null,null,null,null,null,null,null,null,null,null,null,null,null,null,null,"Penalty for failure to interrupt or limit usage when requested by the Company.  See See § 3.02"]
[null,null,null,null,"BSF Category 1",{"$f":"'Ut 1.7 Source'!C12","v":6.75},null,null,null,"Minimum Monthly Distribution Non-Gas Charge",null,null,null,null,"Summer",{"$f":"ROUND(K8*175,0)","v":165}]
[null,null,null,null,"BSF Category 2",{"$f":"'Ut 1.7 Source'!C13","v":18.25},null,null,null,null,null,null,null,null,"Winter",{"$f":"ROUND(N8*175,0)","v":247}]
[null,null,null,null,"BSF Category 3",{"$f":"'Ut 1.7 Source'!C14","v":63.5},null,null,null,null,null,null,null,null,null,null,null,null,null,null,null,"BSF Category 1",5]
[null,null,null,null,"BSF Category 4",{"$f":"'Ut 1.7 Source'!C15","v":420.25},null,null,null,null,null,null,null,null,null,null,null,null,null,null,null,"BSF Category 2",29]
[null,null,null,null,null,null,null,null,null,null,null,null,null,"BSF Category 1",null,5,null,null,null,null,null,"BSF Category 3",67]
[null,null,null,null,null,null,null,null,null,null,null,null,null,"BSF Category 2",null,21,null,null,null,null,null,"BSF Category 4",274]
[null,null,null,null,null,null,null,null,null,null,null,null,null,"BSF Category 3",null,55]
[null,null,null,null,null,null,null,null,null,null,null,null,null,"BSF Category 4",null,244]
[null,null,null,null,null,null,null,null,null,null,null,null,null,null,null,null,null,null,null,null,null,null,null,null,null,null,null,null,null,null,null,null,null,null,{"$f":"B44","v":"Issued by R. W. Jibson, President"},null,null,"Advice No","Section Revision No."]
[]
[]
[]
[]
[]
[]
[]
[]
[null,null,null,null,null,null,null,null,null,null,null,null,null,null,null,null,null,null,null,null,null,null,null,null,null,null,null,{"$f":"B44","v":"Issued by R. W. Jibson, President"},null,null,"Advice No","Section Revision No."]
[]
[]
[null,null,null,null,null,null,null,null,null,null,null,null,null,null,null,null,null,null,null,null,null,null,null,null,null,null,null,"New Pass Through Values"]
[]
[null,"Issued by R. W. Jibson, President",null,"Advice No","Section Revision No.","Effective Date"]
[]
[]
[null,null,null,null,null,null,null,null,null,null,null,null,null,null,null,null,null,null,null,{"$f":"B44","v":"Issued by R. W. Jibson, President"},null,null,"Advice No"]
[null,"Pass Through Changes",null,null,null,null,null,null,null,{"$f":"B44","v":"Issued by R. W. Jibson, President"},null,null,"Advice No","Section Revision No.",null,"Effective Date"]
[]
[null,null,null,null,null,null,null,null,null,null,null,null,null,null,null,null,null,null,null,"New Pass Through Values"]
[null,null,null,null,null,null,null,null,null,"New Pass Through Values"]

{"sheet":"UT Tariff Sheets","index":8,"n_rows":49,"n_cols":13,"rows_kept":49,"cut":false,"hidden":true,"merged":[[44,1,45,2],[20,2,20,5],[2,2,2,5],[3,2,3,3],[3,4,3,5],[2,9,2,12],[3,9,3,10],[44,8,45,9],[3,11,3,12],[20,9,20,12]]}
[]
[null,"2.02 GS Rate Schedule",null,null,null,null,null,null,"2.02 GS Rate Schedule"]
[null,null,"Rates Per Dth Used Each Month",null,null,null,null,null,null,"Rates Per Dth Used Each Month"]
[null,null,"Summer Rates: Apr. 1 - Oct. 31",null,"Winter Rates: Nov. 1 - Mar. 31",null,null,null,null,"Summer Rates: Apr. 1 - Oct. 31",null,"Winter Rates: Nov. 1 - Mar. 31"]
[null,null,"First 45 Dth","All Over 45 Dth","First 45 Dth","All Over 45 Dth",null,null,null,"First 45 Dth","All Over 45 Dth","First 45 Dth","All Over 45 Dth"]
[null,"Base DNG ",{"$f":"'CET & DSM'!B24","v":1.7266999999999999},{"$f":"'CET & DSM'!B25","v":0.72670000000000001},{"$f":"'CET & DSM'!B26","v":2.3494899999999999},{"$f":"'CET & DSM'!B27","v":1.3494900000000001},null,null,"Base DNG ",{"$f":"'CET & DSM'!B31","v":1.7266999999999999},{"$f":"'CET & DSM'!B32","v":0.72670000000000001},{"$f":"'CET & DSM'!B33","v":2.3494899999999999},{"$f":"'CET & DSM'!B34","v":1.3494900000000001}]
[null,"CET Amortization ",{"$f":"'CET & DSM'!H16","v":{"$error":"#REF!"}},{"$f":"'CET & DSM'!H17","v":{"$error":"#REF!"}},{"$f":"'CET & DSM'!H18","v":{"$error":"#REF!"}},{"$f":"'CET & DSM'!H19","v":{"$error":"#REF!"}},null,null,"CET Amortization ",{"$f":"'CET & DSM'!C31","v":-5.9900000000000002E-2},{"$f":"'CET & DSM'!C32","v":-2.2239999999999999E-2},{"$f":"'CET & DSM'!C33","v":-7.1120000000000003E-2},{"$f":"'CET & DSM'!C34","v":-2.9530000000000001E-2}]
[null,"DSM Amortization  ",{"$f":"'CET & DSM'!D24","v":0.44103999999999999},{"$f":"'CET & DSM'!D25","v":0.44103999999999999},{"$f":"'CET & DSM'!D26","v":0.44103999999999999},{"$f":"'CET & DSM'!D27","v":0.44103999999999999},null,null,"DSM Amortization  ",{"$f":"ROUND('CET & DSM'!D31,5)","v":{"$error":"#REF!"}},{"$f":"ROUND('CET & DSM'!D32,5)","v":{"$error":"#REF!"}},{"$f":"ROUND('CET & DSM'!D33,5)","v":{"$error":"#REF!"}},{"$f":"ROUND('CET & DSM'!D34,5)","v":{"$error":"#REF!"}}]
[null,"Energy Assistance",{"$f":"'Other Inputs'!#REF!","v":{"$error":"#REF!"}},{"$f":"'Other Inputs'!#REF!","v":{"$error":"#REF!"}},{"$f":"'Other Inputs'!#REF!","v":{"$error":"#REF!"}},{"$f":"'Other Inputs'!#REF!","v":{"$error":"#REF!"}},null,null,"Energy Assistance",{"$f":"'Other Inputs'!#REF!","v":{"$error":"#REF!"}},{"$f":"'Other Inputs'!#REF!","v":{"$error":"#REF!"}},{"$f":"'Other Inputs'!#REF!","v":{"$error":"#REF!"}},{"$f":"'Other Inputs'!#REF!","v":{"$error":"#REF!"}}]
[null,"Distribution Non-Gas Rate",{"$f":"SUM(C6:C9)","v":{"$error":"#REF!"}},{"$f":"SUM(D6:D9)","v":{"$error":"#REF!"}},{"$f":"SUM(E6:E9)","v":{"$error":"#REF!"}},{"$f":"SUM(F6:F9)","v":{"$error":"#REF!"}},null,null,"Distribution Non-Gas Rate",{"$f":"SUM(J6:J9)","v":{"$error":"#REF!"}},{"$f":"SUM(K6:K9)","v":{"$error":"#REF!"}},{"$f":"SUM(L6:L9)","v":{"$error":"#REF!"}},{"$f":"SUM(M6:M9)","v":{"$error":"#REF!"}}]
[]
[null,"Base SNG",{"$f":"'CET & DSM'!I24","v":0.55715000000000003},{"$f":"'CET & DSM'!I25","v":0.55715000000000003},{"$f":"'CET & DSM'!I26","v":1.18665},{"$f":"'CET & DSM'!I27","v":1.18665},null,null,"Base SNG",{"$f":"'CET & DSM'!I31","v":0.55715000000000003},{"$f":"'CET & DSM'!I32","v":0.55715000000000003},{"$f":"'CET & DSM'!I33","v":1.18665},{"$f":"'CET & DSM'!I34","v":1.18665}]
[null,"SNG Amortization",{"$f":"'CET & DSM'!J24","v":1.244E-2},{"$f":"'CET & DSM'!J25","v":1.244E-2},{"$f":"'CET & DSM'!J26","v":2.6509999999999999E-2},{"$f":"'CET & DSM'!J27","v":2.6509999999999999E-2},null,null,"SNG Amortization",{"$f":"'CET & DSM'!J31","v":1.244E-2},{"$f":"'CET & DSM'!J32","v":1.244E-2},{"$f":"'CET & DSM'!J33","v":2.6509999999999999E-2},{"$f":"'CET & DSM'!J34","v":2.6509999999999999E-2}]
[null,"Supplier Non-Gas Rate",{"$f":"SUM(C12:C13)","v":0.56959000000000004},{"$f":"SUM(D12:D13)","v":0.56959000000000004},{"$f":"SUM(E12:E13)","v":1.21316},{"$f":"SUM(F12:F13)","v":1.21316},null,null,"Supplier Non-Gas Rate",{"$f":"SUM(J12:J13)","v":0.56959000000000004},{"$f":"SUM(K12:K13)","v":0.56959000000000004},{"$f":"SUM(L12:L13)","v":1.21316},{"$f":"SUM(M12:M13)","v":1.21316}]
[]
[null,"Base Gas Cost ",{"$f":"'CET & DSM'!L24","v":4.2133900000000004},{"$f":"'CET & DSM'!L25","v":4.2133900000000004},{"$f":"'CET & DSM'!L26","v":4.2133900000000004},{"$f":"'CET & DSM'!L27","v":4.2133900000000004},null,null,"Base Gas Cost ",{"$f":"'CET & DSM'!L31","v":4.2133900000000004},{"$f":"'CET & DSM'!L32","v":4.2133900000000004},{"$f":"'CET & DSM'!L33","v":4.2133900000000004},{"$f":"'CET & DSM'!L34","v":4.2133900000000004}]
[null,"191 Amortization ",{"$f":"'CET & DSM'!M24","v":0.14066999999999999},{"$f":"'CET & DSM'!M25","v":0.14066999999999999},{"$f":"'CET & DSM'!M26","v":0.14066999999999999},{"$f":"'CET & DSM'!M27","v":0.14066999999999999},null,null,"191 Amortization ",{"$f":"'CET & DSM'!M31","v":0.14066999999999999},{"$f":"'CET & DSM'!M32","v":0.14066999999999999},{"$f":"'CET & DSM'!M33","v":0.14066999999999999},{"$f":"'CET & DSM'!M34","v":0.14066999999999999}]
[null,"Commodity Rate",{"$f":"SUM(C16:C17)","v":4.3540600000000005},{"$f":"SUM(D16:D17)","v":4.3540600000000005},{"$f":"SUM(E16:E17)","v":4.3540600000000005},{"$f":"SUM(F16:F17)","v":4.3540600000000005},null,null,"Commodity Rate",{"$f":"SUM(J16:J17)","v":4.3540600000000005},{"$f":"SUM(K16:K17)","v":4.3540600000000005},{"$f":"SUM(L16:L17)","v":4.3540600000000005},{"$f":"SUM(M16:M17)","v":4.3540600000000005}]
[]
[null,"Total Rate",{"$f":"SUM(C18,C14,C10)","v":{"$error":"#REF!"}},{"$f":"SUM(D18,D14,D10)","v":{"$error":"#REF!"}},{"$f":"SUM(E18,E14,E10)","v":{"$error":"#REF!"}},{"$f":"SUM(F18,F14,F10)","v":{"$error":"#REF!"}},null,null,"Total Rate",{"$f":"SUM(J18,J14,J10)","v":{"$error":"#REF!"}},{"$f":"SUM(K18,K14,K10)","v":{"$error":"#REF!"}},{"$f":"SUM(L18,L14,L10)","v":{"$error":"#REF!"}},{"$f":"SUM(M18,M14,M10)","v":{"$error":"#REF!"}}]
[]
[]
[null,null,null,null,"BSF Category 1",{"$f":"'Ut 1.7 Source'!C12","v":6.75},null,null,null,null,null,"BSF Category 1",{"$f":"'Ut 1.7 Source'!C12","v":6.75}]
[null,null,null,null,"BSF Category 2",{"$f":"'Ut 1.7 Source'!C13","v":18.25},null,null,null,null,null,"BSF Category 2",{"$f":"'Ut 1.7 Source'!C13","v":18.25}]
[null,null,null,null,"BSF Category 3",{"$f":"'Ut 1.7 Source'!C14","v":63.5},null,null,null,null,null,"BSF Category 3",{"$f":"'Ut 1.7 Source'!C14","v":63.5}]
[null,null,null,null,"BSF Category 4",{"$f":"'Ut 1.7 Source'!C15","v":420.25},null,null,null,null,null,"BSF Category 4",{"$f":"'Ut 1.7 Source'!C15","v":420.25}]
[]
[]
[]
[]
[]
[]
[]
[]
[]
[]
[]
[]
[]
[]
[]
[]
[]
[]
[null,"Issued by R. W. Jibson, President",null,"Advice No","Section Revision No.","Effective Date",null,null,"Issued by R. W. Jibson, President",null,"Advice No","Section Revision No.","Effective Date"]
[]
[]
[]
[null,"New CET Only",null,null,null,null,null,null,"NEW DSM ONLY"]

{"sheet":"Utah Summary-by class","index":9,"n_rows":28,"n_cols":18,"rows_kept":28,"cut":false,"hidden":false,"merged":[[0,0,0,16],[3,2,3,7],[3,9,3,14],[3,16,3,17]]}
["UTAH SUMMARY"]
[null,"NOT AN EXHIBIT !!!"]
[null,null,null,null,null,null,null,null,null,null,null,null,null,null,null,null,"Sub Total"]
[null,null,"COMMODITY",null,null,null,null,null,null,"SNG",null,null,null,null,null,null,"TOTAL"]
[null,null,"Current","Proposed","Current","Proposed","Revenue","%",null,"Current","Proposed","Current","Proposed","Revenue","%",null,"Revenue","%"]
["RATE","Dth Sales","Rates","Rates","Revenue","Revenue","Difference","Change",null,"Rates","Rates","Revenue","Revenue","Difference","Change",null,"Difference","Change"]
[]
["GS (W)",{"$f":"Calculations!P52","v":79730574},{"$f":"'Ut 1.5 p1'!$H$31","v":3.2855699999999999},{"$f":"ROUND('Ut 1.5 p1'!$F$31,5)","v":3.5874999999999999},{"$f":"ROUND(B8*C8,0)","v":261960382},{"$f":"ROUND(B8*D8,0)","v":286033434},{"$f":"(F8-E8)","v":24073052},null,null,{"$f":"'Other Inputs'!G84","v":1.16499},{"$f":"'Ut 1.5 p3'!L16","v":0.92725999999999997},{"$f":"ROUND(B8*J8,0)","v":92885321},{"$f":"B8*K8","v":73930972.047240004},{"$f":"(M8-L8)","v":-18954348.952759996},{"$f":"IF(N8=0,0,N8/L8)","v":-0.20406183397654401},null,{"$f":"G8+N8","v":5118703.0472400039}]
["GS (S)",{"$f":"Calculations!P53","v":30437950},{"$f":"'Ut 1.5 p1'!$H$31","v":3.2855699999999999},{"$f":"D8","v":3.5874999999999999},{"$f":"ROUND(B9*C9,0)","v":100006015},{"$f":"ROUND(B9*D9,0)","v":109196146},{"$f":"(F9-E9)","v":9190131},null,null,{"$f":"'Other Inputs'!G85","v":0.54697999999999991},{"$f":"'Ut 1.5 p3'!L17","v":0.43536000000000002},{"$f":"ROUND(B9*J9,0)","v":16648950},{"$f":"B9*K9","v":13251465.912},{"$f":"(M9-L9)","v":-3397484.0879999995},-0.20406596740334973,null,{"$f":"G9+N9","v":5792646.9120000005}]
["Total",{"$f":"SUM(B8:B9)","v":110168524},null,null,{"$f":"SUM(E8:E9)","v":361966397},{"$f":"SUM(F8:F9)","v":395229580},{"$f":"SUM(G8:G9)","v":33263183},{"$f":"IF(G10=0,0,G10/E10)","v":9.1895776170626137E-2},null,null,null,{"$f":"SUM(L8:L9)","v":109534271},{"$f":"SUM(M8:M9)","v":87182437.959240004},{"$f":"SUM(N8:N9)","v":-22351833.040759996},{"$f":"IF(N10=0,0,N10/L10)","v":-0.20406246224763749},null,{"$f":"SUM(Q8:Q9)","v":10911349.959240004},{"$f":"IF(Q10=0,0,Q10/(E10+L10))","v":2.3141748675613763E-2}]
[]
[]
["FS (W)",{"$f":"Calculations!P58","v":1478780},{"$f":"'Ut 1.5 p1'!$H$31","v":3.2855699999999999},{"$f":"D8","v":3.5874999999999999},{"$f":"ROUND(B13*C13,0)","v":4858635},{"$f":"ROUND(B13*D13,0)","v":5305123},{"$f":"(F13-E13)","v":446488},null,null,{"$f":"'Other Inputs'!G87","v":1.13466},{"$f":"'Ut 1.5 p3'!L19","v":0.90312000000000003},{"$f":"ROUND(B13*J13,0)","v":1677913},{"$f":"B13*K13","v":1335515.7936},{"$f":"(M13-L13)","v":-342397.20640000002},{"$f":"IF(N13=0,0,N13/L13)","v":-0.20406135860440919},null,{"$f":"G13+N13","v":104090.79359999998}]
["FS (S)",{"$f":"Calculations!P59","v":1382336},{"$f":"'Ut 1.5 p1'!$H$31","v":3.2855699999999999},{"$f":"D9","v":3.5874999999999999},{"$f":"ROUND(B14*C14,0)","v":4541762},{"$f":"ROUND(B14*D14,0)","v":4959130},{"$f":"(F14-E14)","v":417368},null,null,{"$f":"'Other Inputs'!G88","v":0.54697999999999991},{"$f":"'Ut 1.5 p3'!L20","v":0.43536000000000002},{"$f":"ROUND(B14*J14,0)","v":756110},{"$f":"B14*K14","v":601813.80096000002},{"$f":"(M14-L14)","v":-154296.19903999998},-0.20406580926055728,null,{"$f":"G14+N14","v":263071.80096000002}]
["Total",{"$f":"SUM(B13:B14)","v":2861116},null,null,{"$f":"SUM(E13:E14)","v":9400397},{"$f":"SUM(F13:F14)","v":10264253},{"$f":"SUM(G13:G14)","v":863856},{"$f":"IF(G15=0,0,G15/E15)","v":9.1895693341462067E-2},null,null,null,{"$f":"SUM(L13:L14)","v":2434023},{"$f":"SUM(M13:M14)","v":1937329.5945600001},{"$f":"SUM(N13:N14)","v":-496693.40544},{"$f":"IF(N15=0,0,N15/L15)","v":-0.20406274116555184},null,{"$f":"SUM(Q13:Q14)","v":367162.59456},{"$f":"IF(Q15=0,0,Q15/(E15+L15))","v":3.1024975838275133E-2}]
[]
[]
["NGV",{"$f":"Calculations!P12","v":263921},{"$f":"'Ut 1.5 p1'!$H$31","v":3.2855699999999999},{"$f":"D8","v":3.5874999999999999},{"$f":"ROUND(B18*C18,0)","v":867131},{"$f":"ROUND(B18*D18,0)","v":946817},{"$f":"(F18-E18)","v":79686},{"$f":"IF(G18=0,0,G18/E18)","v":9.1896149486063811E-2},null,{"$f":"'Other Inputs'!G90","v":0.84068000000000009},{"$f":"'Ut 1.5 p3'!L22","v":0.66913},{"$f":"ROUND(B18*J18,0)","v":221873},{"$f":"ROUND(B18*K18,0)","v":176597},{"$f":"(M18-L18)","v":-45276},{"$f":"IF(N18=0,0,N18/L18)","v":-0.20406268450870543},null,{"$f":"G18+N18","v":34410},{"$f":"IF(Q18=0,0,Q18/(E18+L18))","v":3.1597680081983173E-2}]
[]
[]
["IS",{"$f":"Calculations!P17","v":130911},{"$f":"'Ut 1.5 p1'!$H$31","v":3.2855699999999999},{"$f":"D8","v":3.5874999999999999},{"$f":"ROUND(B21*C21,0)","v":430117},{"$f":"ROUND(B21*D21,0)","v":469643},{"$f":"(F21-E21)","v":39526},{"$f":"IF(G21=0,0,G21/E21)","v":9.1895925992230024E-2},null,{"$f":"'Other Inputs'!G92","v":0.17907000000000001},0.17907000000000001,{"$f":"ROUND(B21*J21,0)","v":23442},{"$f":"ROUND(B21*K21,0)","v":23442},{"$f":"(M21-L21)","v":0},{"$f":"IF(N21=0,0,N21/L21)","v":0},null,{"$f":"G21+N21","v":39526},{"$f":"IF(Q21=0,0,Q21/(E21+L21))","v":8.7146324954416071E-2}]
[]
[null,"-",null,null,"-","-","-",null,null,null,null,"-------------------","-------------------","-------------------",null,null,"-------------------"]
[null,{"$f":"B10+B15+B18+B21","v":113424472},null,null,{"$f":"E10+E15+E18+E21","v":372664042},{"$f":"F10+F15+F18+F21","v":406910293},{"$f":"G10+G15+G18+G21","v":34246251},{"$f":"IF(G24=0,0,G24/E24)","v":9.1895775122838391E-2},null,null,null,{"$f":"L10+L15+L18+L21","v":112213609},{"$f":"M10+M15+M18+M21","v":89319806.553800002},{"$f":"N10+N15+N18+N21","v":-22893802.446199995},{"$f":"IF(N24=0,0,N24/L24)","v":-0.20401983903930934},null,{"$f":"Q10+Q15+Q18+Q21","v":11352448.553800004},{"$f":"IF(Q24=0,0,Q24/(E24+L24))","v":2.3413016727801307E-2}]
[null,null,null,null,null,null,{"$f":"IF(G24>0,\"Commodity Increase\",\"Commodity Decrease\")","v":"Commodity Increase"},null,null,null,null,null,null,{"$f":"IF(N24>0,\"Increase to SNG\",\"Decrease to SNG\")","v":"Decrease to SNG"}]
[null,"NOT AN EXHIBIT !!!"]
[null,null,null,null,null,null,{"$f":"ROUND(G24,-3)","v":34246000},null,null,null,null,null,null,{"$f":"ROUND(N24,-3)","v":-22894000},null,null,{"$f":"ROUND(Q24,-3)","v":11352000}]
[null,{"$f":"B24","v":113424472},null,null,null,null,"Rounded",null,null,null,null,null,null,"Rounded",null,null,"Rounded"]

{"sheet":"UT Summary - by cost","index":10,"n_rows":0,"n_cols":0,"rows_kept":0,"cut":false,"hidden":true,"merged":[]}

{"sheet":"WY Summary - by cost","index":11,"n_rows":0,"n_cols":0,"rows_kept":0,"cut":false,"hidden":true,"merged":[]}

{"sheet":"Model Checks","index":12,"n_rows":61,"n_cols":4,"rows_kept":61,"cut":false,"hidden":false,"merged":[]}
[]
[null,"Model Checks"]
[null,"If the total of all checks is not zero, or very close to zero, find the checks below that are out of balance and follow the calculations"]
[null,"back through the model and correct any errors."]
[]
[null,null,null,"Total of all Checks"]
[null,null,null,{"$f":"ABS(SUM(D10:D1993))","v":1.1446631550788879}]
[]
[null,"Forecasted Demand"]
[null,null,"Utah",{"$f":"Calculations!P25-'RevRun Fcst'!T205","v":0}]
[null,null,"Wyoming",{"$f":"Calculations!P44-'RevRun Fcst'!T329","v":0}]
[null,null,"Total System",{"$f":"Calculations!P47-'RevRun Fcst'!T370","v":0}]
[null,"Forecasted Utah Demand Check by Month"]
[null,null,1,{"$f":"Calculations!D25-'RevRun Fcst'!H205","v":0}]
[null,null,2,{"$f":"Calculations!E25-'RevRun Fcst'!I205","v":0}]
[null,null,3,{"$f":"Calculations!F25-'RevRun Fcst'!J205","v":0}]
[null,null,4,{"$f":"Calculations!G25-'RevRun Fcst'!K205","v":0}]
[null,null,5,{"$f":"Calculations!H25-'RevRun Fcst'!L205","v":0}]
[null,null,6,{"$f":"Calculations!I25-'RevRun Fcst'!M205","v":0}]
[null,null,7,{"$f":"Calculations!J25-'RevRun Fcst'!N205","v":0}]
[null,null,8,{"$f":"Calculations!K25-'RevRun Fcst'!O205","v":0}]
[null,null,9,{"$f":"Calculations!L25-'RevRun Fcst'!P205","v":0}]
[null,null,10,{"$f":"Calculations!M25-'RevRun Fcst'!Q205","v":0}]
[null,null,11,{"$f":"Calculations!N25-'RevRun Fcst'!R205","v":0}]
[null,null,12,{"$f":"Calculations!O25-'RevRun Fcst'!S205","v":0}]
[null,null,"Wyoming I-2 and I-4 Revenues",{"$f":"('RevRun Fcst'!T273+'RevRun Fcst'!T282)-Calculations!P65","v":0}]
[null,null,"System Sales Volumes",{"$f":"Calculations!H76-'RevRun Fcst'!T368","v":0}]
[null,null,"Utah Sales Volumes",{"$f":"Calculations!P20-'Utah Summary-by class'!B24","v":0}]
[null,"Company Production",null,{"$f":"Calculations!P120-'Monthly Inputs'!S7-'Monthly Inputs'!S13","v":0}]
[null,"Injections",null,{"$f":"'Monthly Inputs'!S29-SUM('Monthly Inputs'!S23:S28)","v":0}]
[null,"Withdrawls",null,{"$f":"'Monthly Inputs'!S37-SUM('Monthly Inputs'!S32:S36)","v":0}]
[null,"Injections & Withdrawls",null,{"$f":"SUM('Ut 1.4 p2'!D23:D28)-'Monthly Inputs'!S29-'Monthly Inputs'!S37","v":0}]
[null,"Injections",null,{"$f":"Calculations!P129-'Monthly Inputs'!S29","v":0}]
[null,"Withdrawls",null,{"$f":"Calculations!P137-'Monthly Inputs'!S37","v":0}]
[null,"Sales for Resale",null,{"$f":"Expenses!S445-Calculations!P86","v":0}]
[null,"Incidental Plant Prod Sales",null,{"$f":"Expenses!S446-Calculations!P87","v":0}]
[null,"Incidental Gas & Oil Sales",null,{"$f":"Expenses!S447-Calculations!P89","v":0}]
[null,"Gasoline and Oil Costs",null,{"$f":"Expenses!S450+Calculations!P90","v":0}]
[null,"Wexpro Revenue Sharing",null,{"$f":"Expenses!S449-Calculations!P94","v":0}]
[null,"Storage Gas",null,{"$f":"'Rate Base'!U206-Calculations!P99","v":0}]
[null,"101 Production",null,{"$f":"'Rate Base'!U148-Calculations!P100","v":0}]
[null,"108 Production",null,{"$f":"'Rate Base'!U166-Calculations!P101","v":0}]
[null,"111 Production",null,{"$f":"'Rate Base'!U173-Calculations!P102","v":0}]
[null,"255 Production",null,{"$f":"'Rate Base'!U241-Calculations!P103","v":0}]
[null,"282 Production",null,{"$f":"'Rate Base'!U248-Calculations!P104","v":0}]
[null,"282.1 Production",null,{"$f":"'Rate Base'!U255-Calculations!P105","v":0}]
[null,"Production Rate Base",null,{"$f":"SUM(Calculations!P99:P105)-'Rate Base'!U275","v":0}]
[null,"Purchased Gas Cost",null,{"$f":"'Ut 1.2 p4'!E24-Calculations!P194","v":-0.35322858393192291}]
[null,"Working Gas Rate Base",null,{"$f":"Calculations!P99-'Ut 1.2 p5'!E43","v":0}]
[null,"Allocations",null,{"$f":"'Ut 1.1 p2'!F43-'Ut 1.1 p2'!G43-'Ut 1.1 p2'!H43+'Ut 1.1 p2'!H41","v":0}]
[]
[null,"System Sales",null,{"$f":"'SDR#1'!C10-'RevRun Fcst'!T368","v":0}]
[null,"Lost & Unaccounted For",null,{"$f":"'SDR#1'!C15-(('SDR#1'!C10+'SDR#1'!C11)/(1-'Other Inputs'!E265))","v":-7.1823194622993469E-2}]
[null,"Supply / Demand",null,{"$f":"'SDR#1'!C36-'SDR#1'!C15","v":-1.6071449965238571}]
[null,"System Sales",null,{"$f":"'SDR#3'!H36-'SDR#1'!C10","v":0}]
[null,"SNG Revenue",null,{"$f":"'SDR#4'!G23-'Utah Summary-by class'!L24","v":0.2943899929523468}]
[null,"Utah Sales",null,{"$f":"'SDR#3'!D36-'SDR#4'!E23","v":0}]
[null,"Utah Sales",null,{"$f":"'SDR#2'!G70-'Ut 1.1 p2'!H43","v":0.59314362704753876}]
[null,"Seasonal Volumes",null,{"$f":"Calculations!P52+Calculations!P53-Calculations!P7-Calculations!P8","v":0}]
[null,"Seasonal Volumes",null,{"$f":"Calculations!P55+Calculations!P56-Calculations!P9","v":0}]
[null,"Seasonal Volumes",null,{"$f":"Calculations!P58+Calculations!P59-Calculations!P10","v":0}]

{"sheet":"Royalty Detail","index":13,"n_rows":1705,"n_cols":9,"rows_kept":1705,"cut":false,"hidden":false,"merged":[]}
[]
[]
[]
[null,null,null,"Test-Year Cost of Dominion Energy's Production"]
[null,null,null,"October 2019 through September 2020"]
[]
[null,"WEXPRO I"]
[null,"          (A)","          (B)","       (C)","(D)     ","      (E)","(F)      ","(G)     ","(H)      "]
[null,null,null,null,null,"Base Year","Market ","Royalty","Test-Year"]
[null,"Field Name","Well Name","Formation","Price $","Dth    ","Value $","Rate %","Royalty $"]
[1,"ACE UNIT (CO)","ACE UNIT 10 FT UN","MESAVERDE",1.8445530247279553,33838.74,62417.350219982851,0.12685197631358325,7917.7642316618949]
[2,null,"ACE UNIT 11 FT UN","FORT UNION",1.8445530247279553,31156.736000000001,57470.25162945038,0.12685197631358325,7290.2149984347088]
[3,null,"ACE UNIT 12 FT UN","FORT UNION",1.8445530247279553,60281.218999999997,111191.90484073828,0.12685197631358325,14104.912879119534]
[4,null,"ACE UNIT 13 FT UN","FORT UNION",1.8445530247279553,34439.552000000003,63525.579811875708,0.12685197631358325,8058.3453456026991]
[5,null,"ACE UNIT 2 FT UN","FORT UNION",1.8445530247279553,49650.65,91583.256637209066,0.12685197631358325,11617.51710166406]
[6,"BIRCH CR (WY)","BIRCH CREEK UNIT 1 BR","BEAR RIVER",1.8445530247279553,7118.2740000000003,13130.033837542362,0.13297693241602584,1745.991622235003]
[7,null,"BIRCH CREEK UNIT 1 BR - D24","BEAR RIVER",1.8445530247279553,2126.0840000000003,3921.6746730257109,0.13297693241602584,521.49226795258016]
[8,null,"BIRCH CREEK UNIT 1 FR","FRONTIER",1.8445530247279553,7117.0360000000001,13127.750280897748,0.13297693241602584,1745.6879618774042]
[9,null,"BIRCH CREEK UNIT 1 FR - D24","FRONTIER",1.8445530247279553,2126.0520000000001,3921.6156473289193,0.13297693241602584,521.48441889648711]
[10,null,"BIRCH CREEK UNIT 100 FR","FRONTIER",1.8445530247279553,5962.9049999999988,10998.894453915447,0.13297693241602584,1462.5992444493158]
[11,null,"BIRCH CREEK UNIT 101 BR","BEAR RIVER",1.8445530247279553,578.03699999999992,1066.2198967546731,0.13297693241602584,141.78265115136821]
[12,null,"BIRCH CREEK UNIT 101 FR","FRONTIER",1.8445530247279553,10960.576000000001,20217.363613560636,0.13297693241602584,2688.4429948706729]
[13,null,"BIRCH CREEK UNIT 103 BR","BEAR RIVER",1.8445530247279553,947.01900000000012,1746.8267609248437,0.13297693241602584,232.28766413000827]
[14,null,"BIRCH CREEK UNIT 103 FR","FRONTIER",1.8445530247279553,8513.9529999999995,15704.43775854165,0.13297693241602584,2088.3279584492775]
[15,null,"BIRCH CREEK UNIT 104 BR","BEAR RIVER",1.8445530247279553,2720.1830000000004,5017.5217804635649,0.13297693241602584,667.21465469664111]
[16,null,"BIRCH CREEK UNIT 104 FR","FRONTIER",1.8445530247279553,11603.157999999999,21402.640185296372,0.13297693241602584,2846.0574374446746]
[17,null,"BIRCH CREEK UNIT 105 BR","BEAR RIVER",1.8445530247279553,8428.6710000000021,15547.130587486805,0.13297693241602584,2067.4097333953609]
[18,null,"BIRCH CREEK UNIT 105 FR","FRONTIER",1.8445530247279553,9498.2669999999998,17520.057124523722,0.13297693241602584,2329.7634521727032]
[19,null,"BIRCH CREEK UNIT 106 BR","BEAR RIVER",1.8445530247279553,5602.4260000000004,10333.97182411454,0.13297693241602584,1374.1798728443946]
[20,null,"BIRCH CREEK UNIT 106 FR","FRONTIER",1.8445530247279553,19859.934000000001,36632.701330597563,0.13297693241602584,4871.3042490553325]
[21,null,"BIRCH CREEK UNIT 107 BR","BEAR RIVER",1.8445530247279553,2655.9550000000004,4899.0498287913369,0.13297693241602584,651.46061798592859]
[22,null,"BIRCH CREEK UNIT 107 FR","FRONTIER",1.8445530247279553,2549.152,4702.0460320913171,0.13297693241602584,625.26365742644953]
[23,null,"BIRCH CREEK UNIT 108 BR","BEAR RIVER",1.8445530247279553,2129.5639999999999,3928.0937175517633,0.13297693241602584,522.34585280269653]
[24,null,"BIRCH CREEK UNIT 108 FR","FRONTIER",1.8445530247279553,10400.619999999999,19184.495080046065,0.13297693241602584,2551.0953056948661]
[25,null,"BIRCH CREEK UNIT 109 BAX","BAXTER",1.8445530247279553,3479.3319999999994,6417.8123646327649,0.13375000000000004,858.38240376963256]
[26,null,"BIRCH CREEK UNIT 109 BR","BEAR RIVER",1.8445530247279553,8354.8150000000005,15410.899279292493,0.13297693241602584,2049.2941119326592]
[27,null,"BIRCH CREEK UNIT 109 FR","FRONTIER",1.8445530247279553,7601.5659999999998,14021.491557969184,0.13297693241602584,1864.5349352759451]
[28,null,"BIRCH CREEK UNIT 110 BR","BEAR RIVER",1.8445530247279553,10132.933000000001,18690.732214515716,0.13297693241602584,2485.4362344956935]
[29,null,"BIRCH CREEK UNIT 110 FR","FRONTIER",1.8445530247279553,9351.3990000000013,17249.151310887981,0.13297693241602584,2293.7392281017546]
[30,null,"BIRCH CREEK UNIT 111 BR","BEAR RIVER",1.8445530247279553,11041.383000000002,20366.416409829828,0.13297693241602584,2708.2635784865806]
[31,null,"BIRCH CREEK UNIT 111 FR","FRONTIER",1.8445530247279553,4082.3880000000004,7530.1811335131088,0.13297693241602584,1001.3403876716055]
[32,null,"BIRCH CREEK UNIT 112 BR","BEAR RIVER",1.8445530247279553,4656.607,8589.3585268193692,0.13297693241602584,1142.1865483178747]
[33,null,"BIRCH CREEK UNIT 112 FR","FRONTIER",1.8445530247279553,12592.046,23226.696536813553,0.13297693241602584,3088.6148556233975]
[34,null,"BIRCH CREEK UNIT 113 BR","BEAR RIVER",1.8445530247279553,15081.080000000002,27817.851730164275,0.13297693241602584,3699.1325894810825]
[35,null,"BIRCH CREEK UNIT 113 FR","FRONTIER",1.8445530247279553,4509.8010000000004,8318.5670754711591,0.13297693241602584,1106.177531793106]
[36,null,"BIRCH CREEK UNIT 114 BR","BEAR RIVER",1.8445530247279553,16744.602000000003,30886.306266965774,0.13297693241602584,4107.166261042983]
[37,null,"BIRCH CREEK UNIT 114 FR","FRONTIER",1.8445530247279553,3922.68,7235.5912590398557,0.13297693241602584,962.16672984333024]
[38,null,"BIRCH CREEK UNIT 115 BR","BEAR RIVER",1.8445530247279553,3225.2320000000004,5949.1114410493938,0.13297693241602584,791.09459003183133]
[39,null,"BIRCH CREEK UNIT 115 FR","FRONTIER",1.8445530247279553,10798.146000000001,19917.752865754072,0.13297693241602584,2648.6016767084843]
[40,null,"BIRCH CREEK UNIT 116 BR","BEAR RIVER",1.8445530247279553,9447.8379999999997,17427.038160039716,0.13297693241602584,2317.3940756191046]
[41,null,"BIRCH CREEK UNIT 116 FR","FRONTIER",1.8445530247279553,3323.0959999999995,6129.6267782613686,0.13297693241602584,815.09896582832425]
[42,null,"BIRCH CREEK UNIT 117 BAX","BAXTER",1.8445530247279553,973.07500000000005,1794.8884345371553,0.13375000000000004,240.06632811934458]
[43,null,"BIRCH CREEK UNIT 117 BR","BEAR RIVER",1.8445530247279553,650.02599999999995,1199.0074244518139,0.13297693241602584,159.44032924764207]
[44,null,"BIRCH CREEK UNIT 117 FR","FRONTIER",1.8445530247279553,6498.701,11987.198586352588,0.13297693241602584,1594.0208962748886]
[45,null,"BIRCH CREEK UNIT 118 BR","BEAR RIVER",1.8445530247279553,867.17899999999997,1599.5576474305635,0.13297693241602584,212.70426917791133]
[46,null,"BIRCH CREEK UNIT 118 FR","FRONTIER",1.8445530247279553,7820.5209999999988,14425.365665498492,0.13297693241602584,1918.2408751774526]
[47,null,"BIRCH CREEK UNIT 119 BR","BEAR RIVER",1.8445530247279553,4227.4359999999997,7797.729860643848,0.13297693241602584,1036.9181966772637]
[48,null,"BIRCH CREEK UNIT 119 FR","FRONTIER",1.8445530247279553,16917.165999999997,31204.60971512492,0.13297693241602584,4149.49327715663]
[49,null,"BIRCH CREEK UNIT 121 BR","BEAR RIVER",1.8445530247279553,18803.29,34683.665444336919,0.13297693241602584,4612.1274357316415]
[50,null,"BIRCH CREEK UNIT 121 FR","FRONTIER",1.8445530247279553,3853.4639999999995,7107.9186768802847,0.13297693241602584,945.18922151411743]
[51,null,"BIRCH CREEK UNIT 122 BR","BEAR RIVER",1.8445530247279553,2763.5619999999999,5097.5366461232379,0.13297693241602584,677.85478607974483]
[52,null,"BIRCH CREEK UNIT 122 FR","FRONTIER",1.8445530247279553,9507.4620000000014,17537.017789586098,0.13297693241602584,2332.0188293844335]
[53,null,"BIRCH CREEK UNIT 123 BR","BEAR RIVER",1.8445530247279553,4538.8,8372.0572686352443,0.13297693241602584,1113.2904935944068]
[54,null,"BIRCH CREEK UNIT 123 FR","FRONTIER",1.8445530247279553,13610.681,25105.622807157313,0.13297693241602584,3338.4687072895949]
[55,null,"BIRCH CREEK UNIT 124 BR","BEAR RIVER",1.8445530247279553,3158.1850000000009,5825.4396944004593,0.13297693241602584,774.64910053592416]
[56,null,"BIRCH CREEK UNIT 124 FR","FRONTIER",1.8445530247279553,12624.002,23285.64107327176,0.13297693241602584,3096.4531192642944]
[57,null,"BIRCH CREEK UNIT 126 BR","BEAR RIVER",1.8445530247279553,8136.8070000000016,15008.771963477604,0.13297693241602584,1995.8204550349049]
[58,null,"BIRCH CREEK UNIT 126 FR","FRONTIER",1.8445530247279553,12200.371999999998,22504.23307540625,0.13297693241602584,2992.5438807427904]
[59,null,"BIRCH CREEK UNIT 127 BR","DAKOTA",1.8445530247279553,7387.527,13626.685273109439,0.13297693241602584,1812.0348066167285]
[60,null,"BIRCH CREEK UNIT 127 FR","FRONTIER",1.8445530247279553,1854.1950000000002,3420.1609956854513,0.13297693241602584,454.80251757519193]
[61,null,"BIRCH CREEK UNIT 128 FR","FRONTIER",1.8445530247279553,26355.701000000005,48614.487998375604,0.13297693241602584,6464.6054849996926]
[62,null,"BIRCH CREEK UNIT 129 BR","BEAR RIVER",1.8445530247279553,578.03200000000004,1066.2106739895496,0.13297693241602584,141.7814247363537]
[63,null,"BIRCH CREEK UNIT 129 FR","FRONTIER",1.8445530247279553,10919.841,20142.225746098342,0.13297693241602584,2678.451391747255]
[64,null,"BIRCH CREEK UNIT 130 BR","BEAR RIVER",1.8445530247279553,10671.778000000002,19684.660389125253,0.13297693241602584,2617.6057541971295]
[65,null,"BIRCH CREEK UNIT 130 FR","FRONTIER",1.8445530247279553,13043.548999999999,24059.517761137296,0.13297693241602584,3199.3608672849277]
[66,null,"BIRCH CREEK UNIT 131 FR","FRONTIER",1.8445530247279553,16670.72,30750.027000392824,0.13297693241602584,4089.0442622222063]
[67,null,"BIRCH CREEK UNIT 132 BR","BEAR RIVER",1.8445530247279553,2668.973,4923.0622200672451,0.13297693241602584,654.65371211777222]
[68,null,"BIRCH CREEK UNIT 132 FR","FRONTIER",1.8445530247279553,15089.848,27834.024771085089,0.13297693241602584,3701.2832308505713]
[69,null,"BIRCH CREEK UNIT 133 BR","BEAR RIVER",1.8445530247279553,5801.5420000000013,10701.251844186274,0.13297693241602584,1423.01964325123]
[70,null,"BIRCH CREEK UNIT 133 FR","FRONTIER",1.8445530247279553,23202.109,42797.520336017718,0.13297693241602584,5691.0829692961197]
[71,null,"BIRCH CREEK UNIT 134 BR","BEAR RIVER",1.8445530247279553,14640.101000000001,27004.442581872765,0.13297693241602584,3590.9679361421449]
[72,null,"BIRCH CREEK UNIT 134 FR","FRONTIER",1.8445530247279553,20222.350000000002,37301.196859607371,0.13297693241602584,4960.1987338368845]
[73,null,"BIRCH CREEK UNIT 135 BR","BEAR RIVER",1.8445530247279553,2562.0139999999997,4725.7706730953669,0.13297693241602584,628.4184874098396]
[74,null,"BIRCH CREEK UNIT 135 FR","FRONTIER",1.8445530247279553,3838.6919999999996,7080.6709395990038,0.13297693241602584,941.56590099517496]
[75,null,"BIRCH CREEK UNIT 137 BR","BEAR RIVER",1.8445530247279553,5183.2730000000001,9560.8218901407436,0.13297693241602584,1271.3687663269061]
[76,null,"BIRCH CREEK UNIT 137 FR","FRONTIER",1.8445530247279553,8461.6529999999984,15607.967635348376,0.13297693241602584,2075.4996573972398]
[77,null,"BIRCH CREEK UNIT 138 BR","BEAR RIVER",1.8445530247279553,818.06999999999994,1508.9734929391984,0.13297693241602584,200.65866618815025]
[78,null,"BIRCH CREEK UNIT 138 FR","FRONTIER",1.8445530247279553,19721.667000000001,36377.660517527504,0.13297693241602584,4837.3897040923866]
[79,null,"BIRCH CREEK UNIT 139 BR","BEAR RIVER",1.8445530247279553,3527.0329999999999,6505.7993884653142,0.13297693241602584,865.12124559217432]
[80,null,"BIRCH CREEK UNIT 139 FR","FRONTIER",1.8445530247279553,2531.6689999999999,4669.7977115599979,0.13315196276811,621.79273102424213]
[81,null,"BIRCH CREEK UNIT 13A BR","BEAR RIVER",1.8445530247279553,8557.2849999999999,15784.365930209162,0.13297693241602584,2098.9565615312445]
[82,null,"BIRCH CREEK UNIT 13A FR","FRONTIER",1.8445530247279553,8556.4380000000001,15782.803593797216,0.13297693241602584,2098.7488068277821]
[83,null,"BIRCH CREEK UNIT 140 BR","BEAR RIVER",1.8445530247279553,3355.1349999999998,6188.7244126206278,0.13297693241602584,822.95758795846245]
[84,null,"BIRCH CREEK UNIT 140 FR","FRONTIER",1.8445530247279553,19019.184000000001,35081.893375057538,0.13297693241602584,4665.0825643612507]
[85,null,"BIRCH CREEK UNIT 141 BR","BEAR RIVER",1.8445530247279553,13341.496999999999,24609.098645748942,0.13297693241602584,3272.4424474350703]
[86,null,"BIRCH CREEK UNIT 141 FR","FRONTIER",1.8445530247279553,4444.3089999999993,8197.7636087756728,0.13297693241602584,1090.1134573667189]
[87,null,"BIRCH CREEK UNIT 142 BR","BEAR RIVER",1.8445530247279553,3146.5030000000002,5803.8916259655862,0.13297693241602584,771.78370449596412]
[88,null,"BIRCH CREEK UNIT 142 FR","FRONTIER",1.8445530247279553,7329.9920000000011,13520.558914831718,0.13297693241602584,1797.9224490444731]
[89,null,"BIRCH CREEK UNIT 144 BR","BEAR RIVER",1.8445530247279553,670.96900000000016,1237.6378984486919,0.13297693241602584,164.57729117752396]
[90,null,"BIRCH CREEK UNIT 144 FR","FRONTIER",1.8445530247279553,10495.730999999998,19359.932362780964,0.13297693241602584,2574.4244173843558]
[91,null,"BIRCH CREEK UNIT 145 BR","BEAR RIVER",1.8445530247279553,1362.905,2513.9505401668539,0.13297693241602584,334.29743107699937]
[92,null,"BIRCH CREEK UNIT 145 FR","FRONTIER",1.8445530247279553,10010.257000000001,18464.449827654189,0.13297693241602584,2455.3458968310711]
[93,null,"BIRCH CREEK UNIT 146 BR","BEAR RIVER",1.8445530247279553,13447.156000000001,24803.992273788674,0.13297693241602584,3298.3588042392239]
[94,null,"BIRCH CREEK UNIT 146 FR","FRONTIER",1.8445530247279553,4485.4830000000002,8273.7112350158241,0.13297693241602584,1100.212739728413]
[95,null,"BIRCH CREEK UNIT 148 BR","BEAR RIVER",1.8445530247279553,255.00700000000001,470.3739331768017,0.13297693241602584,62.548882722311816]
[96,null,"BIRCH CREEK UNIT 148 FR","FRONTIER",1.8445530247279553,24522.596000000001,45233.228625981661,0.13297693241602584,6014.9759859558089]
[97,null,"BIRCH CREEK UNIT 149 BR","BEAR RIVER",1.8445530247279553,5864.4450000000006,10817.279763100736,0.13297693241602584,1438.4486799830906]
[98,null,"BIRCH CREEK UNIT 149 FR","FRONTIER",1.8445530247279553,20800.221999999998,38367.112405112959,0.13297693241602584,5101.9409132927731]
[99,null,"BIRCH CREEK UNIT 151 BR","BEAR RIVER",1.8445530247279553,5818.6769999999997,10732.858260264984,0.13297693241602584,1427.2225675060415]
[100,null,"BIRCH CREEK UNIT 151 FR","FRONTIER",1.8445530247279553,8043.0750000000007,14835.878319363801,0.13297693241602584,1972.8295886064232]
[101,null,"BIRCH CREEK UNIT 153 ALMY","ALMY",1.8445530247279553,153,282.21661278337717,0.13375000000000004,37.746471959776706]
[102,null,"BIRCH CREEK UNIT 157 MESA","MESAVERDE",1.8445530247279553,1850.288,3412.9543270178392,0.13375000000000004,456.48264123863612]
[103,null,"BIRCH CREEK UNIT 159 MESA","MESAVERDE",1.8445530247279553,8786.6240000000016,16207.393876347249,0.13375000000000004,2167.738930961445]
[104,null,"BIRCH CREEK UNIT 164 FR","FRONTIER",1.8445530247279553,20293.172999999999,37431.83363847767,0.13297693241602584,4977.5704119517677]
[105,null,"BIRCH CREEK UNIT 166 BR","BEAR RIVER",1.8445530247279553,5209.665,9609.5033335693643,0.13297693241602584,1277.8422753396285]
[106,null,"BIRCH CREEK UNIT 166 FR","FRONTIER",1.8445530247279553,1303.1130000000001,2403.6610257123202,0.13297693241602584,319.63146976718258]
[107,null,"BIRCH CREEK UNIT 167 BR","BEAR RIVER",1.8445530247279553,2305.3099999999995,4252.2665334356016,0.13297693241602584,565.45335943159444]
[108,null,"BIRCH CREEK UNIT 167 FR","FRONTIER",1.8445530247279553,9219.5960000000014,17006.033688569762,0.13297693241602584,2261.4101924695997]
[109,null,"BIRCH CREEK UNIT 168 BR","BEAR RIVER",1.8445530247279553,1152.193,2125.2810832203772,0.13297693241602584,282.61335896845429]
[110,null,"BIRCH CREEK UNIT 168 RECOM BAX","BAXTER",1.8445530247279553,1957.2729999999997,3610.2938323683588,0.13375000000000004,482.87680007926815]
[111,null,"BIRCH CREEK UNIT 168 RECOM FR","FRONTIER",1.8445530247279553,4705.9579999999996,8680.3890631427184,0.13297693241602584,1154.2915097943392]
[112,null,"BIRCH CREEK UNIT 169 BR","BEAR RIVER",1.8445530247279553,3468.0840000000003,6397.0648322106272,0.13297693241602584,850.66205785380828]
[113,null,"BIRCH CREEK UNIT 169 FR","FRONTIER",1.8445530247279553,13859.046,25563.745219143872,0.13297693241602584,3399.3884203065986]
[114,null,"BIRCH CREEK UNIT 173 BR","BEAR RIVER",1.8445530247279553,6807.5919999999996,12556.96441471383,0.13297693241602584,1669.7866083258425]
[115,null,"BIRCH CREEK UNIT 173 FR","FRONTIER",1.8445530247279553,19361.702000000001,35713.685987981306,0.13297693241602584,4749.0964079509595]
[116,null,"BIRCH CREEK UNIT 174 BR","BEAR RIVER",1.8445530247279553,11771.924999999999,21713.939865620636,0.13297693241602584,2887.4531139962846]
[117,null,"BIRCH CREEK UNIT 174 FR","FRONTIER",1.8445530247279553,11642.331,21474.896860934041,0.13297693241602584,2855.6659085175515]
[118,null,"BIRCH CREEK UNIT 177 BR","BEAR RIVER",1.8445530247279553,3681.28,6790.3161588705279,0.13297693241602584,902.95541294157442]
[119,null,"BIRCH CREEK UNIT 177 FR","FRONTIER",1.8445530247279553,14721.470000000001,27154.532016941856,0.13297693241602584,3610.9263688056872]
[120,null,"BIRCH CREEK UNIT 178 BR","BEAR RIVER",1.8445530247279553,5271.9629999999997,9724.4152979038645,0.13297693241602584,1293.1229158547301]
[121,null,"BIRCH CREEK UNIT 178 FR","FRONTIER",1.8445530247279553,21102.887999999999,38925.39589089527,0.13297693241602584,5176.1797386506305]
[122,null,"BIRCH CREEK UNIT 179 BR","BEAR RIVER",1.8445530247279553,4767.4140000000007,8793.7479138304025,0.13297693241602584,1169.3656220209937]
[123,null,"BIRCH CREEK UNIT 179 FR","FRONTIER",1.8445530247279553,3176.431,5859.0954088896442,0.13297693241602584,779.12453420696556]
[124,null,"BIRCH CREEK UNIT 180 FR","FRONTIER",1.8445530247279553,14229.416999999999,26246.914167465387,0.13297693241602584,3490.2341313762759]
[125,null,"BIRCH CREEK UNIT 181 BR","BEAR RIVER",1.8445530247279553,3254.0379999999996,6002.2456354797059,0.13297693241602584,798.16021221357096]
[126,null,"BIRCH CREEK UNIT 181 FR","FRONTIER",1.8445530247279553,13006.204999999998,23990.634772981852,0.13297693241602584,3190.2010188243671]
[127,null,"BIRCH CREEK UNIT 182 BR","BEAR RIVER",1.8445530247279553,3262.1419999999998,6017.1938931921013,0.13297693241602584,800.14798566912953]
[128,null,"BIRCH CREEK UNIT 182 FR","FRONTIER",1.8445530247279553,4891.2389999999996,9022.1496921173384,0.13297693241602584,1199.7377898559557]
[129,null,"BIRCH CREEK UNIT 183 BR","BEAR RIVER",1.8445530247279553,8424.9710000000014,15540.305741295309,0.13297693241602584,2066.5021862846047]
[130,null,"BIRCH CREEK UNIT 183 FR","FRONTIER",1.8445530247279553,12636.584000000001,23308.849239428888,0.13297693241602584,3099.5392700068705]
[131,null,"BIRCH CREEK UNIT 184 BR","BEAR RIVER",1.8445530247279553,2032.1590000000001,3748.4250301781371,0.13297693241602584,498.45406190453781]
[132,null,"BIRCH CREEK UNIT 184 FR","FRONTIER",1.8445530247279553,18298.684000000001,33752.89292074104,0.13297693241602584,4488.3561607667389]
[133,null,"BIRCH CREEK UNIT 185 BR","BEAR RIVER",1.8445530247279553,7006.616,12924.074735907288,0.13297693241602584,1718.6038126964106]
[134,null,"BIRCH CREEK UNIT 185 FR","FRONTIER",1.8445530247279553,16341.766000000001,30143.253904696463,0.13297693241602584,4008.3574372839289]
[135,null,"BIRCH CREEK UNIT 187 BR","BEAR RIVER",1.8445530247279553,7454.5549999999994,13750.321973250902,0.13297693241602584,1828.4756357355805]
[136,null,"BIRCH CREEK UNIT 187 FR","FRONTIER",1.8445530247279553,13252.869000000001,24445.619600273352,0.13297693241602584,3250.7035054534263]
[137,null,"BIRCH CREEK UNIT 188 FR","FRONTIER",1.8445530247279553,21280.048999999999,39252.178749309103,0.13297693241602584,5219.6343207286427]
[138,null,"BIRCH CREEK UNIT 189 BR","BEAR RIVER",1.8445530247279553,7375.2030000000004,13603.953001632692,0.13297693241602584,1809.0119388889025]
[139,null,"BIRCH CREEK UNIT 189 FR","FRONTIER",1.8445530247279553,10615.310999999998,19580.504013477934,0.13297693241602584,2603.7553588719779]
[140,null,"BIRCH CREEK UNIT 190 BR","BEAR RIVER",1.8445530247279553,2453.0880000000006,4524.8508903238517,0.13297693241602584,601.70079103518924]
[141,null,"BIRCH CREEK UNIT 190 FR","FRONTIER",1.8445530247279553,22034.923000000003,40644.583869297596,0.13297693241602584,5404.7920822650804]
[142,null,"BIRCH CREEK UNIT 191 BR","BEAR RIVER",1.8445530247279553,3386.8150000000005,6247.1598524440114,0.13297693241602584,830.72815349055725]
[143,null,"BIRCH CREEK UNIT 191 FR","FRONTIER",1.8445530247279553,14455.357,26663.672477872424,0.13297693241602584,3545.6533730530896]
[144,null,"BIRCH CREEK UNIT 192 BR","BEAR RIVER",1.8445530247279553,1643.0659999999998,3030.7223601276623,0.13297693241602584,403.01616245443449]
[145,null,"BIRCH CREEK UNIT 192 FR","FRONTIER",1.8445530247279553,25777.931999999997,47548.762441831546,0.13297693241602584,6322.888569693102]
[146,null,"BIRCH CREEK UNIT 193 BR","BEAR RIVER",1.8445530247279553,992.06400000000008,1829.9146519237145,0.13297693241602584,243.33643699595524]
[147,null,"BIRCH CREEK UNIT 193 FR","FRONTIER",1.8445530247279553,18759.740000000002,34603.335160110015,0.13297693241602584,4601.4453609550401]
[148,null,"BIRCH CREEK UNIT 194 BR","BEAR RIVER",1.8445530247279553,1597.2399999999998,2946.193873216479,0.13297693241602584,391.77582356321716]
[149,null,"BIRCH CREEK UNIT 194 FR","FRONTIER",1.8445530247279553,25026.671999999999,46163.023536474422,0.13297693241602584,6138.6172609291698]
[150,null,"BIRCH CREEK UNIT 195 BR","BEAR RIVER",1.8445530247279553,3818.3739999999998,7043.1933112425813,0.13297693241602584,936.58224094211005]
[151,null,"BIRCH CREEK UNIT 195 FR","FRONTIER",1.8445530247279553,27951.862999999998,51558.693443431417,0.13297693241602584,6856.1168934857742]
[152,null,"BIRCH CREEK UNIT 196 BR","BEAR RIVER",1.8445530247279553,438.95499999999998,809.67577296945956,0.13297693241602584,107.66820054105331]
[153,null,"BIRCH CREEK UNIT 196 FR","FRONTIER",1.8445530247279553,21507.496999999999,39671.718645677422,0.13297693241602584,5275.4234491738389]
[154,null,"BIRCH CREEK UNIT 198 BR","BEAR RIVER",1.8445530247279553,3991.8370000000004,7363.1550125709682,0.13297693241602584,979.12976647537153]
[155,null,"BIRCH CREEK UNIT 198 FR","FRONTIER",1.8445530247279553,2349.049,4332.9454381841788,0.13297693241602584,576.181792695745]
[156,null,"BIRCH CREEK UNIT 199 BR","BEAR RIVER",1.8445530247279553,1117.0740000000001,2060.5022255449562,0.13297693241602584,273.99926518936246]
[157,null,"BIRCH CREEK UNIT 199 FR","FRONTIER",1.8445530247279553,11310.703,20863.191430449559,0.13297693241602584,2774.3231968295004]
[158,null,"BIRCH CREEK UNIT 2 BR","BEAR RIVER",1.8445530247279553,4420.777,8154.3575869977767,0.13297693241602584,1084.3414577423109]
[159,null,"BIRCH CREEK UNIT 2 FR","FRONTIER",1.8445530247279553,7217.152,13312.419551521412,0.13297693241602584,1770.2447149964439]
[160,null,"BIRCH CREEK UNIT 200 BR","BEAR RIVER",1.8445530247279553,2766.1600000000003,5102.3287948814814,0.13297693241602584,678.4920313212973]
[161,null,"BIRCH CREEK UNIT 200 FR","FRONTIER",1.8445530247279553,8287.9060000000009,15287.482080960972,0.13297693241602584,2032.8824714911534]
[162,null,"BIRCH CREEK UNIT 201-25 BR","BEAR RIVER",1.8445530247279553,2778.5079999999998,5125.1053356308212,0.13297693241602584,681.52078584119317]
[163,null,"BIRCH CREEK UNIT 201-25 FR","FRONTIER",1.8445530247279553,6479.2039999999997,11951.235336029467,0.13297693241602584,1589.2386135672105]
[164,null,"BIRCH CREEK UNIT 202-25 BR","BEAR RIVER",1.8445530247279553,4902.8069999999998,9043.4874815073927,0.13297693241602584,1202.5752236335843]
[165,null,"BIRCH CREEK UNIT 202-25 FR","FRONTIER",1.8445530247279553,11443.164000000001,21107.522768658051,0.13297693241602584,2806.8136286775684]
[166,null,"BIRCH CREEK UNIT 203-25 BR","BEAR RIVER",1.8445530247279553,6914.34,12753.866760997491,0.13297693241602584,1695.9700783201617]
[167,null,"BIRCH CREEK UNIT 203-25 FR","FRONTIER",1.8445530247279553,16134.117,29760.234313664725,0.13297693241602584,3957.4246670132875]
[168,null,"BIRCH CREEK UNIT 26 FR","FRONTIER",1.8445530247279553,10398.681,19180.918491731121,0.13297693241602584,2550.6197019522297]
[169,null,"BIRCH CREEK UNIT 28 ALMY","ALMY",1.8445530247279553,679.125,1252.6820729183726,0.13375000000000004,167.54622725283238]
[170,null,"BIRCH CREEK UNIT 3 FFR","1ST FRONTIER",1.8445530247279553,17256.951000000001,31831.361164632115,0.13297693241602584,4232.8367622993946]
[171,null,"BIRCH CREEK UNIT 36 ALMY","ALMY",1.8445530247279553,1708.9830000000004,3152.3097618586562,0.13375000000000004,421.62143064859538]
[172,null,"BIRCH CREEK UNIT 38 ALMY","ALMY",1.8445530247279553,7602.9190000000008,14023.987238211643,0.13375000000000004,1875.7082931108077]
[173,null,"BIRCH CREEK UNIT 40 ALMY","ALMY",1.8445530247279553,179.03399999999999,330.23770622914475,0.13375000000000004,44.169293208148119]
[174,null,"BIRCH CREEK UNIT 43A BR","BEAR RIVER",1.8445530247279553,1154.0140000000001,2128.6400142784069,0.13297693241602584,283.06001931674803]
[175,null,"BIRCH CREEK UNIT 43A FR","FRONTIER",1.8445530247279553,10408.782999999998,19199.552166386919,0.13297693241602584,2553.0975508475958]
[176,null,"BIRCH CREEK UNIT 48 ALMY","ALMY",1.8445530247279553,6,11.067318148367733,0.13375000000000004,1.4802538023441847]
[177,null,"BIRCH CREEK UNIT 5 2ND FR","FRONTIER",1.8445530247279553,2914.0510000000004,5375.1215862615236,0.13297693241602584,714.76717990422026]
[178,null,"BIRCH CREEK UNIT 5 FR","FORT UNION",1.8445530247279553,3157.172,5823.5711621864084,0.13297693241602584,774.40062885397913]
[179,null,"BIRCH CREEK UNIT 52 ALMY","ALMY",1.8445530247279553,318.97899999999998,588.37367927469847,0.13375000000000004,78.694979602990941]
[180,null,"BIRCH CREEK UNIT 56 2ND FR","FRONTIER",1.8445530247279553,5216.8180000000011,9622.6974213552439,0.13297693241602584,1279.5967846594224]
[181,null,"BIRCH CREEK UNIT 58 MESA","MESAVERDE",1.8445530247279553,211.02199999999999,389.24126838414259,0.13375006649997334,52.061045530913042]
[182,null,"BIRCH CREEK UNIT 6 FR","FRONTIER",1.8445530247279553,12435.480999999998,22937.904092497014,0.13297693241602584,3050.212122273258]
[183,null,"BIRCH CREEK UNIT 61 BR","BEAR RIVER",1.8445530247279553,1707.9280000000001,3150.3637584175676,0.13297693241602584,418.92570858899006]
[184,null,"BIRCH CREEK UNIT 61 FR","FRONTIER",1.8445530247279553,6808.165,12558.021343597,0.13297693241602584,1669.9271554865084]
[185,null,"BIRCH CREEK UNIT 62 MESA","MESAVERDE",1.8445530247279553,188.02,346.81285970935016,0.13375006649997334,46.386243049171512]
[186,null,"BIRCH CREEK UNIT 66 MESA","ALMY",1.8445530247279553,470.98800000000006,868.76234001057037,0.13375000000000004,116.19696297641381]
[187,null,"BIRCH CREEK UNIT 67 MESA","MESAVERDE",1.8445530247279553,205.00200000000001,378.13705917528034,0.13375000000000004,50.575831664693759]
[188,null,"BIRCH CREEK UNIT 69 MESA","MESAVERDE",1.8445530247279553,280.93400000000003,518.19765944892345,0.13375006649997334,69.308971411424054]
[189,null,"BIRCH CREEK UNIT 7 FR","FRONTIER",1.8445530247279553,5306.9010000000007,9788.860291481813,0.13297693241602584,1301.6926134102962]
[190,null,"BIRCH CREEK UNIT 74 ALMY (NP)","ALMY",1.8445530247279553,76.975999999999999,141.9863136314591,0.13375006649997334,18.990678890293726]
[191,null,"BIRCH CREEK UNIT 8 FR","FRONTIER",1.8445530247279553,18074.984,33340.266409109398,0.13297693241602584,4433.4863530164366]
[192,null,"BIRCH CREEK UNIT 87 2ND FR","FRONTIER",1.8445530247279553,8546.777,15764.983367025319,0.13297693241602584,2096.3791277366972]
[193,null,"BIRCH CREEK UNIT 87 BR","BEAR RIVER",1.8445530247279553,937.10599999999999,1728.5417067907154,0.13297693241602584,229.85617372219093]
[194,null,"BIRCH CREEK UNIT 87 BR RECOMP","BEAR RIVER",1.8445530247279553,2187.3980000000001,4034.7715971838802,0.13297693241602584,536.53154999282151]
[195,null,"BIRCH CREEK UNIT 87 FR","FRONTIER",1.8445530247279553,3662.8260000000005,6756.2767773521982,0.13297693241602584,898.42896040592814]
[196,null,"BIRCH CREEK UNIT 91 BR","BEAR RIVER",1.8445530247279553,1540.989,2842.435921022507,0.13297693241602584,377.97840936669411]
[197,null,"BIRCH CREEK UNIT 91 FR","FRONTIER",1.8445530247279553,13861.315999999999,25567.932354510001,0.13297693241602584,3399.9452127231971]
[198,null,"BIRCH CREEK UNIT 92 BR","BEAR RIVER",1.8445530247279553,3965.4710000000005,7314.5215275209903,0.13297693241602584,972.66263482072486]
[199,null,"BIRCH CREEK UNIT 92 FR","FRONTIER",1.8445530247279553,12172.146000000002,22452.168721730286,0.13297693241602584,2985.6205227027376]
[200,null,"BIRCH CREEK UNIT 931 BR","BEAR RIVER",1.8445530247279553,2507.2570000000001,4624.7684831203396,0.13297693241602584,614.98752601965975]
[201,null,"BIRCH CREEK UNIT 931 FR","FRONTIER",1.8445530247279553,19314.718999999997,35627.023353220502,0.13297693241602584,4737.5722766253775]
[202,null,"BIRCH CREEK UNIT 94 BR","BEAR RIVER",1.8445530247279553,116.99300000000001,215.79979202199769,0.13297693241602584,28.696394359101621]
[203,null,"BIRCH CREEK UNIT 94 FR","FRONTIER",1.8445530247279553,16981.300999999999,31322.910123365851,0.13297693241602584,4165.2245025480725]
[204,null,"BIRCH CREEK UNIT 95 BR","BEAR RIVER",1.8445530247279553,705.03800000000001,1300.4799754481483,0.13297693241602584,172.93383780356336]
[205,null,"BIRCH CREEK UNIT 95 FR","FRONTIER",1.8445530247279553,9677.4519999999993,17850.5733582596,0.13297693241602584,2373.7144870485986]
[206,null,"BIRCH CREEK UNIT 96 BR","BEAR RIVER",1.8445530247279553,1007.0600000000001,1857.5755690825349,0.13297693241602584,247.01470090754898]
[207,null,"BIRCH CREEK UNIT 96 FR","FRONTIER",1.8445530247279553,16905.224000000002,31182.582062903628,0.13297693241602584,4146.5641075359154]
[208,null,"BIRCH CREEK UNIT 97 BR","BEAR RIVER",1.8445530247279553,4688.7139999999999,8648.5815907843098,0.13297693241602584,1150.0618496922104]
[209,null,"BIRCH CREEK UNIT 97 FR","FRONTIER",1.8445530247279553,7180.3230000000003,13244.486508173708,0.13297693241602584,1761.2111872823814]
[210,null,"BIRCH CREEK UNIT 98 BR","BEAR RIVER",1.8445530247279553,1060.1260000000002,1955.4586198927489,0.13297693241602584,260.03088873981324]
[211,null,"BIRCH CREEK UNIT 98 FR","FRONTIER",1.8445530247279553,9507.1420000000016,17536.427532618185,0.13297693241602584,2331.9403388235032]
[212,null,"BIRCH CREEK UNIT 15 BR (NP)","LANCE",1.8445530247279553,335.995,619.76059354346933,0.13297693241602584,82.413862561745987]
[213,null,"BIRCH CREEK UNIT 15 FR (NP)","LANCE",1.8445530247279553,1004.946,1853.6761839882599,0.13297693241602584,246.49617263940354]
[214,"BRUFF AREA (WY)","BRUFF FEDERAL 10A-18D DK","DAKOTA",1.8445530247279553,369.995,682.47539638421983,0.12499962199981253,85.3091665721997]
[215,null,"BRUFF FEDERAL 10A-18D FR","FRONTIER",1.8445530247279553,11853.629000000001,21864.647225953009,0.12499962199981253,2733.0726384033755]
[216,null,"BRUFF FEDERAL 9A-18D FR","FRONTIER",1.8445530247279553,7487.9349999999995,13811.893153216321,0.12499962199981253,1726.4814232538388]
[217,null,"CLIFTON FEDERAL 28-1 FR","FRONTIER",1.8445530247279553,5441.91,10037.891550797307,0.20312511999999999,2038.947925802689]
[218,null,"CLIFTON FEDERAL 28-2 FR","FRONTIER",1.8445530247279553,10016.516,18475.994885035961,0.18750015999999997,3464.2519971034239]
[219,null,"CLIFTON FEDERAL 28-3 DK","DAKOTA",1.8445530247279553,2696.1530000000002,4973.1971712793511,0.18750015999999997,932.47526532642564]
[220,null,"CLIFTON FEDERAL 28-3 FR","FRONTIER",1.8445530247279553,10788.616999999998,19900.176119981435,0.18750015999999997,3731.2862065246977]
[221,null,"CLIFTON FEDERAL 28-4 FR","FRONTIER",1.8445530247279553,9318.119999999999,17187.766430778054,0.18750015999999997,3222.7089558135135]
[222,null,"CLIFTON FEDERAL 28-5 DK","FRONTIER",1.8445530247279553,21708.759000000002,40042.957076540224,0.18749994666666664,7508.0523162269137]
[223,null,"CLIFTON FEDERAL 28-5 FR","FRONTIER",1.8445530247279553,14682.993,27083.559150209396,0.18749994666666664,5078.1658962077727]
[224,null,"CLIFTON FEDERAL 28-7 DK","FRONTIER",1.8445530247279553,20148.191999999999,37164.408496399592,0.18749994666666664,6968.3246109731363]
[225,null,"CLIFTON FEDERAL 28-7 FR","FRONTIER",1.8445530247279553,12816.032000000001,23639.850590610269,0.18749994666666664,4432.4707249473931]
[226,null,"CLIFTON FEDERAL 28-8 DK","FRONTIER",1.8445530247279553,604.09900000000005,1114.2926376851333,0.21887943372872165,243.89574154460558]
[227,null,"CLIFTON FEDERAL 28-8 FR","FRONTIER",1.8445530247279553,5877.2629999999999,10840.923243771696,0.18749994666666664,2032.6725300246198]
[228,null,"CLIFTON FEDERAL 34-1 FR","FRONTIER",1.8445530247279553,11028.301000000001,20342.285967160336,0.17908361746350762,3642.9701584762211]
[229,null,"CLIFTON FEDERAL 34-5 DK","FRONTIER",1.8445530247279553,18288.144000000004,33733.451331860415,0.16954399382898069,5719.3040644391631]
[230,null,"CLIFTON FEDERAL 34-5 FR","FRONTIER",1.8445530247279553,24669.102999999999,45503.468555975473,0.16954399382898069,7714.8397920515226]
[231,null,"CLIFTON FEDERAL 34-7 DK","DAKOTA",1.8445530247279553,37857.263000000006,69829.728974571713,0.17972711100929656,12550.295451161943]
[232,null,"CLIFTON FEDERAL 34-7 FR","FRONTIER",1.8445530247279553,9385.8480000000018,17312.694318036833,0.18712338037139509,3239.6098841276967]
[233,null,"CLIFTON FEDERAL 34-8 FR","FRONTIER",1.8445530247279553,23637.566000000003,43600.743862506679,0.18712284107427321,8158.6950645039306]
[234,null,"HAGOOD FED 12-1 FR","FRONTIER",1.8445530247279553,44474.407999999996,82035.403799385167,0.16166666666666671,13262.390280900605]
[235,null,"HAGOOD FED 12-2 FR","FRONTIER",1.8445530247279553,24602.446000000004,45380.516185006192,0.16166666666666671,7336.5167832426696]
[236,null,"HAGOOD FED 12-3 FR","FRONTIER",1.8445530247279553,13384.929,24689.211272718927,0.16166666666666671,3991.4224890895607]
[237,null,"HAGOOD FED 12-4 FR","FRONTIER",1.8445530247279553,31379.528000000006,57881.203286935575,0.16166666666666671,9357.4611980545869]
[238,null,"HALEY FED 4-1 FR","FRONTIER",1.8445530247279553,20890.904999999999,38534.382007054366,0.16656812863792678,6418.599899134043]
[239,null,"HALEY FED 4-2 FR","FRONTIER",1.8445530247279553,22707.777999999998,41885.700594750917,0.16656812863792678,6976.8227647561571]
[240,null,"HALEY FED 4-3 DK","DAKOTA",1.8445530247279553,21446.944,39560.025426371074,0.16656328362148606,6589.2477351658454]
[241,null,"HALEY FED 4-3 FR","FRONTIER",1.8445530247279553,39824.041000000005,73457.555283440117,0.16656812863792678,12235.687517879671]
[242,null,"HALEY FED 4-4 FR","FRONTIER",1.8445530247279553,25155.278999999995,46400.245967325609,0.16656812863792678,7728.802139116935]
[243,null,"HALEY FED 4-5 FR","FRONTIER",1.8445530247279553,26105.407999999996,48152.809288157354,0.16656812863792678,8020.7233317873497]
[244,null,"LANSDALE FED 10-1 DK","DAKOTA",1.8445530247279553,14142.425000000003,26086.452810738258,0.16940006400000002,4419.0467756720409]
[245,null,"LANSDALE FED 10-1 FR","FRONTIER",1.8445530247279553,17997.77,33197.841091858056,0.17500000000000002,5809.6221910751601]
[246,null,"LANSDALE FED 10-2 DK","DAKOTA",1.8445530247279553,2337.123,4310.947298811273,0.16940006400000002,730.27474831925679]
[247,null,"LANSDALE FED 10-2 FR","FRONTIER",1.8445530247279553,17113.311999999998,31566.411412713212,0.17500000000000002,5524.1219972248127]
[248,null,"LANSDALE FED 10-3 FR","FRONTIER",1.8445530247279553,18297.131999999998,33750.030174446656,0.17500000000000002,5906.2552805281657]
[249,null,"LANSDALE FED 10-4 FR","FRONTIER",1.8445530247279553,13704.468000000001,25278.617901687474,0.17500000000000002,4423.7581327953085]
[250,null,"LANSDALE FED 28-1 FR","FRONTIER",1.8445530247279553,4645.5169999999998,8568.9024337751362,0.17465000340923315,1496.5588392722136]
[251,null,"LANSDALE FED 28-2 FR","FRONTIER",1.8445530247279553,40337.487000000001,74404.633655774582,0.17465000340923315,12994.769521643773]
[252,null,"LANSDALE FED 28-3 FR","FRONTIER",1.8445530247279553,19405.653000000002,35794.755937971124,0.17464984122991803,6251.5484414303228]
[253,null,"LANSDALE FED 28-4 DK","DAKOTA",1.8445530247279553,5548.405999999999,10234.329069718735,0.16927521807241153,1732.4182851014593]
[254,null,"LANSDALE FED 28-4 FR","FRONTIER",1.8445530247279553,8737.8179999999993,16117.368621422373,0.17464984122991803,2814.89587077548]
[255,null,"LANSDALE FED 4-1 DK","DAKOTA",1.8445530247279553,4427.8580000000002,8167.4188669658752,0.1750001354794728,1429.2994082366304]
[256,null,"LANSDALE FED 4-1 FR","FRONTIER",1.8445530247279553,15687.679000000002,28936.75575041123,0.1750001354794728,5063.9361766583788]
[257,null,"LANSDALE FED 4-2 FR","FRONTIER",1.8445530247279553,12217.585999999999,22535.98521117392,0.1750001354794728,3943.8004651188312]
[258,null,"LANSDALE FED 4-3 FR","FRONTIER",1.8445530247279553,44388.062999999995,81876.135868465033,0.1750001354794728,14328.334869517103]
[259,null,"LANSDALE FED 4-4 FR","FRONTIER",1.8445530247279553,33826.455000000002,62394.689886074069,0.1750001354794728,10919.079183262653]
[260,null,"LANSDALE FED 4-7 FR","FRONTIER",1.8445530247279553,9231.1090000000004,17027.270027543451,0.17113239999999996,2913.9175852615763]
[261,null,"LANSDALE FED 4-8 FR","FRONTIER",1.8445530247279553,13968.728000000001,25766.059484002086,0.17113239999999996,4409.4075980400376]
[262,null,"LANSDALE FEDERAL 10-5 FR","FRONTIER",1.8445530247279553,35027.68,64610.413093202907,0.17500000000000002,11306.822291310509]
[263,null,"LANSDALE FEDERAL 10-6 FR","FRONTIER",1.8445530247279553,15522.782000000001,28632.59449029266,0.16625000000000001,4760.168834011155]
[264,null,"LANSDALE FEDERAL 10-7 FR","FRONTIER",1.8445530247279553,24208.978000000006,44654.743595472537,0.17500000000000002,7814.5801292076949]
[265,null,"MFS FED 10-3R FR","FRONTIER",1.8445530247279553,56958.47099999999,105062.9199669295,0.13270636463754512,13942.518167016568]
[266,null,"MFS FEE 10-1 FR","FRONTIER",1.8445530247279553,35631.104999999996,65723.46250214937,0.13270636463754512,8721.9217800522583]
[267,null,"MFS STATE 10-2 FR","FRONTIER",1.8445530247279553,52557.171000000002,96944.488739194378,0.13270620023992194,12865.134734780388]
[268,null,"MFS STATE 10-4 FR","FRONTIER",1.8445530247279553,10726.981000000002,19786.485249749308,0.13270636463754512,2625.7925264486398]
[269,null,"MFS STLD 36-1 FR","FRONTIER",1.8445530247279553,23421.052999999996,43201.374153463745,0.17500000000000004,7560.2404768561573]
[270,null,"MOUNTAIN FUEL 10-5 FR","FRONTIER",1.8445530247279553,44932.340000000004,82880.0836551049,0.13469890909090909,11163.856853705915]
[271,null,"PANDO FEDERAL 32-1 DK","DAKOTA",1.8445530247279553,3611.8509999999997,6662.25068691669,0.17500000000000004,1165.893870210421]
[272,null,"PANDO FEDERAL 32-1 FR","FRONTIER",1.8445530247279553,9761.5629999999983,18005.720557722492,0.17500000000000004,3151.0010976014369]
[273,null,"PANDO FEDERAL 32-2 FR","FRONTIER",1.8445530247279553,57874.399000000005,106752.39772976257,0.17500000000000004,18681.669602708454]
[274,null,"PANDO FEDERAL 32-3 DK","DAKOTA",1.8445530247279553,2299.252,4241.0922312118009,0.17500000000000004,742.19114046206539]
[275,null,"PANDO FEDERAL 32-3 FR","FRONTIER",1.8445530247279553,13031.966,24038.152303451872,0.17500000000000004,4206.6766531040785]
[276,null,"PANDO FEDERAL 32-4 FR","FRONTIER",1.8445530247279553,11600.523000000001,21397.779788076215,0.17500000000000004,3744.6114629133385]
[277,"BRUFF UNIT (WY)","AM TRIPP (NCT 1) 1 FR","FRONTIER",1.8445530247279553,565.93799999999999,1043.9026497084897,0.15499700777977254,161.80178711819195]
[278,null,"AM TRIPP (NCT-1) 2 DK","DAKOTA",1.8445530247279553,24437.670999999998,45076.579960356634,8.9597349720777278E-2,4038.7420989246539]
[279,null,"AM TRIPP (NCT-1) 4 DK","DAKOTA",1.8445530247279553,14203.586999999998,26199.269362836661,0.13019363424459127,3410.978092900682]
[280,null,"BERKLEY FED 1 DK","DAKOTA",1.8445530247279553,16434.145,30313.651868567806,0.1875,5683.8097253564638]
[281,null,"BERKLEY FED 1 FR","FRONTIER",1.8445530247279553,2675.8290000000006,4935.7084756047816,0.1875,925.44533917589661]
[282,null,"BERKLEY FED 2 DK","DAKOTA",1.8445530247279553,9645.7339999999986,17792.067825421276,0.1875,3336.0127172664893]
[283,null,"BERKLEY FED 2 FR","FRONTIER",1.8445530247279553,5425.0219999999999,10006.740739315701,0.1875,1876.2638886216939]
[284,null,"BERKLEY FED 4 FR","FRONTIER",1.8445530247279553,10423.089000000002,19225.940341958682,0.1875,3604.8638141172528]
[285,null,"BLACKS FORK 26-1 DK","DAKOTA",1.8445530247279553,108.01700000000001,199.24308407203958,0.17499999999999996,34.86753971260692]
[286,null,"BRUFF 149 E 2 DK ","DAKOTA",1.8445530247279553,898.96599999999989,1658.190454427591,0.15015031152647965,248.97781330253764]
[287,null,"BRUFF 149 L 3  FR","FRONTIER",1.8445530247279553,4500.2660000000005,8300.9792623803769,0.16710527999999999,1387.1374639142664]
[288,null,"BRUFF 358 F 3  FR","FRONTIER",1.8445530247279553,9405.7659999999996,17349.434125183361,0.17109406710940669,2968.3852465243526]
[289,null,"BRUFF FEDERAL 3A FR","FRONTIER",1.8445530247279553,2541.098,4687.1900020301582,0.12494405241935486,585.63651331313213]
[290,null,"BRUFF FEDERAL 4A FR","FRONTIER",1.8445530247279553,2529.2670000000003,4665.3670951946024,0.12494405241935486,582.90987089752775]
[291,null,"BRUFF FEDERAL 5A DK","DAKOTA",1.8445530247279553,1232.0049999999999,2272.4985492299643,0.12505732991285853,284.19260079754406]
[292,null,"BRUFF FEDERAL 5A FR","FRONTIER",1.8445530247279553,6983.7199999999984,12881.841849853114,0.12500138599789337,1610.2480854373059]
[293,null,"BRUFF UNIT 10 FR","FRONTIER",1.8445530247279553,408.97,754.36685052299197,0.1550036186960351,116.92959165539476]
[294,null,"BRUFF UNIT 12 FR","FRONTIER",1.8445530247279553,31472.015999999996,58051.802307086597,0.17109376661132791,9932.3015152956214]
[295,null,"BRUFF UNIT 14 DK ","DAKOTA",1.8445530247279553,2668.1310000000003,4921.5091064204244,0.14325871492314249,705.04907006833332]
[296,null,"BRUFF UNIT 14 FR","FRONTIER",1.8445530247279553,18500.650999999998,34125.431761486267,0.16710534736842106,5702.5421286005112]
[297,null,"BRUFF UNIT 18 FR","FRONTIER",1.8445530247279553,5277.52,9734.6654790622797,0.17109376661132791,1665.5405835140323]
[298,null,"BRUFF UNIT 19 FR","FRONTIER",1.8445530247279553,15206.254999999999,28048.743655034592,0.17109376661132791,4798.9652006554534]
[299,null,"BRUFF UNIT 2 FR","FRONTIER",1.8445530247279553,50444.357999999993,93047.293129359823,0.16710534736842106,15548.700240072971]
[300,null,"BRUFF UNIT 20 FR","FRONTIER",1.8445530247279553,398,734.13210384172623,0.17109376661132791,125.60542683657945]
[301,null,"BRUFF UNIT 21 FR","FRONTIER",1.8445530247279553,12363.244000000001,22804.659115649745,0.17109376661132791,3901.7350243838691]
[302,null,"BRUFF UNIT 22 FR","FRONTIER",1.8445530247279553,42977.016000000003,79273.384856581732,0.17109376661132791,13563.182007141972]
[303,null,"BRUFF UNIT 23 FR","FRONTIER",1.8445530247279553,16834.526999999998,31052.177697714429,0.17109376661132791,5312.8340437862344]
[304,null,"BRUFF UNIT 24 FR","FRONTIER",1.8445530247279553,8565.7150000000001,15799.915512207619,0.17109376661132791,2703.2670571243498]
[305,null,"BRUFF UNIT 25 FR","FRONTIER",1.8445530247279553,19539.656999999999,36041.933421496768,0.1708855291139309,6159.0448630215451]
[306,null,"BRUFF UNIT 26 FR","FRONTIER",1.8445530247279553,26443.607,48776.635276567336,0.17109376661132791,8345.3782520948753]
[307,null,"BRUFF UNIT 27 FR","FRONTIER",1.8445530247279553,23296.187000000002,42971.052195478078,0.17109376661132791,7352.079175376316]
[308,null,"BRUFF UNIT 28 FR","FRONTIER",1.8445530247279553,19192.844999999998,35402.220297884807,0.1708855291139309,6049.7271474119898]
[309,null,"BRUFF UNIT 29 FR","FRONTIER",1.8445530247279553,12846.686999999998,23696.395363583299,0.17109376661132791,4054.3055378666736]
[310,null,"BRUFF UNIT 3 FR","FRONTIER",1.8445530247279553,47463.418000000005,87548.791235827288,0.16710534736842106,14629.871171148296]
[311,null,"BRUFF UNIT 30 FR","FRONTIER",1.8445530247279553,5424.3509999999997,10005.503044236109,0.17109376661132791,1711.8792026794638]
[312,null,"BRUFF UNIT 32 FR","FRONTIER",1.8445530247279553,16180.277999999998,29845.38072583919,0.17109376661132791,5106.3586043329551]
[313,null,"BRUFF UNIT 33 FR","FRONTIER",1.8445530247279553,21824.444,40256.344193205878,0.17109376661132791,6887.6095580176525]
[314,null,"BRUFF UNIT 34 FR","FRONTIER",1.8445530247279553,177.05699999999999,326.59102489925755,0.16710534736842106,54.575106663199087]
[315,null,"BRUFF UNIT 35 FR","FRONTIER",1.8445530247279553,820.89300000000003,1514.1806661280054,0.15499887791741471,234.69630421408439]
[316,null,"BRUFF UNIT 36 DK","DAKOTA",1.8445530247279553,13733.025000000001,25331.292802414631,0.14119600737762761,3576.6774054145812]
[317,null,"BRUFF UNIT 37 FR","FRONTIER",1.8445530247279553,1441.8440000000001,2659.557711385854,0.15499887791741471,412.22846102141483]
[318,null,"BRUFF UNIT 38 FR","FRONTIER",1.8445530247279553,581.11299999999994,1071.8937418587361,0.15499887791741471,166.14232723480308]
[319,null,"BRUFF UNIT 39 FR","FRONTIER",1.8445530247279553,2097.1510000000003,3868.3062203612567,0.15500124831337442,599.59229301438597]
[320,null,"BRUFF UNIT 4 FR","FRONTIER",1.8445530247279553,17400.443999999996,32096.041611809396,0.17109376661132791,5491.4326526783861]
[321,null,"BRUFF UNIT 41 FR","FRONTIER",1.8445530247279553,17749.935000000001,32740.696292974604,0.17109376661132791,5601.7290502425658]
[322,null,"BRUFF UNIT 42 FR","FRONTIER",1.8445530247279553,15097.032999999999,27847.277884567757,0.17109376661132791,4764.4956631430287]
[323,null,"BRUFF UNIT 43 FR","FRONTIER",1.8445530247279553,36471.953000000009,67274.451223885844,0.17109376661132791,11510.239256604687]
[324,null,"BRUFF UNIT 48 DK","DAKOTA",1.8445530247279553,18842.765999999996,34756.481019541068,0.20039264749509189,6964.9432491187454]
[325,null,"BRUFF UNIT 48 FR","FRONTIER",1.8445530247279553,36582.677000000003,67478.687512995806,0.17109376661132791,11545.182812587233]
[326,null,"BRUFF UNIT 50 FR","FRONTIER",1.8445530247279553,57402.73,105882.37924914215,0.16442297418638252,17409.495710074465]
[327,null,"BRUFF UNIT 51 DK","DAKOTA",1.8445530247279553,10274.943000000001,18952.677189557333,0.20039264749509189,3797.9771591352314]
[328,null,"BRUFF UNIT 52 FR","FRONTIER",1.8445530247279553,53677.031000000003,99010.129889466232,0.16249999999999998,16089.146107038261]
[329,null,"BRUFF UNIT 53 FR","FRONTIER",1.8445530247279553,39131.126999999993,72179.438668863746,0.16249999999999998,11729.158783690356]
[330,null,"BRUFF UNIT 539-16E DK","DAKOTA",1.8445530247279553,26.001999999999999,47.962067748976295,0.14093007033656918,6.7592975813505252]
[331,null,"BRUFF UNIT 539-16E FR","FRONTIER",1.8445530247279553,1062.3430000000001,1959.5479939485704,0.16710534736842106,327.45094821386851]
[332,null,"BRUFF UNIT 54 FR","FRONTIER",1.8445530247279553,23207.79,42807.999241751197,0.16249999999999998,6956.2998767845684]
[333,null,"BRUFF UNIT 55 DK","DAKOTA",1.8445530247279553,4169.0730000000003,7690.0762124616513,0.20039264749509189,1541.0347316542191]
[334,null,"BRUFF UNIT 55 FR","FRONTIER",1.8445530247279553,4176.2280000000001,7703.27398935358,0.17109376661132791,1317.9821620775742]
[335,null,"BRUFF UNIT 56 DK","DAKOTA",1.8445530247279553,64762.349000000002,119457.58673643747,0.17292019999999997,20656.629789982111]
[336,null,"BRUFF UNIT 56 FR","FRONTIER",1.8445530247279553,12336.427999999998,22755.195581738637,0.16249999999999998,3697.7192820325281]
[337,null,"BRUFF UNIT 614-09E FR","FRONTIER",1.8445530247279553,19134.690999999999,35294.952161284782,0.17108541085410861,6038.4513915895159]
[338,null,"BRUFF UNIT 63 FR","FRONTIER",1.8445530247279553,30829.914999999994,56867.412965355747,0.17109376661132791,9729.6598816845799]
[339,null,"BRUFF UNIT 7 FR","FRONTIER",1.8445530247279553,9662.1790000000001,17822.401499912932,0.17109376661132791,3049.3018026794839]
[340,null,"BRUFF UNIT 71 DK","DAKOTA",1.8445530247279553,21364.512999999999,39407.977075989722,0.17013638270803791,6704.730669550172]
[341,null,"BRUFF UNIT 71 FR","FRONTIER",1.8445530247279553,12542.210999999999,23134.773236826233,0.1710943261226508,3958.2284369551212]
[342,null,"BRUFF UNIT 9 FR","FRONTIER",1.8445530247279553,16290.722000000002,30049.100540102248,0.17109376661132791,5141.2137946885814]
[343,null,"CHAMPLIN 149 AMOCO B 1 FR","MESAVERDE",1.8445530247279553,10060.462,18557.055612260654,0.17109406710940669,3175.0021182771166]
[344,null,"CHAMPLIN 149 AMOCO B 2 FR","FRONTIER",1.8445530247279553,7423.4849999999988,13693.011710772604,0.17109406710940669,2342.7930645728197]
[345,null,"CHAMPLIN 149 AMOCO B 3 FR","FRONTIER",1.8445530247279553,8839.4709999999995,16304.872970045044,0.17109406710940669,2789.6670301472382]
[346,null,"CHAMPLIN 149 AMOCO B 4 FR","FRONTIER",1.8445530247279553,3575.9389999999994,6596.0090986926589,0.17109406710940669,1128.5380233859789]
[347,null,"CHAMPLIN 149 AMOCO C 1 FR","FRONTIER",1.8445530247279553,6365.3159999999998,11741.16288114925,0.16710545959000112,1962.0124193755071]
[348,null,"CHAMPLIN 149 AMOCO C 2 DK","DAKOTA",1.8445530247279553,1651.1089999999999,3045.5581001055493,0.19557569871587349,595.63715340793101]
[349,null,"CHAMPLIN 149 AMOCO C 2 FR","FRONTIER",1.8445530247279553,9354.9839999999986,17255.764033481624,0.16710545959000112,2883.5323793915582]
[350,null,"CHAMPLIN 149 AMOCO C 3 DK","FRONTIER",1.8445530247279553,1199.9849999999999,2213.4359613781753,0.19557569871587349,432.89428470937781]
[351,null,"CHAMPLIN 149 AMOCO C 3 FR","FRONTIER",1.8445530247279553,592.00299999999993,1091.9809242980236,0.16710545959000112,182.47597421833547]
[352,null,"CHAMPLIN 149 AMOCO C 4 FR","FRONTIER",1.8445530247279553,11323.444,20886.692880537616,0.16710545959000112,3490.2804131174425]
[353,null,"CHAMPLIN 149 AMOCO D 1 FR","FRONTIER",1.8445530247279553,3423.8690000000001,6315.5079202222796,0.14919028157450756,942.21240490399452]
[354,null,"CHAMPLIN 149 AMOCO D 4 DK (C7)","DAKOTA",1.8445530247279553,2045.7710000000002,3773.5330859507344,0.19556701809666666,737.97861330849764]
[355,null,"CHAMPLIN 149 AMOCO D 4 FR","FRONTIER",1.8445530247279553,5955.7629999999999,10985.720656212841,0.149197957452951,1639.0470830556485]
[356,null,"CHAMPLIN 149 AMOCO E 3 DK","DAKOTA",1.8445530247279553,1958.1220000000003,3611.8598578863539,0.14999805261067006,541.77194498560459]
[357,null,"CHAMPLIN 149 AMOCO E 3 FR","FRONTIER",1.8445530247279553,2498.2449999999999,4608.1453712614903,0.15500332882010159,714.2778722324739]
[358,null,"CHAMPLIN 149 AMOCO E 4 DK","DAKOTA",1.8445530247279553,12724.005999999999,23470.10375395665,0.14999805261067006,3520.4698576638743]
[359,null,"CHAMPLIN 149 AMOCO L 1 FR","FRONTIER",1.8445530247279553,7809.6080000000002,14405.236058339638,0.16710527999999999,2407.1910049949415]
[360,null,"CHAMPLIN 149 D 3 DK","DAKOTA",1.8445530247279553,4793.2339999999995,8841.3742729288751,0.19556701809666666,1729.0812024332843]
[361,null,"CHAMPLIN 149 D 3 FR","FRONTIER",1.8445530247279553,5190.3739999999998,9573.9200611693359,0.149197957452951,1428.4093179442966]
[362,null,"CHAMPLIN 149 J6 DK","DAKOTA",1.8445530247279553,3757.5349999999999,6930.972549771157,0.13019404070020213,902.3713222368898]
[363,null,"CHAMPLIN 149 J6 FR","FRONTIER",1.8445530247279553,7561.5470000000005,13947.674390472597,0.15499700777977254,2161.8477960098153]
[364,null,"CHAMPLIN 358 AMOCO F 1 FR","FRONTIER",1.8445530247279553,9467.7200000000012,17463.71156327736,0.17109406710940669,2987.9374381866983]
[365,null,"CHAMPLIN 358 AMOCO F 2 FR","FRONTIER",1.8445530247279553,4761.2950000000001,8782.4610938720907,0.17109406710940669,1502.6269877807049]
[366,null,"CHAMPLIN 358 AMOCO F 4 FR","FRONTIER",1.8445530247279553,4150.1329999999998,7655.1403781733034,0.17109406710940669,1309.7491015951121]
[367,null,"CHAMPLIN 358B 6-29 DK","DAKOTA",1.8445530247279553,3015.8070000000002,5562.8159238457411,0.17500000000000004,973.49278667300496]
[368,null,"CHAMPLIN 358B 6-29 FR","DAKOTA",1.8445530247279553,4109.8140000000003,7580.7698447692974,0.17500000000000004,1326.6347228346274]
[369,null,"CLIFTON FEDERAL 34-3 FR","FRONTIER",1.8445530247279553,12183.45,22473.019549121807,0.16876698508613705,3792.7037550871064]
[370,null,"CLIFTON FEDERAL 34-4 FR","FRONTIER",1.8445530247279553,10914.313000000002,20132.029056977648,0.17875790000000003,3598.7592369643053]
[371,null,"CLIFTON FEDERAL 34-6 DK","DAKOTA",1.8445530247279553,5321.985999999999,9816.6853738598311,0.17750914285714284,1742.5514064121094]
[372,null,"CLIFTON FEDERAL 34-6 FR","FRONTIER",1.8445530247279553,18855.507000000001,34779.98246962914,0.17750914285714284,6173.7648767703222]
[373,null,"DONLEY (NCT 1) 1 FR","FRONTIER",1.8445530247279553,21,38.735613519287064,0.31006199332379575,12.010441540410318]
[374,null,"DONLEY (NCT 1) 2 FR","FRONTIER",1.8445530247279553,564.96900000000005,1042.1152778275282,0.31006199332379575,323.12034031638461]
[375,null,"DONLEY (NCT 1) 4 FR","FRONTIER",1.8445530247279553,793.04099999999994,1462.8061752832823,0.31006199332379575,453.56059855469226]
[376,null,"DONLEY 26-10 FR","MESAVERDE",1.8445530247279553,382.97199999999998,706.41216098611449,0.15500331169691342,109.49622437582089]
[377,null,"FABIAN DITCH 531-09E FR","MESAVERDE",1.8445530247279553,9363.4210000000003,17271.326527351255,0.16710545959000112,2886.1329570820094]
[378,null,"FABIAN DITCH 533-09E FR","FRONTIER",1.8445530247279553,6889.4190000000008,12707.898655068248,0.16710545959000112,2123.5592451783364]
[379,null,"FABIAN DITCH 549-21E DK","DAKOTA",1.8445530247279553,1780.0029999999999,3283.3099176748347,0.16823366673644055,552.36326648255817]
[380,null,"FABIAN DITCH 549-21E FR","FRONTIER",1.8445530247279553,7124.6469999999999,13141.789173968953,0.16580913432087141,2179.0286863631918]
[381,null,"FABIAN DITCH 558-27E DK","DAKOTA",1.8445530247279553,3760.5770000000002,6936.583680072381,0.15242001129481419,1057.2741628640561]
[382,null,"FABIAN DITCH 558-27E FR","FRONTIER",1.8445530247279553,718.077,1324.5311023375759,0.15499700777977254,205.29835757356796]
[383,null,"FABIAN DITCH 559-27E DK","DAKOTA",1.8445530247279553,2545.6160000000004,4695.5236925958798,0.16596204625284744,779.27872025193835]
[384,null,"FABIAN DITCH 559-27E FR","FRONTIER",1.8445530247279553,6381.0339999999997,11770.155565591924,0.15499700777977254,1824.3388937691846]
[385,null,"FABIAN DITCH 580-13E DK","DAKOTA",1.8445530247279553,17188.32,31704.767645992008,0.14255602494634376,4519.7056474600695]
[386,null,"FABIAN DITCH BORDER 523-07E FR","FRONTIER",1.8445530247279553,13814.023000000001,25480.697908311548,0.16166719304507729,4119.3929076662998]
[387,null,"GOVT UNIT 1-12 #2  FR","FRONTIER",1.8445530247279553,3567.2629999999999,6580.00575665012,0.17500000000000004,1151.5010074137713]
[388,null,"GREEN RIVER FEE 2 FR","FRONTIER",1.8445530247279553,20633.165000000001,38058.966910460986,0.12506329406329411,4759.7797704681625]
[389,null,"GREEN RIVER FEE 4 FR","FRONTIER",1.8445530247279553,23015.739999999998,42453.752833352184,0.12506329406329411,5309.4061746879297]
[390,null,"HAGOOD FED 12-5 DK","DAKOTA",1.8445530247279553,21449.216,39564.216250843259,0.16166677333333332,6396.2191807360596]
[391,null,"HAGOOD FED 12-5 FR","FRONTIER",1.8445530247279553,26116.971000000001,48174.137854782297,0.16166677333333332,7788.157425097842]
[392,null,"HALEY FED 4-7 FR","FRONTIER",1.8445530247279553,10072.246000000001,18578.79182510405,0.16656812863792678,3094.6345866611937]
[393,null,"HALEY FED 4-8 FR","FRONTIER",1.8445530247279553,16516.388999999999,30465.35528753353,0.16656812863792678,5074.5572185340279]
[394,null,"KOBUS 606-03E DK","DAKOTA",1.8445530247279553,22059.038,40689.065265488905,0.17500006400000004,7120.5890255607374]
[395,null,"KOBUS 616-09E DK","DAKOTA",1.8445530247279553,220.01400000000001,405.82748918249638,0.17500002709589457,71.019821603195723]
[396,null,"KOBUS 616-09E FR","FRONTIER",1.8445530247279553,22299.93,41133.403332721675,0.17108541085410861,7037.3252090064479]
[397,null,"KOBUS 617-09E DK","DAKOTA",1.8445530247279553,27824.311000000002,51323.417016021325,0.17500006503016102,8981.601315373804]
[398,null,"KOBUS 617-09E FR","FRONTIER",1.8445530247279553,280.05900000000003,516.58367555228654,0.17109287109287116,88.383784209948942]
[399,null,"KOBUS 618-09E FR","FRONTIER",1.8445530247279553,7707.6439999999993,14217.158053726276,0.17108586085860852,2432.3547245846594]
[400,null,"KOBUS 630-15E DK","DAKOTA",1.8445530247279553,2139.0340000000001,3945.5616346959373,0.16939980800000001,668.37738336965799]
[401,null,"KOBUS 630-15E FR","FRONTIER",1.8445530247279553,21607.047000000002,39855.343899289095,0.17109287109287116,6818.9652161231179]
[402,null,"KOBUS 631-15E FR","MESAVERDE",1.8445530247279553,10993.648999999999,20278.368515747461,0.17109406710940669,3469.5085437025759]
[403,null,"KOBUS 645-15E FR","FRONTIER",1.8445530247279553,2593.5899999999979,4784.014279404174,0.17109287109287116,818.51073841255322]
[404,null,"KOBUS 649-11E DK","DAKOTA",1.8445530247279553,27782.986000000001,51247.190862274438,0.16405307716003781,8407.2593567638924]
[405,null,"LANSDALE FED 4-5 FR","FRONTIER",1.8445530247279553,7647.1699999999983,14105.610554108875,0.17113239999999996,2413.9269875899809]
[406,null,"LANSDALE FEDERAL 10-8 FR","FRONTIER",1.8445530247279553,17691.726000000002,32633.326705958214,0.17500000000000002,5710.832173542688]
[407,null,"LAWLER FED 30-4 FR","FRONTIER",1.8445530247279553,2086.1970000000001,3848.1009865283863,0.17500027978557234,673.41874928560458]
[408,null,"LAWLER FEDERAL 1-30 FR","FRONTIER",1.8445530247279553,3270.8080000000004,6033.1787897043951,0.17500027978557234,1055.8079761946499]
[409,null,"LAWLER FEDERAL 30-3 FR","FRONTIER",1.8445530247279553,2802.5650000000005,5169.4797477467027,0.17500027978557234,904.66040220152286]
[410,null,"MCNAMARA 34-6 DK","MESAVERDE",1.8445530247279553,4786.8770000000004,8829.6484493506814,0.15639283631941298,1380.8937646972597]
[411,null,"MCNAMARA 34-6 FR","MESAVERDE",1.8445530247279553,2365.7359999999999,4363.7254945078139,0.17147677545210113,748.2775767563254]
[412,null,"MCNAMARA 34-9 DK","MESAVERDE",1.8445530247279553,11701.824000000001,21584.634854034182,0.15735303529411765,3396.4078099974827]
[413,null,"MCNAMARA 34-9 FR","MESAVERDE",1.8445530247279553,9417.25,17370.616972119336,0.17500159999999998,3039.8857631080391]
[414,null,"OUTER BLACKS F0RK 1-27","MESAVERDE",1.8445530247279553,4119.335,7598.3318341177319,0.17500017777777779,1329.7094217851516]
[415,null,"PANDO FEDERAL 32-8 DK","DAKOTA",1.8445530247279553,4036.4979999999996,7445.5345952083417,0.17500000000000004,1302.9685541614601]
[416,null,"PANDO FEDERAL 32-8 FR","FRONTIER",1.8445530247279553,6871.0609999999997,12674.036350640288,0.17500000000000004,2217.9563613620512]
[417,null,"PORTER HOLLOW 12-4 FR","MESAVERDE",1.8445530247279553,1639.1109999999999,3023.4271529148632,0.17500000000000004,529.09975176010119]
[418,null,"STATE OF WYOMING 24-6D FR","FRONTIER",1.8445530247279553,1378.0119999999999,2541.816202711419,0.15500423181814293,393.99226792419256]
[419,null,"TRIPP 14-7 DK","DAKOTA",1.8445530247279553,26,47.958378642926839,0.13019328439125724,6.2438588296021713]
[420,null,"TRIPP 14-7 FR","FRONTIER",1.8445530247279553,802.10899999999992,1479.5325821115155,0.15500964976586223,229.34182737028783]
[421,null,"WG MCNAMARA (NCT) W1 FR","FRONTIER",1.8445530247279553,1884.2959999999998,3475.6838862827872,0.17500000000000004,608.24468009948794]
[422,null,"WG MCNAMARA 3 DK","DAKOTA",1.8445530247279553,8477.9110000000001,15637.956378424406,0.15735303529411765,2460.6799019420878]
[423,null,"WG MCNAMARA 3 FR","FRONTIER",1.8445530247279553,9567.6880000000001,17648.107840053362,0.17500000000000004,3088.4188720093393]
[424,null,"WG MCNAMARA 4 DK","DAKOTA",1.8445530247279553,16242.558000000001,29960.25948821925,0.15735303529411765,4714.3377686706872]
[425,null,"WG MCNAMARA 4 FR","FRONTIER",1.8445530247279553,3561.4169999999999,6569.2224996675604,0.17500000000000004,1149.6139374418233]
[426,null,"WILSON RANCH UNIT 5-08 FR","FRONTIER",1.8445530247279553,4868.4389999999985,8980.0938831535386,0.16828915504336733,1511.2524118060205]
[427,null,"WYO 'U' (NCT 1) 4 FR","FRONTIER",1.8445530247279553,404.98000000000008,747.00708395432753,0.15500000000000008,115.78609801292083]
[428,null,"WYO 'U' (NCT 1) 5 FR","FRONTIER",1.8445530247279553,401.95000000000005,741.41808828940168,0.15500000000000008,114.91980368485733]
[429,null,"WYO 'U' (NCT 2) 1 DK","DAKOTA",1.8445530247279553,92225.401000000013,170114.64237129863,0.15499991812808053,26367.755639938987]
[430,null,"CHAMPLIN 149 AMOCO L 2 FR ","FRONTIER",1.8445530247279553,7447.7129999999997,13737.701541455714,0.16710581305227967,2295.6497855545126]
[431,null,"BRUFF UNIT 5 FR (PA)","FRONTIER",1.8445530247279553,98.978999999999999,182.5720138345483,0.17109376661132791,31.23693352476834]
[432,null,"BRUFF 149 E 2 FR","FRONTIER",1.8445530247279553,1675.002,3089.6300055253746,0.15701492537313433,485.11802474816329]
[433,"BUTCHERKNIFE (WY)","BUTCHERKNIFE SPR 6 DK","DAKOTA",1.8445530247279553,26691.412000000004,49233.724738860052,0.1768634957733049,8707.6486672554311]
[434,"CANYON CR (WY)","CANYON CREEK 11B-4D MESA","MESAVERDE",2.0445530247279553,211.03399999999999,431.47020302043933,0.1620568239947886,69.922690749879038]
[435,null,"CANYON CREEK 11D-25D MESA","MESAVERDE",2.0445530247279553,195941.31600000002,400612.41029697616,0.16205668241123022,64921.918145494521]
[436,null,"CANYON CREEK 13B-4D MESA","MESAVERDE",2.0445530247279553,9646.0779999999977,19721.917951661781,0.1620568239947886,3196.0713863321148]
[437,null,"CANYON CREEK 225 MESA","LANCE",2.0445530247279553,220156.057,450120.73225153016,0.1620568239947886,72945.136282891588]
[438,null,"CANYON CREEK 226 MESA","LANCE",2.0445530247279553,134063.44599999997,274099.82402475283,0.1620568239947886,44419.746938981894]
[439,null,"CANYON CREEK 2A-25D MESA","MESAVERDE",2.0445530247279553,112613.29999999999,230243.86313959662,0.16205668241123022,37312.556605948368]
[440,null,"CANYON CREEK 2A-9D MESA","MESAVERDE",2.0445530247279553,98323.819999999992,201028.26358380701,0.1620568239947886,32578.001929578983]
[441,null,"CANYON CREEK 2D-4W MESA","MESAVERDE",2.0445530247279553,26706.008999999995,54601.851479361983,0.1620568239947886,8848.6026349805525]
[442,null,"CANYON CREEK 3A-25D MESA","MESAVERDE",2.0445530247279553,184101.745,376405.77959744469,0.1620568239947886,60999.125174844288]
[443,null,"CANYON CREEK 7B-25W MESA","MESAVERDE",2.0445530247279553,193882.11000000002,396402.25444113818,0.16205668241123022,64239.634255063203]
[444,null,"CANYON CREEK 8C-25D MESA","MESAVERDE",2.0445530247279553,128427.77899999999,262577.40401354339,0.16205668241123022,42552.422970588086]
[445,null,"CANYON CREEK UNIT 05B-03W MESA","MESAVERDE",2.0445530247279553,50250.163000000008,102739.1227547228,0.1620568239947886,16649.575933641096]
[446,null,"CANYON CREEK UNIT 06A-09W MESA","MESAVERDE",2.0445530247279553,128153.15399999998,262015.91863912743,0.1620568239947886,42461.467610733926]
[447,null,"CANYON CREEK UNIT 10 MESA","MESAVERDE",2.0445530247279553,62842.603000000003,128485.03404542808,0.1620568239947886,20821.876548264361]
[448,null,"CANYON CREEK UNIT 101 MESA","MESAVERDE",2.0445530247279553,117673.872,240590.47092905027,0.16205668241123022,38989.293538517413]
[449,null,"CANYON CREEK UNIT 107 MESA","MESAVERDE",2.0445530247279553,17884.446000000004,36565.69816488379,0.16205668241123022,5925.7157346514759]
[450,null,"CANYON CREEK UNIT 108 MESA","MESAVERDE",2.0445530247279553,13135.417000000001,26856.056558413005,0.16205668241123022,4352.203428504773]
[451,null,"CANYON CREEK UNIT 10C-35J MESA","MESAVERDE",2.0445530247279553,55534.115999999995,113542.44484339312,0.1620568239947886,18400.327999923753]
[452,null,"CANYON CREEK UNIT 11 CC/TR","MESAVERDE",2.0445530247279553,35212.519000000008,71993.862229740611,0.1620568239947886,11667.096660070132]
[453,null,"CANYON CREEK UNIT 11 MESA","MESAVERDE",2.0445530247279553,2369.83,4845.2430945910501,0.1620568239947886,785.20470739210668]
[454,null,"CANYON CREEK UNIT 110 MESA","MESAVERDE",2.0445530247279553,118837.80799999999,242970.19979843998,0.16205668241123022,39374.944504128944]
[455,null,"CANYON CREEK UNIT 112 MESA","MESAVERDE",2.0445530247279553,95907.068999999989,196087.08801674269,0.16205668241123022,31777.22294767222]
[456,null,"CANYON CREEK UNIT 113 MESA","MESAVERDE",2.0445530247279553,80739.749000000011,165076.69803372593,0.16205668241123022,26751.782026746077]
[457,null,"CANYON CREEK UNIT 114 MESA","MESAVERDE",2.0445530247279553,79553.698000000004,162651.75387419428,0.16205668241123022,26358.803621219889]
[458,null,"CANYON CREEK UNIT 115 MESA","MESAVERDE",2.0445530247279553,83031.27,169761.83422550355,0.16205668241123022,27511.039654630342]
[459,null,"CANYON CREEK UNIT 116 MESA","MESAVERDE",2.0445530247279553,73158.075999999986,149575.56556907762,0.1620609299179793,24240.355249132404]
[460,null,"CANYON CREEK UNIT 117 MESA","MESAVERDE",2.0445530247279553,55575.010999999991,113626.05683933938,0.16205668241123022,18413.861806853216]
[461,null,"CANYON CREEK UNIT 118 MESA","MESAVERDE",2.0445530247279553,73535.567999999999,150347.36797948825,0.16205668241123022,24364.795664016292]
[462,null,"CANYON CREEK UNIT 119 MESA","MESAVERDE",2.0445530247279553,163117.72899999996,333502.84621370485,0.16205668241123022,54046.364832095722]
[463,null,"CANYON CREEK UNIT 11C-34W MESA","MESAVERDE",2.0445530247279553,81492.353000000003,166615.43681834827,0.1620568239947886,27001.168519285886]
[464,null,"CANYON CREEK UNIT 12 ALMOND","MESAVERDE",2.0445530247279553,72085.862999999998,147383.369236775,0.1620568239947886,23884.480728162987]
[465,null,"CANYON CREEK UNIT 121 MESA","MESAVERDE",2.0445530247279553,31247.274000000001,63886.708571203199,0.16205668241123022,10353.268041222296]
[466,null,"CANYON CREEK UNIT 122 MESA","MESAVERDE",2.0445530247279553,29900.657000000003,61133.478710703115,0.16205668241123022,9907.0887441141185]
[467,null,"CANYON CREEK UNIT 123 MESA","MESAVERDE",2.0445530247279553,54525.887999999999,111481.06923637772,0.16205668241123022,18066.252232104031]
[468,null,"CANYON CREEK UNIT 124 MESA","MESAVERDE",2.0445530247279553,93224.324999999997,190602.07565697192,0.16205668241123022,30888.340041663174]
[469,null,"CANYON CREEK UNIT 125 MESA","MESAVERDE",2.0445530247279553,79046.518000000011,161614.79747111278,0.16205668241123022,26190.757906731418]
[470,null,"CANYON CREEK UNIT 126 MESA","MESAVERDE",2.0445530247279553,170153.587,347888.03096916131,0.16205668241123022,56377.580149437599]
[471,null,"CANYON CREEK UNIT 129 MESA","MESAVERDE",2.0445530247279553,104578.80799999999,213816.91821884408,0.16205668241123022,34650.460409939202]
[472,null,"CANYON CREEK UNIT 13 MESA","MESAVERDE",2.0445530247279553,103071.67700000001,210735.50897413286,0.1620568239947886,34151.127287273244]
[473,null,"CANYON CREEK UNIT 13 UPPER MESA","UPPER MESA",2.0445530247279553,161217.82399999999,329618.38969925913,0.16205668241123022,53416.862696393961]
[474,null,"CANYON CREEK UNIT 130 MESA","MESAVERDE",2.0445530247279553,82059.558999999994,167775.11956129209,0.16205668241123022,27189.07926725049]
[475,null,"CANYON CREEK UNIT 131 MESA","MESAVERDE",2.0445530247279553,234456.14899999998,479358.02860401815,0.16205668241123022,77683.17180275479]
[476,null,"CANYON CREEK UNIT 134 MESA","MESAVERDE",2.0445530247279553,320146.27799999993,654556.04104029667,0.16205668241123022,106075.18046321953]
[477,null,"CANYON CREEK UNIT 13C-15W MESA","MESAVERDE",2.0445530247279553,49966.886999999995,102159.94995208994,0.1620568239947886,16555.717028702253]
[478,null,"CANYON CREEK UNIT 14 MESA","MESAVERDE",2.0445530247279553,9040.1219999999976,18483.008779009728,0.16205668241123022,2995.2950837039593]
[479,null,"CANYON CREEK UNIT 14 UPPER MESA","UPPER MESA",2.0445530247279553,60500.796999999999,123697.087504802,0.16205668241123022,20045.93962495985]
[480,null,"CANYON CREEK UNIT 146 MESA","MESAVERDE",2.0445530247279553,94311.832999999999,192825.54342778778,0.16205668241123022,31248.667852049886]
[481,null,"CANYON CREEK UNIT 14A-04W MESA","MESAVERDE",2.0445530247279553,76204.89,155804.93834856112,0.1620568239947886,25249.253471471657]
[482,null,"CANYON CREEK UNIT 15 MESA","MESAVERDE",2.0445530247279553,110721.141,226375.24373288042,0.1620568239947886,36685.653030396774]
[483,null,"CANYON CREEK UNIT 16 UP MESA","UPPER MESA",2.0445530247279553,51139.59,104557.60341784749,0.1620568239947886,16944.273134403018]
[484,null,"CANYON CREEK UNIT 160 MESA","MESAVERDE",2.0445530247279553,202242.755,413496.03646456479,0.16205668241123022,67009.79585964045]
[485,null,"CANYON CREEK UNIT 162 MESA","MESAVERDE",2.0445530247279553,214920.45899999997,439416.27452437044,0.16205668241123022,71210.343646921858]
[486,null,"CANYON CREEK UNIT 163 MESA","MESAVERDE",2.0445530247279553,266855.92900000006,545601.09680353862,0.16205668241123022,88418.303667909931]
[487,null,"CANYON CREEK UNIT 16C-09J MESA","MESAVERDE",2.0445530247279553,186798.75100000002,381919.95137245418,0.1620568239947886,61892.734339664028]
[488,null,"CANYON CREEK UNIT 17 MESA","MESAVERDE",2.0445530247279553,96625.633999999991,197556.23226095634,0.1620568239947886,32015.33556058738]
[489,null,"CANYON CREEK UNIT 174 MESA","MESAVERDE",2.0445530247279553,110395.56599999999,225709.58838185461,0.16205668241123022,36577.747081567715]
[490,null,"CANYON CREEK UNIT 178 MESA","MESAVERDE",2.0445530247279553,114091.33299999998,233265.77998039435,0.16205668241123022,37802.278423690674]
[491,null,"CANYON CREEK UNIT 18 MESA","MESAVERDE",2.0445530247279553,55293.722000000009,113050.9465635667,0.1620568239947886,18320.67734969618]
[492,null,"CANYON CREEK UNIT 19 MESA","MESAVERDE",2.0445530247279553,42807.067000000003,87521.31831458224,0.1620568239947886,14183.426877898122]
[493,null,"CANYON CREEK UNIT 197 MESA","MESAVERDE",2.0445530247279553,6909.1109999999981,14126.043793231183,0.1620568239947886,2289.2217927423417]
[494,null,"CANYON CREEK UNIT 216 MESA","MESAVERDE",2.0445530247279553,111501.977,227971.7043384969,0.16205668241123022,36944.33808873067]
[495,null,"CANYON CREEK UNIT 218 MESA","MESAVERDE",2.0445530247279553,87025.691999999995,177928.64180764341,0.16205668241123022,28834.525397282807]
[496,null,"CANYON CREEK UNIT 22 MESA","MESAVERDE",2.0445530247279553,147852.03500000003,302291.32537143357,0.1620568239947886,48988.372110869786]
[497,null,"CANYON CREEK UNIT 23 MESA","MESAVERDE",2.0445530247279553,50486.161,103221.63317945253,0.1620568239947886,16727.770040617172]
[498,null,"CANYON CREEK UNIT 24 MESA","MESAVERDE",2.0445530247279553,30093.366999999998,61527.484524098429,0.1620568239947886,9970.948730363898]
[499,null,"CANYON CREEK UNIT 25 MESA","MESAVERDE",2.0445530247279553,29132.741999999998,59563.435774719139,0.1620568239947886,9652.6612278685552]
[500,null,"CANYON CREEK UNIT 25 UPPER MESA","UPPER MESA",2.0445530247279553,41926.045000000006,85720.022119630376,0.16205668241123022,13891.50240092457]
[501,null,"CANYON CREEK UNIT 26 MESA","MESAVERDE",2.0445530247279553,6127.87,12528.755143639695,0.1620568239947886,2030.3702671866204]
[502,null,"CANYON CREEK UNIT 26 UPR MESA","UPPER MESA",2.0445530247279553,16235.481,33194.301786463249,0.1620568239947886,5379.3631222387712]
[503,null,"CANYON CREEK UNIT 27 MESA","MESAVERDE",2.0445530247279553,38712.188999999998,79149.12311379028,0.1620568239947886,12826.655513793366]
[504,null,"CANYON CREEK UNIT 28 MESA","MESAVERDE",2.0445530247279553,37948.497000000003,77587.714325229739,0.1620568239947886,12573.618564561693]
[505,null,"CANYON CREEK UNIT 29 MESA","MESAVERDE",2.0445530247279553,42183.650999999998,86246.71124611843,0.1620568239947886,13976.868104541569]
[506,null,"CANYON CREEK UNIT 3 MESA","MESAVERDE",2.0445530247279553,56306.429999999993,115121.48176813287,0.1620568239947886,18656.221708917572]
[507,null,"CANYON CREEK UNIT 32 MESA","MESAVERDE",2.0445530247279553,44220.145000000004,90410.431213658783,0.1620568239947886,14651.627338484843]
[508,null,"CANYON CREEK UNIT 33 UPPER MESA","UPPER MESA",2.0445530247279553,81991.928000000014,167636.84439567677,0.1620568239947886,27166.694587271955]
[509,null,"CANYON CREEK UNIT 35 UPR MESA ","UPPER MESA",2.0445530247279553,68279.905999999988,139601.88834044043,0.1620568239947886,22623.438648126885]
[510,null,"CANYON CREEK UNIT 37 MESA","MESAVERDE",2.0445530247279553,91685.151999999987,187455.15484424232,0.1620568239947886,30378.387035509222]
[511,null,"CANYON CREEK UNIT 38 MESA","MESAVERDE",2.0445530247279553,67431.395999999993,137867.06465342853,0.1620568239947886,22342.298631218808]
[512,null,"CANYON CREEK UNIT 39 MESA","MESAVERDE",2.0445530247279553,32910.409,67287.076265984128,0.1620568239947886,10904.329875560506]
[513,null,"CANYON CREEK UNIT 39 UPPER MESA","UPPER MESA",2.0445530247279553,160686.37399999998,328531.81199426745,0.1620568239947886,53240.82203304398]
[514,null,"CANYON CREEK UNIT 4 MESA","MESAVERDE",2.0445530247279553,83941.979000000007,171623.82706610052,0.1620568239947886,27812.81233616309]
[515,null,"CANYON CREEK UNIT 40 W MESA","MESAVERDE",2.0445530247279553,64128.511000000006,131114.14113634996,0.1620568239947886,21247.941293361338]
[516,null,"CANYON CREEK UNIT 42 MESA","MESAVERDE",2.0445530247279553,72739.816000000006,148720.41082095494,0.16205668241123022,24101.136384479181]
[517,null,"CANYON CREEK UNIT 43 MESA","MESAVERDE",2.0445530247279553,90724.474999999977,185490.9997781057,0.16205668241123022,30060.056041182052]
[518,null,"CANYON CREEK UNIT 44 W MESA","MESAVERDE",2.0445530247279553,117151.837,239523.14269078639,0.1620568239947886,38816.359777719408]
[519,null,"CANYON CREEK UNIT 45 MESA","MESAVERDE",2.0445530247279553,70467.873999999996,144075.30493284843,0.1620568239947886,23348.386333498118]
[520,null,"CANYON CREEK UNIT 46 MESA ","MESAVERDE",2.0445530247279553,146852.11499999996,300246.93591094745,0.16205668241123022,48657.022337865405]
[521,null,"CANYON CREEK UNIT 48 MESA","MESAVERDE",2.0445530247279553,115904.338,236972.56483699131,0.16205668241123022,38402.987679962964]
[522,null,"CANYON CREEK UNIT 49 MESA","MESAVERDE",2.0445530247279553,63618.826000000001,130072.06312794148,0.16205668241123022,21079.0470248983]
[523,null,"CANYON CREEK UNIT 5 UP MESA","UPPER MESA",2.0445530247279553,61166.474999999991,125058.10147319685,0.1620568239947886,20266.518739564275]
[524,null,"CANYON CREEK UNIT 50 MESA","MESAVERDE",2.0445530247279553,71044.81299999998,145254.88731038192,0.16205668241123022,23539.525141537597]
[525,null,"CANYON CREEK UNIT 51 MESA","MESAVERDE",2.0445530247279553,107370.20600000001,219524.07944296367,0.16205668241123022,35575.344023906036]
[526,null,"CANYON CREEK UNIT 6 MESA","MESAVERDE",2.0445530247279553,4994.3789999999999,10211.272691087781,0.1620568239947886,1654.8064212624038]
[527,null,"CANYON CREEK UNIT 63 MESA","MESAVERDE",2.0445530247279553,91116.840999999971,186293.2128702061,0.1620568239947886,30190.086409530675]
[528,null,"CANYON CREEK UNIT 64 MESA","MESAVERDE",2.0445530247279553,174991.16200000001,357778.70956775965,0.16205668241123022,57980.430709922199]
[529,null,"CANYON CREEK UNIT 68 MESA","MESAVERDE",2.0445530247279553,48290.86,98733.223879714234,0.16205668241123022,16000.378705711742]
[530,null,"CANYON CREEK UNIT 69 MESA","MESAVERDE",2.0445530247279553,95268.637000000017,194781.77994005964,0.16205668241123022,31565.689051240381]
[531,null,"CANYON CREEK UNIT 7 MESA","MESAVERDE",2.0445530247279553,4741.78,9694.8206415945242,0.1620568239947886,1571.1118423759274]
[532,null,"CANYON CREEK UNIT 70 MESA","MESAVERDE",2.0445530247279553,87656.486999999994,179218.33563287667,0.16205668241123022,29043.528899926358]
[533,null,"CANYON CREEK UNIT 71 MESA","MESAVERDE",2.0445530247279553,144442.19199999998,295319.72055193601,0.16205668241123022,47858.534163258351]
[534,null,"CANYON CREEK UNIT 72 MESA","MESAVERDE",2.0445530247279553,96808.15,197929.39590081759,0.16205668241123022,32075.781251345448]
[535,null,"CANYON CREEK UNIT 73 MESA","MESAVERDE",2.0445530247279553,170007.948,347590.26431119296,0.16205668241123022,56329.325072714571]
[536,null,"CANYON CREEK UNIT 75 MESA","MESAVERDE",2.0445530247279553,65811.369000000006,134554.83355043762,0.16205668241123022,21805.509927579213]
[537,null,"CANYON CREEK UNIT 76 MESA","MESAVERDE",2.0445530247279553,205934.77800000002,421044.57325658004,0.16205668241123022,68233.086689213553]
[538,null,"CANYON CREEK UNIT 77 MESA","MESAVERDE",2.0445530247279553,303700.76,620932.30747017881,0.16205668241123022,100626.22975056713]
[539,null,"CANYON CREEK UNIT 78 MESA","MESAVERDE",2.0445530247279553,279254.69099999999,570951.02315352054,0.16205668241123022,92526.428631557035]
[540,null,"CANYON CREEK UNIT 79 MESA","MESAVERDE",2.0445530247279553,290430.71099999995,593800.98864894058,0.16205694263374826,96229.572753344357]
[541,null,"CANYON CREEK UNIT 8 MESA","MESAVERDE",2.0445530247279553,42759.766000000003,87424.608911959585,0.1620568239947886,14167.754459258662]
[542,null,"CANYON CREEK UNIT 80 MESA","MESAVERDE",2.0445530247279553,170378.924,348348.74441409443,0.16205668241123022,56452.241841865711]
[543,null,"CANYON CREEK UNIT 82 MESA","MESAVERDE",2.0445530247279553,173774.04800000001,355290.25545762089,0.1620568239947886,57577.210395759146]
[544,null,"CANYON CREEK UNIT 83 MESA","MESAVERDE",2.0445530247279553,211692.50299999997,432816.54732088168,0.1620568239947886,70140.875031212214]
[545,null,"CANYON CREEK UNIT 9 MESA","MESAVERDE",2.0445530247279553,627.952,1283.881160983969,0.1620568239947886,208.06170333580391]
[546,null,"CANYON CREEK UNIT 95 MESA","MESAVERDE",2.0445530247279553,43424.240999999995,88783.163283065674,0.1620568239947886,14387.917465864351]
[547,null,"CANYON CREEK UNIT 96 MESA","MESAVERDE",2.0445530247279553,83849.266000000003,171434.27042151892,0.1620568239947886,27782.093388375084]
[548,null,"CANYON CREEK UNIT 97 MESA","MESAVERDE",2.0445530247279553,57502.928,117567.78537311383,0.1620568239947886,19052.661901667791]
[549,null,"CANYON CREEK UNIT 98 MESA","MESAVERDE",2.0445530247279553,40720.339,83254.89227039773,0.16205668241123022,13492.01163584503]
[550,null,"CANYON CREEK UNIT 99 MESA","MESAVERDE",2.0445530247279553,45402.081000000006,92826.962037493635,0.16205668241123022,15043.22950610943]
[551,null,"CANYON CREEK UNIT 65 MESA","MESAVERDE",2.0445530247279553,57285.733999999997,117123.72072346107,0.1620568239947886,18980.698194896704]
[552,null,"CANYON CREEK UNIT 66 MESA","MESAVERDE",2.0445530247279553,97494.018999999986,199331.69143933471,0.1620568239947886,32303.060836167773]
[553,null,"CANYON CREEK UNIT 67 MESA","MESAVERDE",2.0445530247279553,80863.252999999997,165329.20851049191,0.1620568239947886,26792.726444782493]
[554,null,"CANYON CREEK UNIT 153 MESA","MESAVERDE",2.0445530247279553,33549.616000000002,68593.968871261415,0.16205668241123022,11116.111028695823]
[555,null,"CANYON CREEK 11-30 MESA","MESAVERDE",2.0445530247279553,222303.33199999997,454510.94984770281,0.1620568239947886,73656.60100317336]
[556,"CH BUTTES (WY)","CHAMPLIN FEE 2-9 FR","FRONTIER",1.8445530247279553,17588.235000000001,32442.432068876089,0.13238584835749112,4294.9188922184367]
[557,null,"CHAMPLIN FEE 3-9 FR","FRONTIER",1.8445530247279553,15338.899000000001,28293.412546446612,0.13238584835749112,3745.6474228898178]
[558,null,"CHURCH BUTTES BUFFER 1-25 FR","FRONTIER",2.0445530247279553,5318.6909999999989,10874.345771643351,0.13238161126830639,1439.5634147388414]
[559,null,"CHURCH BUTTES BUFFER 1-9 FR","FRONTIER",2.0445530247279553,5818.8330000000005,11896.912610536843,0.13238360026222168,1574.9561233878937]
[560,null,"CHURCH BUTTES BUFFER 2-17 FR","FRONTIER",2.0445530247279553,5860.1579999999994,11981.403764283725,0.13238498342330993,1586.1579387226841]
[561,null,"CHURCH BUTTES BUFFER 2-25 FR","FRONTIER",2.0445530247279553,2284.5929999999998,4670.971528422313,0.13238161126830639,618.35073712092958]
[562,null,"CHURCH BUTTES BUFFER 3-17 DK","DAKOTA",2.0445530247279553,2839.355,5805.2118535264435,0.13238498342330993,768.52287499790054]
[563,null,"CHURCH BUTTES BUFFER 4-17 FR","FRONTIER",2.0445530247279553,6651.8359999999984,13600.031413794301,0.13238498342330993,1800.4399332716528]
[564,null,"CHURCH BUTTES BUFFER 4-19 FR","FRONTIER",2.0445530247279553,1819.963,3721.0108565429637,0.13238445172096389,492.60398209119444]
[565,null,"CHURCH BUTTES UNIT 1 DK","DAKOTA",2.0445530247279553,219337.20900000003,448446.55409633776,0.13238478908931198,59367.502481872405]
[566,null,"CHURCH BUTTES UNIT 10 FR","FRONTIER",2.0445530247279553,12150.907999999999,24843.175704591107,0.13238478908931198,3288.8585759610132]
[567,null,"CHURCH BUTTES UNIT 101 FR","FRONTIER",2.0445530247279553,19700.127,40277.954245374858,0.13238478908931198,5332.1884777229088]
[568,null,"CHURCH BUTTES UNIT 103 FR","FRONTIER",2.0445530247279553,15563.326000000001,31820.045248127233,0.13238478908931198,4212.4899789856872]
[569,null,"CHURCH BUTTES UNIT 104 DK","DAKOTA",2.0445530247279553,21390.833999999999,43734.694356153588,0.13238478908931198,5789.8082882249155]
[570,null,"CHURCH BUTTES UNIT 104 FR","FRONTIER",2.0445530247279553,15488.832999999999,31667.740359656167,0.13238478908931198,4192.3271284481743]
[571,null,"CHURCH BUTTES UNIT 105 FR","FRONTIER",2.0445530247279553,29037.523000000001,59368.755480257576,0.13238478908931198,7859.5201727488338]
[572,null,"CHURCH BUTTES UNIT 106 FR","FRONTIER",2.0445530247279553,12792.699000000002,26155.351434884295,0.13238478908931198,3462.5706832639908]
[573,null,"CHURCH BUTTES UNIT 108 FR","FRONTIER",2.0445530247279553,5839.701,11939.578343056864,0.13238478908931198,1580.6185607609]
[574,null,"CHURCH BUTTES UNIT 109 FR","FRONTIER",2.0445530247279553,21488.773000000001,43934.935834842421,0.13238478908931198,5816.3172141480691]
[575,null,"CHURCH BUTTES UNIT 11 FR","FRONTIER",2.0445530247279553,52395.565999999999,107125.51294763321,0.14092039999999995,15096.170134785645]
[576,null,"CHURCH BUTTES UNIT 110 FR","FRONTIER",2.0445530247279553,12288.360999999999,25124.20565149904,0.13238478908931198,3326.0626662102004]
[577,null,"CHURCH BUTTES UNIT 111 FR","FRONTIER",2.0445530247279553,26757.308999999994,54706.737049530529,0.13238478908931198,7242.3398460665485]
[578,null,"CHURCH BUTTES UNIT 113 FR","FRONTIER",2.0445530247279553,12687.683000000001,25940.640654439459,0.13238478908931198,3434.1462418795995]
[579,null,"CHURCH BUTTES UNIT 114 FR","FRONTIER",2.0445530247279553,11940.279999999999,24412.535590098709,0.13238478908931198,3231.8483752305397]
[580,null,"CHURCH BUTTES UNIT 115 FR","FRONTIER",2.0445530247279553,17169.087000000003,35103.108757667425,0.13238478908931198,4647.117649262982]
[581,null,"CHURCH BUTTES UNIT 116 FR","FRONTIER",2.0445530247279553,35309.241000000002,72191.615487398332,0.13238478908931198,9557.0717903159366]
[582,null,"CHURCH BUTTES UNIT 117 DK","DAKOTA",2.0445530247279553,2308.44,4719.7279844030008,0.13238478908931198,624.82019377411484]
[583,null,"CHURCH BUTTES UNIT 117 FR","FRONTIER",2.0445530247279553,18672.798999999999,38177.527675587138,0.13238478908931198,5054.1239492839741]
[584,null,"CHURCH BUTTES UNIT 118 FR","FRONTIER",2.0445530247279553,17088.071000000004,34937.467249816065,0.13238478908931198,4625.1892331816443]
[585,null,"CHURCH BUTTES UNIT 119 DK","DAKOTA",2.0445530247279553,981.95100000000002,2007.6508871846404,0.13238478908931198,265.7824392649087]
[586,null,"CHURCH BUTTES UNIT 119 FR","FRONTIER",2.0445530247279553,11277.019,23056.463306364622,0.13238478908931198,3052.3250319585413]
[587,null,"CHURCH BUTTES UNIT 120 FR","FRONTIER",2.0445530247279553,33617.148000000008,68732.041626127349,0.13238478908931198,9099.0768343526797]
[588,null,"CHURCH BUTTES UNIT 121 DK","DAKOTA",2.0445530247279553,2448.3379999999997,5005.7568634563922,0.13238478908931198,662.68606660105036]
[589,null,"CHURCH BUTTES UNIT 121 FR","FRONTIER",2.0445530247279553,13886.204999999998,28391.082434742453,0.13238478908931198,3758.5474601406495]
[590,null,"CHURCH BUTTES UNIT 122 FR","DAKOTA",2.0445530247279553,17796.438999999998,36385.763186836542,0.13238478908931198,4816.9215853430078]
[591,null,"CHURCH BUTTES UNIT 123 DK","FRONTIER",2.0445530247279553,3708.1040000000003,7581.4152492058302,0.13238478908931198,1003.6640587646074]
[592,null,"CHURCH BUTTES UNIT 123 FR","FRONTIER",2.0445530247279553,7188.0919999999996,14696.435240622817,0.13238478908931198,1945.5844796945835]
[593,null,"CHURCH BUTTES UNIT 124 FR","FRONTIER",2.0445530247279553,12718.84,26004.342793030908,0.13238478908931198,3442.5794360615669]
[594,null,"CHURCH BUTTES UNIT 125 DK","DAKOTA",2.0445530247279553,60914.678000000007,124543.28915522945,0.13238478908931198,16487.637067304247]
[595,null,"CHURCH BUTTES UNIT 125 FR","FRONTIER",2.0445530247279553,24883.608000000004,50875.856002544751,0.13238478908931198,6735.1894666350936]
[596,null,"CHURCH BUTTES UNIT 126 FR","FRONTIER",2.0445530247279553,22070.608999999997,45124.530388538027,0.13238478908931198,5973.8014382408555]
[597,null,"CHURCH BUTTES UNIT 127 DK","DAKOTA",2.0445530247279553,55961.587000000007,114416.43196942663,0.13238478908931198,15146.995214624158]
[598,null,"CHURCH BUTTES UNIT 127 FR","FRONTIER",2.0445530247279553,80529.64499999999,164647.12926501845,0.13238420608731807,21796.679492305502]
[599,null,"CHURCH BUTTES UNIT 128 FR","FRONTIER",2.0445530247279553,14056.863000000003,28740.001764836485,0.13238478908931198,3804.739072064332]
[600,null,"CHURCH BUTTES UNIT 129 FR","FRONTIER",2.0445530247279553,14701.753999999999,30058.515609506314,0.13238478908931198,3979.2902493022852]
[601,null,"CHURCH BUTTES UNIT 13 DK","DAKOTA",2.0445530247279553,67551.706000000006,138113.04482783357,0.13238478908931198,18284.066310015438]
[602,null,"CHURCH BUTTES UNIT 130 FR","FRONTIER",2.0445530247279553,25421.993999999995,51976.614727315922,0.13238478908931198,6880.9131782521454]
[603,null,"CHURCH BUTTES UNIT 131 DK","DAKOTA",2.0445530247279553,11874.217999999999,24277.468328179129,0.13238478908931198,3213.9675242484454]
[604,null,"CHURCH BUTTES UNIT 131 FR","FRONTIER",2.0445530247279553,12361.540999999999,25273.826041848632,0.13238478908931198,3345.8701300300918]
[605,null,"CHURCH BUTTES UNIT 132 FR","FRONTIER",2.0445530247279553,10780.567000000001,22041.44086813238,0.13238478908931198,2917.9515005522467]
[606,null,"CHURCH BUTTES UNIT 133 FR","FRONTIER",2.0445530247279553,11043.344000000001,22578.702378311318,0.13238478908931198,2989.0767522630904]
[607,null,"CHURCH BUTTES UNIT 134 FR","FRONTIER",2.0445530247279553,26197.414000000001,53562.002033750483,0.13238478908931198,7090.794342439357]
[608,null,"CHURCH BUTTES UNIT 135 FR","FRONTIER",2.0445530247279553,14796.257000000001,30251.732004002184,0.13238478908931198,4004.8691609362181]
[609,null,"CHURCH BUTTES UNIT 137 FR","FRONTIER",2.0445530247279553,14086.759000000002,28801.125722063749,0.13238478908931198,3812.8309542501675]
[610,null,"CHURCH BUTTES UNIT 138 FR","FRONTIER",2.0445530247279553,22667.800999999996,46345.52109848136,0.13238478908931198,6135.4420358567131]
[611,null,"CHURCH BUTTES UNIT 139 FR","FRONTIER",2.0445530247279553,5538.8239999999996,11324.419362635792,0.13238478908931198,1499.1808688814601]
[612,null,"CHURCH BUTTES UNIT 140 DK","DAKOTA",2.0445530247279553,4030.5540000000001,8240.6813720293594,0.13238478908931198,1090.9408653883288]
[613,null,"CHURCH BUTTES UNIT 140 FR","FRONTIER",2.0445530247279553,53542.703999999998,109470.89741531359,0.13238478908931198,14492.281665743998]
[614,null,"CHURCH BUTTES UNIT 141 FR","FRONTIER",2.0445530247279553,20043.096000000001,40979.172551712785,0.13238478908931198,5425.0191153130199]
[615,null,"CHURCH BUTTES UNIT 142 DK","DAKOTA",2.0445530247279553,20630.256999999998,42179.654350265067,0.13238478908931198,5583.9446450199212]
[616,null,"CHURCH BUTTES UNIT 142 FR","FRONTIER",2.0445530247279553,24220.748,49520.603584573575,0.13238478908931198,6555.7746611191997]
[617,null,"CHURCH BUTTES UNIT 143 FR","FRONTIER",2.0445530247279553,20303.534,41511.651852366878,0.13238478908931198,5495.5112752245359]
[618,null,"CHURCH BUTTES UNIT 145 FR","FRONTIER",2.0445530247279553,30043.123,61424.758001924005,0.13238478908931198,8131.7036329467373]
[619,null,"CHURCH BUTTES UNIT 146 FR","FRONTIER",2.0445530247279553,44032.398000000001,90026.572516925167,0.13238478908931198,11918.148815086788]
[620,null,"CHURCH BUTTES UNIT 148 FR","FRONTIER",2.0445530247279553,26419.416000000001,54015.896894346137,0.14093270000000002,7612.6061922418166]
[621,null,"CHURCH BUTTES UNIT 149 FR","FRONTIER",2.0445530247279553,48291.365000000013,98734.256378991748,0.14093259999999996,13914.875460557889]
[622,null,"CHURCH BUTTES UNIT 150 FR","FRONTIER",2.0445530247279553,14655.87,29964.703338519699,0.13238478908931198,3966.8709315937331]
[623,null,"CHURCH BUTTES UNIT 151 DK","DAKOTA",2.0445530247279553,3416.1660000000002,6984.5325282728008,0.13238478908931198,924.64586564283366]
[624,null,"CHURCH BUTTES UNIT 151 FR","FRONTIER",2.0445530247279553,10823.156000000001,22128.516336902521,0.13238478908931198,2929.4789681202346]
[625,null,"CHURCH BUTTES UNIT 152 FR","FRONTIER",2.0445530247279553,14452.538,29548.980282895714,0.13238478908931198,3911.8355225553873]
[626,null,"CHURCH BUTTES UNIT 153 FR","FRONTIER",2.0445530247279553,2418.66,4945.078618788516,0.13238478908931198,654.65318997838392]
[627,null,"CHURCH BUTTES UNIT 154 FR","FRONTIER",2.0445530247279553,23591.202000000001,48233.463406068193,0.13238478908931198,6385.3768800593853]
[628,null,"CHURCH BUTTES UNIT 155 FR","FRONTIER",2.0445530247279553,6502.7910000000011,13295.301008223727,0.13238478908931198,1760.0956198526151]
[629,null,"CHURCH BUTTES UNIT 156 FR","FRONTIER",2.0445530247279553,25574.035000000003,52287.470613748599,0.13238478908931198,6922.0657692147061]
[630,null,"CHURCH BUTTES UNIT 157 FR","FRONTIER",2.0445530247279553,26845.761999999999,54887.583898226803,0.13238478908931198,7266.2812179886714]
[631,null,"CHURCH BUTTES UNIT 158 FR","FRONTIER",2.0445530247279553,18998.082000000002,38842.586017129724,0.13238478908931198,5142.1675575611771]
[632,null,"CHURCH BUTTES UNIT 159 DK","DAKOTA",2.0445530247279553,28550.049000000006,58372.089039081351,0.13238478908931198,7727.5766961413237]
[633,null,"CHURCH BUTTES UNIT 159 FR","FRONTIER",2.0445530247279553,161794.75200000001,330797.94958670944,0.13238478908931198,43792.616787213388]
[634,null,"CHURCH BUTTES UNIT 16 FR","FRONTIER",2.0445530247279553,10646.428,21767.186569948397,0.13238478908931198,2881.6444031303226]
[635,null,"CHURCH BUTTES UNIT 160 FR","FRONTIER",2.0445530247279553,124645.649,254844.63868212904,0.13238478908931198,33737.553742475568]
[636,null,"CHURCH BUTTES UNIT 162 DK","DAKOTA",2.0445530247279553,84573.906999999992,172915.83736991076,0.14093270000000002,24369.495833302426]
[637,null,"CHURCH BUTTES UNIT 162 FR","FRONTIER",2.0445530247279553,88034.067999999985,179990.32000850647,0.14093270000000002,25366.521772662843]
[638,null,"CHURCH BUTTES UNIT 163 DK","DAKOTA",2.0445530247279553,5838.1990000000005,11936.507424413725,0.13238478908931198,1580.2120178440175]
[639,null,"CHURCH BUTTES UNIT 163 FR","FRONTIER",2.0445530247279553,24463.484,50016.890207583943,0.13238478908931198,6621.4754610342743]
[640,null,"CHURCH BUTTES UNIT 164 DK","DAKOTA",2.0445530247279553,3507.1019999999999,7170.456002129461,0.13238478908931198,949.25930551609986]
[641,null,"CHURCH BUTTES UNIT 164 FR","FRONTIER",2.0445530247279553,11103.026,22700.725391933131,0.13238478908931198,3005.2307431854565]
[642,null,"CHURCH BUTTES UNIT 165 FR","FRONTIER",2.0445530247279553,27580.625,56390.05026763746,0.13238478908931198,7465.1849114168854]
[643,null,"CHURCH BUTTES UNIT 166 DK","DAKOTA",2.0445530247279553,13589.395,27784.238651472951,0.14093259999999996,3915.7049921725757]
[644,null,"CHURCH BUTTES UNIT 166 FR","FRONTIER",2.0445530247279553,8409.2389999999996,17193.135033110284,0.14093259999999996,2423.0732223673176]
[645,null,"CHURCH BUTTES UNIT 167 DK","DAKOTA",2.0445530247279553,8101.6929999999993,16564.340928567301,0.13238478908931198,2192.86678023184]
[646,null,"CHURCH BUTTES UNIT 167 FR","FRONTIER",2.0445530247279553,18034.003999999997,36871.477426156038,0.13238478908931198,4881.2227624729949]
[647,null,"CHURCH BUTTES UNIT 168 FR","FRONTIER",2.0445530247279553,6982.0969999999998,14275.267540293982,0.13238478908931198,1889.8282825153201]
[648,null,"CHURCH BUTTES UNIT 169R DK","DAKOTA",2.0445530247279553,5802.625,11863.774495112051,0.13238478908931198,1570.5832843385676]
[649,null,"CHURCH BUTTES UNIT 169R FR","FRONTIER",2.0445530247279553,6463.0740000000014,13214.097495740609,0.13238478908931198,1749.3455099792261]
[650,null,"CHURCH BUTTES UNIT 170 FR","FRONTIER",2.0445530247279553,19115.791999999998,39083.250353670446,0.13238478908931198,5174.0278549954401]
[651,null,"CHURCH BUTTES UNIT 171 DK","DAKOTA",2.0445530247279553,87915.079000000012,179747.04068864716,0.13238478908931198,23795.774070994532]
[652,null,"CHURCH BUTTES UNIT 172 DK","DAKOTA",2.0445530247279553,5883.4160000000002,12028.955978532847,0.13238478908931198,1592.4508001826894]
[653,null,"CHURCH BUTTES UNIT 172 FR","FRONTIER",2.0445530247279553,1861.3209999999999,3805.5694805396624,0.13238478908931198,503.79951304596574]
[654,null,"CHURCH BUTTES UNIT 173 FR","FRONTIER",2.0445530247279553,15016.593000000001,30702.220639258641,0.14093259999999996,4326.9437804643812]
[655,null,"CHURCH BUTTES UNIT 174 DK","DAKOTA",2.0445530247279553,1453.2659999999998,2971.2793960342965,0.13238478908931198,393.35219616941862]
[656,null,"CHURCH BUTTES UNIT 174 FR","FRONTIER",2.0445530247279553,10253.911,20964.664750341253,0.13238478908931198,2775.4027213020599]
[657,null,"CHURCH BUTTES UNIT 175 DK","DAKOTA",2.0445530247279553,7256.4440000000013,14836.184528969026,0.13238478908931198,1964.085159757678]
[658,null,"CHURCH BUTTES UNIT 175 FR","FRONTIER",2.0445530247279553,8517.6700000000019,17414.827962134568,0.13238478908931198,2305.4583267938374]
[659,null,"CHURCH BUTTES UNIT 176 DK","DAKOTA",2.0445530247279553,936.01800000000003,1913.7384330998113,0.13238478908931198,253.34985883802889]
[660,null,"CHURCH BUTTES UNIT 176 FR","FRONTIER",2.0445530247279553,9487.3170000000009,19397.322668902954,0.13238478908931198,2567.9104704200477]
[661,null,"CHURCH BUTTES UNIT 177 DK","DAKOTA",2.0445530247279553,33851.586999999992,69211.36459269152,0.13238478908931198,9162.5319041869425]
[662,null,"CHURCH BUTTES UNIT 177 FR","FRONTIER",2.0445530247279553,27365.774000000001,55950.776005721636,0.13238478908931198,7407.0316809007963]
[663,null,"CHURCH BUTTES UNIT 179 FR","FRONTIER",2.0445530247279553,49463.798000000003,101131.3578154326,0.14093259999999996,14252.705198459233]
[664,null,"CHURCH BUTTES UNIT 180 FR","FRONTIER",2.0445530247279553,11330.938,23166.703560904927,0.13238478908931198,3066.9191648050114]
[665,null,"CHURCH BUTTES UNIT 183 DK","DAKOTA",2.0445530247279553,49973.709000000003,102173.89789282465,0.14093259999999996,14399.633082170296]
[666,null,"CHURCH BUTTES UNIT 183 FR","FRONTIER",2.0445530247279553,42580.009000000005,87057.08619389357,0.14093259999999996,12269.181505729523]
[667,null,"CHURCH BUTTES UNIT 184 FR","FRONTIER",2.0445530247279553,26848.562999999995,54893.310691249055,0.14093259999999996,7736.2569983255244]
[668,null,"CHURCH BUTTES UNIT 192 FR","FRONTIER",2.0445530247279553,11067.234999999999,22627.548794625091,0.13238478908931198,2995.543274784558]
[669,null,"CHURCH BUTTES UNIT 193 FR","FRONTIER",2.0445530247279553,6078.5720000000001,12427.962768626658,0.13238478908931198,1645.2732299344618]
[670,null,"CHURCH BUTTES UNIT 195 FR","FRONTIER",2.0445530247279553,13192.559000000001,26972.886407352013,0.13238478908931198,3570.7998781672659]
[671,null,"CHURCH BUTTES UNIT 20 DK","DAKOTA",2.0445530247279553,6564.7170000000006,13421.911998833029,0.13238478908931198,1776.8569891408163]
[672,null,"CHURCH BUTTES UNIT 204","FRONTIER",2.0445530247279553,27850.042999999998,56940.889654453611,0.13238370026528551,7538.0456688538834]
[673,null,"CHURCH BUTTES UNIT 21 DK","DAKOTA",2.0445530247279553,106714.15800000002,218182.75452019699,0.13238478908931198,28884.07794008141]
[674,null,"CHURCH BUTTES UNIT 22 DK","DAKOTA",2.0445530247279553,61453.864000000001,125645.68352242041,0.13238478908931198,16633.577313098067]
[675,null,"CHURCH BUTTES UNIT 25 DK","DAKOTA",2.0445530247279553,15065.522000000003,30802.25857420556,0.13238478908931198,4077.7505048206544]
[676,null,"CHURCH BUTTES UNIT 25 FR","FRONTIER",2.0445530247279553,4005.6399999999994,8189.7433779712856,0.13238478908931198,1084.197449788318]
[677,null,"CHURCH BUTTES UNIT 26 FR","FRONTIER",2.0445530247279553,24508.199000000004,50108.312396084657,0.13238478908931198,6633.5783681770245]
[678,null,"CHURCH BUTTES UNIT 28 DK","DAKOTA",2.0445530247279553,37073.135000000002,75797.990300397825,0.13238478908931198,10034.500959311881]
[679,null,"CHURCH BUTTES UNIT 28 FR","FRONTIER",2.0445530247279553,6541.7480000000005,13374.950660408052,0.13238478908931198,1770.6400222580739]
[680,null,"CHURCH BUTTES UNIT 29 FR","FRONTIER",2.0445530247279553,12935.025000000001,26446.344488681723,0.13238478908931198,3501.0937373174183]
[681,null,"CHURCH BUTTES UNIT 30 FR","FRONTIER",2.0445530247279553,24111.213,49296.653469009994,0.13238478908931198,6526.1270723037878]
[682,null,"CHURCH BUTTES UNIT 31R DK","DAKOTA",2.0445530247279553,2235.893,4571.4017961180625,0.13238478908931198,605.18406262159169]
[683,null,"CHURCH BUTTES UNIT 31R FR","FRONTIER",2.0445530247279553,5754.8209999999999,11766.036682317956,0.13238478908931198,1557.6442846057705]
[684,null,"CHURCH BUTTES UNIT 32 FR","FRONTIER",2.0445530247279553,25897.977000000003,52949.787209685026,0.14092039999999995,7461.7051935036952]
[685,null,"CHURCH BUTTES UNIT 33 FR","FRONTIER",2.0445530247279553,30130.973000000005,61604.371985146361,0.13238478908931198,8155.4817922331204]
[686,null,"CHURCH BUTTES UNIT 34 FR","FRONTIER",2.0445530247279553,1212.9830000000002,2480.0080615935899,0.13238478908931198,328.31534417386081]
[687,null,"CHURCH BUTTES UNIT 36 FR","FRONTIER",2.0445530247279553,9440.6209999999992,19301.850220860251,0.13238478908931198,2555.271370522074]
[688,null,"CHURCH BUTTES UNIT 38 DK","DAKOTA",2.0445530247279553,16121.761999999999,32961.797261044208,0.13238478908931198,4363.6405784079989]
[689,null,"CHURCH BUTTES UNIT 38 FR","FRONTIER",2.0445530247279553,2846.3229999999994,5819.4582990027466,0.13238478908931198,770.40775952752483]
[690,null,"CHURCH BUTTES UNIT 39 FR","FRONTIER",2.0445530247279553,16186.749999999998,33094.668673015229,0.13238478908931198,4381.2307322577817]
[691,null,"CHURCH BUTTES UNIT 4 DK","DAKOTA",2.0445530247279553,31193.154000000002,63776.057361504922,0.13238478908931198,8442.9799027506924]
[692,null,"CHURCH BUTTES UNIT 40 FR","FRONTIER",2.0445530247279553,27596.488999999998,56422.485056821744,0.13238478908931198,7469.478784142203]
[693,null,"CHURCH BUTTES UNIT 41 FR","FRONTIER",2.0445530247279553,4669.6570000000011,9547.3613437920721,0.13238478908931198,1263.9254178573638]
[694,null,"CHURCH BUTTES UNIT 42 FR","FRONTIER",2.0445530247279553,22840.642000000003,46698.90368782838,0.13238478908931198,6182.2245154152533]
[695,null,"CHURCH BUTTES UNIT 43 FR","FRONTIER",2.0445530247279553,31560.278000000002,64526.661846155148,0.13238478908931198,8542.3485191406035]
[696,null,"CHURCH BUTTES UNIT 46 FR","FRONTIER",2.0445530247279553,2138.364,4371.9985841693697,0.13238478908931198,578.78611046403262]
[697,null,"CHURCH BUTTES UNIT 48 FR","FRONTIER",2.0445530247279553,12723.487000000001,26013.843830936821,0.13238478908931198,3443.8372289608706]
[698,null,"CHURCH BUTTES UNIT 49 FR","FRONTIER",2.0445530247279553,10901.063000000002,22287.801329400001,0.13238478908931198,2950.5658782571063]
[699,null,"CHURCH BUTTES UNIT 50 DK","DAKOTA",2.0445530247279553,54057.430999999997,110523.28406007274,0.13238478908931198,14631.601649750846]
[700,null,"CHURCH BUTTES UNIT 54 FR","FRONTIER",2.0445530247279553,12019.038999999999,24573.562541773255,0.13238478908931198,3253.1658942656695]
[701,null,"CHURCH BUTTES UNIT 55 FR","FRONTIER",2.0445530247279553,34680.722000000002,70906.575064849341,0.13238478908931198,9386.9519850055476]
[702,null,"CHURCH BUTTES UNIT 57 DK","DAKOTA",2.0445530247279553,9023.393,18448.805451459059,0.13238360026222168,2442.3192862014521]
[703,null,"CHURCH BUTTES UNIT 57 FR","FRONTIER",2.0445530247279553,20078.411000000004,41051.375941781058,0.13238360026222168,5434.5289428909273]
[704,null,"CHURCH BUTTES UNIT 58 FR","FRONTIER",2.0445530247279553,10790.766000000001,22062.293264431581,0.13238478908931198,2920.7120406383228]
[705,null,"CHURCH BUTTES UNIT 59 FR","FRONTIER",2.0445530247279553,37939.635999999999,77569.597540877614,0.13238478908931198,10269.034810191895]
[706,null,"CHURCH BUTTES UNIT 63 DK","DAKOTA",2.0445530247279553,161689.46399999998,330582.68268784182,0.13238478908931198,43764.118724208885]
[707,null,"CHURCH BUTTES UNIT 65 FR","FRONTIER",2.0445530247279553,8610.8870000000006,17605.415061440632,0.13238498342330993,2330.6925810693087]
[708,null,"CHURCH BUTTES UNIT 68 FR","FRONTIER",2.0445530247279553,14330.788999999999,29300.057996688109,0.13238478908931198,3878.8819981961642]
[709,null,"CHURCH BUTTES UNIT 69 FR","FRONTIER",2.0445530247279553,3311.1479999999997,6769.8176587219195,0.13238478908931198,896.22088292300111]
[710,null,"CHURCH BUTTES UNIT 7 DK","DAKOTA",2.0445530247279553,33291.525000000001,68066.288136556352,0.13238478908931198,9010.9411990503504]
[711,null,"CHURCH BUTTES UNIT 72 FR","FRONTIER",2.0445530247279553,6027.39,12323.318455715031,0.13238478908931198,1631.4199146402602]
[712,null,"CHURCH BUTTES UNIT 74 DK","DAKOTA",2.0445530247279553,6434.2539999999999,13155.173477567945,0.13238478908931198,1741.5448662611432]
[713,null,"CHURCH BUTTES UNIT 76 DK","DAKOTA",2.0445530247279553,27389.583999999995,55999.456813240402,0.13238478908931198,7413.4762793368654]
[714,null,"CHURCH BUTTES UNIT 76 FR","FRONTIER",2.0445530247279553,10972.348,22433.547291767733,0.13238478908931198,2969.8604267457772]
[715,null,"CHURCH BUTTES UNIT 77 DK","DAKOTA",2.0445530247279553,780.08600000000001,1594.9271908479318,0.13238478908931198,211.14409977321228]
[716,null,"CHURCH BUTTES UNIT 77 FR","FRONTIER",2.0445530247279553,12174.179,24890.754498029553,0.13238478908931198,3295.1572844954858]
[717,null,"CHURCH BUTTES UNIT 78 DK","DAKOTA",2.0445530247279553,8388.7890000000007,17151.3239237546,0.14093290000000003,2417.185819414115]
[718,null,"CHURCH BUTTES UNIT 78 FR","FRONTIER",2.0445530247279553,5595.1409999999996,11439.562455329396,0.14093290000000003,1612.2107115606925]
[719,null,"CHURCH BUTTES UNIT 79 FR","FRONTIER",2.0445530247279553,11193.303,22885.301505346495,0.13238478908931198,3029.6658130306096]
[720,null,"CHURCH BUTTES UNIT 8 FR","FRONTIER",2.0445530247279553,446.98800000000006,913.89066741709939,0.13238478908931198,120.98522325670326]
[721,null,"CHURCH BUTTES UNIT 81 DK","DAKOTA",2.0445530247279553,5120.7020000000002,10469.54676283049,0.13238478908931198,1386.0087400580035]
[722,null,"CHURCH BUTTES UNIT 82 DK","DAKOTA",2.0445530247279553,4592.4880000000003,9389.5852314268377,0.13238478908931198,1243.0382604985605]
[723,null,"CHURCH BUTTES UNIT 82 FR","DAKOTA",2.0445530247279553,18358.896000000001,37535.736347465958,0.13238478908931198,4969.1605396713021]
[724,null,"CHURCH BUTTES UNIT 89 FR","FRONTIER",2.0445530247279553,46848.048999999999,95783.320285553462,0.14093270000000002,13499.001942807823]
[725,null,"CHURCH BUTTES UNIT 9 DK","DAKOTA",2.0445530247279553,69208.497000000003,141500.44187822563,0.13238478908931198,18732.506154093346]
[726,null,"CHURCH BUTTES UNIT 90 DK","DAKOTA",2.0445530247279553,825.09400000000005,1686.9484333848877,0.13238478908931198,223.32631255820363]
[727,null,"CHURCH BUTTES UNIT 90 FR","FRONTIER",2.0445530247279553,96.994,198.3093760804633,0.13238478908931198,26.253144926845184]
[728,null,"CHURCH BUTTES UNIT 91 FR","FRONTIER",2.0445530247279553,22159.167999999998,45305.593959854908,0.13238478908931198,5997.7715009413987]
[729,null,"CHURCH BUTTES UNIT 92 FR","FRONTIER",2.0445530247279553,17555.732,35893.62496191336,0.13238478908931198,4751.7699702337641]
[730,null,"CHURCH BUTTES UNIT 93 FR","FRONTIER",2.0445530247279553,17178.486000000001,35122.325511546835,0.13238478908931198,4649.6616551722891]
[731,null,"CHURCH BUTTES UNIT 94 FR","FRONTIER",2.0445530247279553,19362.783999999996,39588.23859435405,0.13238478908931198,5240.8806167309212]
[732,null,"CHURCH BUTTES UNIT 95 DK","DAKOTA",2.0445530247279553,4064.5,8310.0857690067751,0.13238478908931198,1100.1289518440549]
[733,null,"CHURCH BUTTES UNIT 95 FR","FRONTIER",2.0445530247279553,24983.659000000003,51080.415577221807,0.13238478908931198,6762.2700427849149]
[734,null,"CHURCH BUTTES UNIT 96 FR","FRONTIER",2.0445530247279553,19700.445,40278.604413236724,0.13238478908931198,5332.2745500581741]
[735,null,"CHURCH BUTTES UNIT 98 DK","DAKOTA",2.0445530247279553,15927.551000000001,32564.722573558771,0.13238478908931198,4311.0739296525344]
[736,null,"CHURCH BUTTES UNIT 98 FR","FRONTIER",2.0445530247279553,4233.5509999999995,8655.7195023900586,0.13238478908931198,1145.8856007401523]
[737,null,"CHURCH BUTTES UNIT 99 FR","FRONTIER",2.0445530247279553,11066.893000000002,22626.849557490641,0.13238478908931198,2995.4507064239906]
[738,"CLAY BASIN (UT)","CLAY BASIN UNIT 12 FR","FRONTIER",1.8445530247279553,53862.104000000007,99351.506851411716,0.15491770000000005,15391.306932954949]
[739,null,"CLAY BASIN UNIT 13 FR","FRONTIER",1.8445530247279553,56057.051999999996,103400.20482393228,0.15491770000000005,16018.521910852498]
[740,null,"CLAY BASIN UNIT 14 FR","FRONTIER",1.8445530247279553,35646.504000000001,65751.866774177164,0.15491770000000005,10186.127971361948]
[741,null,"CLAY BASIN UNIT 15 FR","LANCE",1.8445530247279553,134312.815,247747.1091679763,0.15491770000000005,38380.412333951812]
[742,null,"CLAY BASIN UNIT 16 FR","FRONTIER",1.8445530247279553,22233.379000000001,41010.646484373006,0.15491770000000005,6353.2750288721536]
[743,null,"CLAY BASIN UNIT 17 FR","FRONTIER",1.8445530247279553,41597.344999999994,76728.508540402283,0.15491770000000005,11886.604067509483]
[744,null,"CLAY BASIN UNIT 19 FR","FRONTIER",1.8445530247279553,68099.641000000003,125613.39878943788,0.15491770000000005,19459.738829642505]
[745,null,"CLAY BASIN UNIT 20 FR","FRONTIER",1.8445530247279553,51366.376000000004,94748.004220113464,0.15491770000000005,14678.142893370275]
[746,null,"CLAY BASIN UNIT 22 FR","FRONTIER",1.8445530247279553,61836.835000000006,114061.32103885351,0.15491770000000005,17670.1175143008]
[747,null,"CLAY BASIN UNIT 23 FR","FRONTIER",1.8445530247279553,20431.163,37686.363510359886,0.15491770000000005,5838.2847563888818]
[748,null,"CLAY BASIN UNIT 61 FR","FRONTIER",1.8445530247279553,49534.554000000004,91369.111409250239,0.15491770000000005,14154.69259056481]
[749,null,"CLAY BASIN UNIT 62 FR","FRONTIER",1.8445530247279553,119560.33500000002,220535.37756173767,0.15491770000000005,34164.833460496018]
[750,null,"CLAY BASIN UNIT 7 FR","FRONTIER",1.8445530247279553,17976.385999999999,33158.397169977266,0.15491770000000005,5136.8226252593886]
[751,null,"CLAY BASIN UNIT 8 FR","FRONTIER",1.8445530247279553,53601.42300000001,98870.666924372606,0.15491770000000005,15316.816317389883]
[752,null,"CLAY BASIN UNIT 9 FR","FRONTIER",1.8445530247279553,48856.754000000001,90118.873369089633,0.15491770000000005,13961.008588930621]
[753,"DRY PINEY (WY)","DRY PINEY UNIT 1 FR","FRONTIER",1.8445530247279553,6577.2729999999992,12132.128806611512,0.13375006649997342,1622.6730346705331]
[754,null,"DRY PINEY UNIT 10 FR","FRONTIER",1.8445530247279553,13565.697999999997,25022.64927844597,0.13375006649997342,3346.7810049976606]
[755,null,"DRY PINEY UNIT 11 FR","FRONTIER",1.8445530247279553,15524.982,28636.652506947063,0.13375024338255648,3830.1592424658656]
[756,null,"DRY PINEY UNIT 13 FR","FRONTIER",1.8445530247279553,39261.176999999989,72419.322789729616,0.13375006649997342,9686.0892390093777]
[757,null,"DRY PINEY UNIT 14 FR","FRONTIER",1.8445530247279553,14321.839000000002,26417.391447116799,0.13375024338255648,3533.3325355841375]
[758,null,"DRY PINEY UNIT 17 BR","BEAR RIVER",1.8445530247279553,24616.597999999998,45406.620299412134,0.13375000000000004,6073.1354650463745]
[759,null,"DRY PINEY UNIT 22 FR","FRONTIER",1.8445530247279553,15827.855,29195.31781520549,0.13375006649997342,3904.875699271593]
[760,null,"DRY PINEY UNIT 23 BR","BEAR RIVER",1.8445530247279553,28577.067000000003,52711.915372703443,0.13375000000000004,7050.218681099087]
[761,null,"DRY PINEY UNIT 23 FR","FRONTIER",1.8445530247279553,1074.913,1982.7340254694006,0.13375024338255648,265.19115846940826]
[762,null,"DRY PINEY UNIT 26 BR","BEAR RIVER",1.8445530247279553,12986.556,23954.391150598978,0.13375000000000004,3203.899816392614]
[763,null,"DRY PINEY UNIT 29 FR","FRONTIER",1.8445530247279553,6548.9269999999997,12079.843106572574,0.13375024338255648,1615.6819555271791]
[764,null,"DRY PINEY UNIT 3 FR","FRONTIER",1.8445530247279553,8640.0600000000013,15937.048806831021,0.13375024338255648,2131.5841567133302]
[765,null,"DRY PINEY UNIT 31 FR","FRONTIER",1.8445530247279553,3553.2519999999995,6554.1617242206557,0.13375024338255648,876.62072578314871]
[766,null,"DRY PINEY UNIT 35 FR","FRONTIER",1.8445530247279553,63990.512000000002,118033.89246349053,0.13375024338255648,15787.061844382357]
[767,null,"DRY PINEY UNIT 6 FR","FRONTIER",1.8445530247279553,14690.191999999999,27096.838087434411,0.13375024338255648,3624.2086890920787]
[768,null,"DRY PINEY UNIT 8 FR","FRONTIER",1.8445530247279553,5656.8420000000006,10434.345021508138,0.13375024338255648,1395.59618616428]
[769,null,"DRY PINEY UNIT 9 FR","FRONTIER",1.8445530247279553,6618.5780000000013,12208.318069297904,0.13375024338255648,1632.8655130602567]
[770,null,"HOGSBACK ANNEX 12-2 FR","FRONTIER",1.8445530247279553,5398.1739999999991,9957.2181797078047,0.13375000000000004,1331.7779315359192]
[771,"E HIAW (CO)","F WILSON 32 LANCE","LANCE",1.8445530247279553,31109.864000000001,57383.793740075329,0.1925,11046.380294964501]
[772,null,"F WILSON 32 LEWIS","LEWIS",1.8445530247279553,27585.174999999999,50882.317983899971,0.1925,9794.8462119007454]
[773,null,"F WILSON 32 MESA","MESAVERDE",1.8445530247279553,3845.0790000000006,7092.4520997679429,0.1925,1365.297029205329]
[774,null,"F WILSON 33 FT UN","FORT UNION",1.8445530247279553,363190.30899999995,669923.78301783069,0.1925,128960.32823093241]
[775,null,"F WILSON 33 LANCE","LANCE",1.8445530247279553,17960.080999999998,33128.321732909077,0.1925,6377.2019335849973]
[776,null,"F WILSON 33 LEWIS","LEWIS",1.8445530247279553,17960.080999999998,33128.321732909077,0.1925,6377.2019335849973]
[777,null,"F WILSON 34 LEW/LAN/FT UN","LEWIS/LANCE/FT U",1.8445530247279553,25753.164000000004,47503.0765525151,0.16249999999999998,7719.2499397837028]
[778,null,"F WILSON 35 ALMOND","MESAVERDE",1.8445530247279553,1771.098,3266.8841729896321,0.1925,628.87520330050415]
[779,null,"F WILSON 35 LANCE","MESAVERDE",1.8445530247279553,60175.313000000002,110996.55560810145,0.1925,21366.836954559531]
[780,null,"F WILSON 35 LEWIS","MESAVERDE",1.8445530247279553,8930.76,16473.260371119435,0.1925,3171.1026214404915]
[781,null,"F WILSON 37 FT UN","FORT UNION",1.8445530247279553,18538.322000000004,34194.917918480809,0.16249999999999998,5556.6741617531306]
[782,null,"F WILSON 37 LANCE","FORT UNION",1.8445530247279553,12529.393000000002,23111.129756155275,0.16249999999999998,3755.5585853752318]
[783,null,"F WILSON 37 LEWIS","FORT UNION",1.8445530247279553,11525.572999999999,21259.530538872852,0.16249999999999998,3454.6737125668378]
[784,null,"F WILSON 37 MESA","FORT UNION",1.8445530247279553,7519.0439999999999,13869.275353262585,0.23250000000000004,3224.6065196335517]
[785,null,"F WILSON A 2 WAS","WASATCH",1.8445530247279553,94589.876999999993,174476.04372899525,0.1925,33586.638417831586]
[786,null,"F WILSON A 20 FT UN","FORT UNION",1.8445530247279553,10949.437,20196.817137418187,0.1925,3887.8872989530014]
[787,null,"F WILSON A 20 LEW/LAN/FT UN","LEWIS/LANCE/FT U",1.8445530247279553,208105.35900000003,383861.3694055471,0.1925,73893.313610567813]
[788,null,"F WILSON A 22 FT UN","FORT UNION",1.8445530247279553,46124.686000000002,85079.429075927183,0.1925,16377.790097115983]
[789,null,"F WILSON A 26 FT UN","FORT UNION",1.8445530247279553,86689.907000000007,159904.13017023515,0.1925,30781.545057770265]
[790,null,"F WILSON A 9 WAS","WASATCH",1.8445530247279553,74088.906000000003,136660.91566108516,0.1925,26307.226264758894]
[791,null,"F WILSON B 12 FT UN","FORT UNION",1.8445530247279553,42144.447,77737.667189337008,0.16249999999999998,12632.370918267263]
[792,null,"F WILSON B 24 FT UN","FORT UNION",1.8445530247279553,94013.175999999992,173412.28815508159,0.16249999999999998,28179.496825200757]
[793,null,"F WILSON B 25 FT UN","FORT UNION",1.8445530247279553,26699.869000000002,49249.324123790175,0.16249999999999998,8003.015170115902]
[794,null,"F WILSON B 3 WAS","WASATCH",1.8445530247279553,88832.450000000012,163856.16434149488,0.16249999999999998,26626.626705492912]
[795,null,"F WILSON B 6 FT UN","WASATCH",1.8445530247279553,98820.777999999977,182280.16496586974,0.16249999999999998,29620.526806953829]
[796,null,"G KUYKENDALL 9 FT UN","FORT UNION",1.8445530247279553,19287.561000000002,35576.928982174948,0.1925,6848.5588290686774]
[797,null,"G KUYKENDALL A 8 FT UN","FORT UNION",1.8445530247279553,4415.7030000000004,8144.9983249503075,0.1925,1567.9121775529343]
[798,null,"HIAWATHA UNIT 1 FT UN","FORT UNION",1.8445530247279553,36429.599000000002,67196.327025076505,0.1925,12935.292952327227]
[799,null,"HIAWATHA UNIT 2  FT UN","FORT UNION",1.8445530247279553,28792.597999999998,53109.473730676073,0.16249999999999998,8630.2894812348604]
[800,null,"STATE LAND 5  FT UN","FORT UNION",1.8445530247279553,21070.953999999998,38866.491934603604,0.13375000000000004,5198.3932962532335]
[801,null,"F WILSON 29-E (DD) FT UN","FORT UNION",1.8445530247279553,20444.678999999996,37711.294489042106,0.16249999999999998,6128.0853544693409]
[802,null,"KS WHITFORD 1   WAS","WASATCH",1.8445530247279553,41825.695999999996,77149.714068151938,0.15500000000000003,11958.205680563553]
[803,null,"HIAWATHA STATE LAND 4  WAS","WASATCH",1.8445530247279553,25462.611999999997,46967.137982074324,0.13749999999999996,6457.9814725352171]
[804,null,"STATE LAND 7 (HIAW) FT UN","FORT UNION",1.8445530247279553,24810.769000000004,45764.779004776596,0.13749999999999996,6292.6571131567798]
[805,null,"HIAWATHA STATE LAND 6   FT UN","FORT UNION",1.8445530247279553,13670.434000000001,25215.840384043884,0.13375000000000004,3372.6186513658704]
[806,null,"HIAWATHA STATE LAND 2  WAS","WASATCH",1.8445530247279553,19094.883999999998,35221.526039029435,0.13375000000000004,4710.8791077201886]
[807,null,"F WILSON B 23 WAS","WASATCH",1.8445530247279553,7.9979999999999993,14.752735091774186,0.1825,2.6923741542487889]
[808,"E HIAW (WY)","HIAWATHA UNIT 3 WAS","WASATCH",1.8445530247279553,4849.8380000000006,8945.7833523405789,0.1925,1722.0632953255615]
[809,null,"MW NEWBERGER 7 FT UN","FORT UNION",1.8445530247279553,42837.116000000009,79015.331888422312,0.1925,15210.451388521295]
[810,null,"MW NEWBERGER 8 FT UN","FORT UNION",1.8445530247279553,58271.035000000003,107484.01386327855,0.16249999999999998,17466.152252782762]
[811,null,"MW NEWBERGER A 1 WAS","FORT UNION",1.8445530247279553,421.916,778.24643398112005,0.1925,149.81243854136562]
[812,null,"MW NEWBERGER A 3 WAS","WASATCH",1.8445530247279553,25287.908999999996,46644.889034995278,0.1925,8979.1411392365917]
[813,null,"MW NEWBERGER A 6 FT UN","FORT UNION",1.8445530247279553,89678.377999999997,165416.52339259692,0.1925,31842.680753074907]
[814,null,"MW NEWBERGER B 4 WAS","WASATCH",1.8445530247279553,79632.472999999998,146886.31893871725,0.16249999999999998,23869.026827541551]
[815,null,"MW NEWBERGER C 5 FT UN","FORT UNION",1.8445530247279553,10311.739999999998,19020.551207208242,0.1925,3661.4561073875866]
[816,null,"MW NEWBERGER D 2 FT UN","FORT UNION",1.8445530247279553,5353.3769999999995,9874.5877378590667,0.16249999999999998,1604.6205074020982]
[817,null,"WW WILSON A 1 WAS","WASATCH",1.8445530247279553,137500.783,253627.48518511222,0.1925,48823.290898134102]
[818,null,"WW WILSON B 4 FT UN RECOMP","FORT UNION",1.8445530247279553,4801.4330000000009,8856.4977631786223,0.16249999999999998,1439.180886516526]
[819,null,"WW WILSON C 3 FT UN","FORT UNION",1.8445530247279553,8285.7300000000014,15283.468333579163,0.16249999999999998,2483.5636042066135]
[820,null,"HIAWATHA UNIT 6  FT UN","FORT UNION",1.8445530247279553,107532.55700000002,198349.50327108131,0.1925,38182.279379683154]
[821,null,"HIAWATHA UNIT 4 FT UN ","FORT UNION",1.8445530247279553,165220.72,304758.37882373057,0.1925,58665.987923568136]
[822,"FOGARTY CR (WY)","FOGARTY CREEK 1-32 FR","FRONTIER",1.8445530247279553,2406.2770000000005,4438.5055186833115,0.14120951073665619,626.75919269521887]
[823,"HIAW DEEP (CO)","HIAWATHA DEEP UNIT 1 NUGGET","NUGGET",1.8445530247279553,1980.3819999999998,3652.9196082167973,0.17239620835829686,629.74948989425116]
[824,null,"HIAWATHA DEEP UNIT 2 ENTRADA","NUGGET",1.8445530247279553,454.97899999999998,839.23289063770039,0.17239590299445887,144.68031200413631]
[825,null,"HIAWATHA DEEP UNIT 2 NUGGET","NUGGET",1.8445530247279553,454.97899999999998,839.23289063770039,0.17239590299445887,144.68031200413631]
[826,null,"HIAWATHA DEEP UNIT 3 NUGGET","NUGGET",1.8445530247279553,79760.489000000001,147122.45123873081,0.17149599576399291,25230.911274425631]
[827,"ISLAND (UT)","ISLAND UNIT 10 LOW WAS","LOWER WASATCH",1.8445530247279553,7112.0739999999996,13118.597608789047,0.13473270000000004,1767.5040760456925]
[828,null,"ISLAND UNIT 11 WAS","WASATCH",1.8445530247279553,3926.4719999999998,7242.5858041096235,0.13473270000000004,975.81314036936089]
[829,null,"ISLAND UNIT 12 WAS","LANCE",1.8445530247279553,3744.0820000000003,6906.157777929493,0.13473270000000004,930.48528404644128]
[830,null,"ISLAND UNIT 13 WAS","WASATCH",1.8445530247279553,16738.334000000003,30874.744608606779,0.13473270000000004,4159.8377029280355]
[831,null,"ISLAND UNIT 14 WAS","WASATCH",1.8445530247279553,12093.887999999999,22307.817691121119,0.13473270000000004,3005.5925086325151]
[832,null,"ISLAND UNIT 15 WAS","WASATCH",1.8445530247279553,10492.022000000001,19353.090915612254,0.13473270000000004,2607.4941924059121]
[833,null,"ISLAND UNIT 17 WAS","WASATCH",1.8445530247279553,1966.04,3626.4650287361492,0.13473270000000004,488.60342477719911]
[834,null,"ISLAND UNIT 18 WAS","WASATCH",1.8445530247279553,1670.1000000000001,3080.5880065981587,0.13473270000000004,415.05593971658783]
[835,null,"ISLAND UNIT 19 LWR WAS","WASATCH",1.8445530247279553,4235.4410000000007,7812.4955076067972,0.13473270000000004,1052.5986134777347]
[836,null,"ISLAND UNIT 21 WAS","WASATCH",1.8445530247279553,8232.1749999999993,15184.683296339854,0.13473270000000004,2045.8733791607692]
[837,null,"ISLAND UNIT 22 LWR WAS","WASATCH",1.8445530247279553,11926.349,21998.783121911227,0.13473270000000004,2963.9554467295297]
[838,null,"ISLAND UNIT 23 WAS","WASATCH",1.8445530247279553,7483.2759999999998,13803.299380674114,0.13473270000000004,1859.7557944665518]
[839,null,"ISLAND UNIT 24 WAS","WASATCH",1.8445530247279553,26097.809000000001,48138.792529722457,0.13473270000000004,6485.8694922693385]
[840,null,"ISLAND UNIT 25 WAS","WASATCH",1.8445530247279553,5790.1519999999991,10680.242385234618,0.13473270000000004,1438.9778932171007]
[841,null,"ISLAND UNIT 26 WAS","WASATCH",1.8445530247279553,19710.436000000002,36356.944342506788,0.13473270000000004,4898.4692750156655]
[842,null,"ISLAND UNIT 27 WAS","WASATCH",1.8445530247279553,25486.52,47011.237555789528,0.13473270000000004,6333.9509662329256]
[843,null,"ISLAND UNIT 3 WAS","WASATCH",1.8445530247279553,8126.3450000000003,14989.474249732897,0.13473270000000004,2019.5723372469881]
[844,null,"ISLAND UNIT 30 WAS","WASATCH",1.8445530247279553,19755.245999999999,36439.59876354484,0.13473270000000004,4909.6055283290589]
[845,null,"ISLAND UNIT 32 WAS","WASATCH",1.8445530247279553,20486.690000000002,37788.786006163959,0.13473270000000004,5091.3851683326884]
[846,null,"ISLAND UNIT 33 WAS","WASATCH",1.8445530247279553,12120.383,22356.689123511289,0.13473270000000004,3012.1770886713102]
[847,null,"ISLAND UNIT 34 WAS","WASATCH",1.8445530247279553,10215.842000000001,18843.662261242887,0.13473270000000004,2538.8574943453605]
[848,null,"ISLAND UNIT 35 WAS","WASATCH",1.8445530247279553,4572.0609999999997,8433.4089467907197,0.13473270000000004,1136.2559576052704]
[849,null,"ISLAND UNIT 36 WAS","FRONTIER",1.8445530247279553,11390.228999999999,21009.881354294073,0.13473270000000004,2830.7180415436978]
[850,null,"ISLAND UNIT 37 WAS","DAKOTA",1.8445530247279553,7753.7890000000007,14302.274953052349,0.13473270000000004,1926.9841205671166]
[851,null,"ISLAND UNIT 38 WAS","WASATCH",1.8445530247279553,10461.575000000003,19296.929809668363,0.13473270000000004,2599.9274549671054]
[852,null,"ISLAND UNIT 39 WAS","FRONTIER",1.8445530247279553,9625.1620000000003,17754.121680596578,0.13473270000000004,2392.0607501553154]
[853,null,"ISLAND UNIT 41 WAS","DAKOTA",1.8445530247279553,9356.7540000000008,17259.028892335398,0.13473270000000004,2325.3555620423581]
[854,null,"ISLAND UNIT 43 WAS","WASATCH",1.8445530247279553,3176.116,5858.5143746868544,0.13473270000000004,789.3334596903718]
[855,null,"ISLAND UNIT 44 WAS","WASATCH",1.8445530247279553,6939.9180000000006,12801.046738263984,0.13473270000000004,1724.7195898725004]
[856,null,"ISLAND UNIT 45 WAS","WASATCH",1.8445530247279553,1953.2670000000003,3602.9045529512996,0.13473270000000004,485.42905826142169]
[857,null,"ISLAND UNIT 47 WAS","WASATCH",1.8445530247279553,7767.9060000000009,14328.314508102434,0.13473270000000004,1930.4925001258134]
[858,null,"ISLAND UNIT 50 WAS","WASATCH",1.8445530247279553,16738.334000000003,30874.744608606779,0.13473270000000004,4159.8377029280355]
[859,null,"ISLAND UNIT 51 WAS","WASATCH",1.8445530247279553,18824.447,34722.690652681085,0.13473270000000004,4678.281862900486]
[860,null,"ISLAND UNIT 52 WAS","WASATCH",1.8445530247279553,6971.7520000000004,12859.766239253173,0.13473270000000004,1732.6310267834265]
[861,null,"ISLAND UNIT 53 WAS","WASATCH",1.8445530247279553,15898.061000000002,29324.816504859544,0.13473270000000004,3951.0117047042904]
[862,null,"ISLAND UNIT 54 WAS","WASATCH",1.8445530247279553,18540.255999999998,34198.485284030619,0.13473270000000004,4607.6542582277134]
[863,null,"ISLAND UNIT 55 WAS","WASATCH",1.8445530247279553,5827.2080000000005,10748.59414211894,0.13473270000000004,1448.1871099718689]
[864,null,"ISLAND UNIT 56 WAS","WASATCH",1.8445530247279553,9005.728000000001,16611.542822277243,0.13473270000000004,2238.1180156110336]
[865,null,"ISLAND UNIT 57 WAS","WASATCH",1.8445530247279553,12941.627,23871.517227750974,0.13473270000000004,3216.2739691914044]
[866,null,"ISLAND UNIT 58 WAS","WASATCH",1.8445530247279553,24029.475000000002,44323.640793874787,0.13473270000000004,5971.8437979888949]
[867,null,"ISLAND UNIT 59 WAS","WASATCH",1.8445530247279553,17083.158000000003,31510.790760805576,0.13473270000000004,4245.5339183383903]
[868,null,"ISLAND UNIT 60 WAS","WASATCH",1.8445530247279553,13980.103999999999,25787.043119211387,0.13473270000000004,3474.357944467773]
[869,null,"ISLAND UNIT 64 WAS","WASATCH",1.8445530247279553,12651.510999999999,23336.382882428996,0.13473270000000004,3144.1738739834423]
[870,null,"ISLAND UNIT 65 WAS","WASATCH",1.8445530247279553,10846.163,20006.322768342434,0.13473270000000004,2695.5058836502512]
[871,null,"ISLAND UNIT 66 WAS","WASATCH",1.8445530247279553,12650.014000000003,23333.621586550988,0.13473270000000004,3143.8018371342991]
[872,null,"ISLAND UNIT 67 WAS","WASATCH",1.8445530247279553,12442.779999999999,22951.367485024508,0.13473270000000004,3092.2997099495624]
[873,null,"ISLAND UNIT 68 WAS","WASATCH",1.8445530247279553,15997.871000000003,29508.921342257647,0.13473270000000004,3975.8166465299978]
[874,null,"ISLAND UNIT 69 WAS","WASATCH",1.8445530247279553,16175.385,29836.3553278892,0.13473270000000004,4019.9327114858984]
[875,null,"ISLAND UNIT 70 WAS","WASATCH",1.8445530247279553,16175.385,29836.3553278892,0.13473270000000004,4019.9327114858984]
[876,null,"ISLAND UNIT 71 WAS","WASATCH",1.8445530247279553,16172.235999999999,29830.546830414329,0.13473270000000004,4019.1501169381659]
[877,null,"ISLAND UNIT 72 WAS","WASATCH",1.8445530247279553,5392.8940000000002,9947.4789397372424,0.13473270000000004,1340.2506957439364]
[878,null,"ISLAND UNIT 73 WAS","WASATCH",1.8445530247279553,5080.2510000000002,9370.7923484272196,0.13473270000000004,1262.5521542429403]
[879,null,"ISLAND UNIT 74 WAS","WASATCH",1.8445530247279553,17096.755000000001,31535.871148282797,0.13473270000000004,4248.9130666602432]
[880,null,"ISLAND UNIT 75 WAS","WASATCH",1.8445530247279553,17325.737999999998,31958.24243354407,0.13473270000000004,4305.8202903259644]
[881,null,"ISLAND UNIT 76 WAS","WASATCH",1.8445530247279553,17330.402999999995,31966.847273404423,0.13473270000000004,4306.9796436334173]
[882,null,"ISLAND UNIT 77 WAS","WASATCH",1.8445530247279553,12229.663,22558.261878053563,0.13473270000000004,3039.335530137228]
[883,null,"ISLAND UNIT 78 WAS","WASATCH",1.8445530247279553,4075.2909999999997,7517.0903406966136,0.13473270000000004,1012.7978777459749]
[884,null,"ISLAND UNIT 79 WAS","WASATCH",1.8445530247279553,13817.837000000001,25487.733033547858,0.13473270000000004,3434.0310884890946]
[885,null,"ISLAND UNIT 80 WAS","WASATCH",1.8445530247279553,12088.837,22298.500853793219,0.13473270000000004,3004.3372259838666]
[886,null,"ISLAND UNIT 81 WAS","WASATCH",1.8445530247279553,16122.484,29738.776628328065,0.13473270000000004,4006.7856698315377]
[887,null,"ISLAND UNIT 82 WAS","WASATCH",1.8445530247279553,15543.967999999999,28671.673190674544,0.13473270000000004,3863.0119424971972]
[888,null,"ISLAND UNIT 83 WAS","WASATCH",1.8445530247279553,8080.3450000000003,14904.624810595411,0.13473270000000004,2008.1403432185089]
[889,null,"ISLAND UNIT 86 MESA","MESAVERDE",1.8445530247279553,8868.7000000000007,16358.787410404819,0.20545219999999997,3360.9488627999726]
[890,null,"ISLAND UNIT 86 WAS","WASATCH",1.8445530247279553,24201.644000000008,44641.215643589188,0.13473270000000004,6014.6315149430111]
[891,"JACKS DRAW (CO)","JACKS DRAW UNIT 17 FT UN","FORT UNION",1.8445530247279553,22834.745999999996,42119.899803194574,0.13968749999999996,5883.6235037587403]
[892,null,"JACKS DRAW UNIT 18 FT UN","FORT UNION",1.8445530247279553,92720.044000000009,171027.03761310913,0.13968769999999997,23890.373521988698]
[893,null,"JACKS DRAW UNIT 19 FT UN","FORT UNION",1.8445530247279553,2180.819,4022.6362828341948,0.15331303333841528,616.72257053847784]
[894,null,"JACKS DRAW UNIT 2 FT UN","FORT UNION",1.8445530247279553,56508.998999999996,104233.84502979899,0.13968749999999996,14560.165227600042]
[895,null,"JACKS DRAW UNIT 20 FT UN","FORT UNION",1.8445530247279553,29630.560999999998,54655.140916936187,0.13968769999999997,7634.6509278627054]
[896,null,"JACKS DRAW UNIT 3 FT UN","FORT UNION",1.8445530247279553,14995.817999999999,27660.581450169917,0.13968749999999996,3863.8374713206094]
[897,null,"JACKS DRAW UNIT 9 FT UN","FORT UNION",1.8445530247279553,35642.159999999996,65743.854035837736,0.13968749999999996,9183.5946106310821]
[898,"JOHNSON RDG (WY)","JOHNSON RIDGE 1 FT UN","FORT UNION",1.8445530247279553,16870.268000000004,31118.103867371239,0.125,3889.7629834214049]
[899,null,"JOHNSON RIDGE 12 TRANS","MESAVERDE",1.8445530247279553,24067.252999999997,44393.324318042949,0.18500000000000005,8212.7649988379471]
[900,null,"JOHNSON RIDGE 4 FT UN","FORT UNION",1.8445530247279553,18343.743999999999,33836.008480035278,0.125,4229.5010600044097]
[901,null,"JOHNSON RIDGE 6 MESA","MESAVERDE",1.8445530247279553,27893.121000000003,51450.340709652854,0.125,6431.2925887066067]
[902,null,"JOHNSON RIDGE 8 FT UN","FORT UNION",1.8445530247279553,23204.732999999997,42802.360443154597,0.125,5350.2950553943247]
[903,null,"JOHNSON RIDGE S 89-17 TRANS (PA)","MESAVERDE",1.8445530247279553,203.98400000000001,376.25930419610728,0.18500000000000005,69.607971276279869]
[904,null,"JOHNSON RIDGE 7 TRANS","FRONTIER",1.8445530247279553,2722.942,5022.610902258788,0.125,627.8263627823485]
[905,"KINNEY (WY)","KINNEY 13-1 FR","MESAVERDE",1.8445530247279553,59254.167000000001,109297.4529675854,0.16634007142238183,18180.546132912576]
[906,null,"KINNEY UNIT 18 MESA","MESAVERDE",1.8445530247279553,118224.90400000002,218072.1042713722,0.16001168927094148,34894.085787331154]
[907,null,"KINNEY UNIT 4 FR","FRONTIER",1.8445530247279553,128269.492,236599.87944891828,0.16647360277585296,39387.634348193918]
[908,null,"KINNEY UNIT 5 DK","DAKOTA",1.8445530247279553,8,14.756424197823643,0.17049203399779811,2.515852776021279]
[909,null,"PIONEER 3 MESA","MESAVERDE",1.8445530247279553,27202.018,50175.564580604288,0.16001200762674619,8028.6928223479499]
[910,null,"KINNEY UNIT 2 DK (NP)","DAKOTA",1.8445530247279553,27.013999999999999,49.828755410000987,0.17049203399779811,8.4954058614298553]
[911,"MID BAXTER (WY)","ES LAUZER A 1 FR","FRONTIER",1.8445530247279553,261.96000000000004,483.19911035773526,0.15000000000000002,72.479866553660301]
[912,null,"ES LAUZER B 2 DK","DAKOTA",1.8445530247279553,841.67499999999995,1552.5141670879018,0.15000000000000002,232.8771250631853]
[913,"NO BAXTER (WY)","GW CAPPERS B 3 DK","DAKOTA",1.8445530247279553,107,197.36717364589123,0.15000000000000002,29.605076046883688]
[914,null,"NORTH BAXTER 14-1 MORR","MORRISON",1.8445530247279553,1243.9559999999999,2294.5428024284884,0.15000000000000002,344.18142036427332]
[915,null,"OF FEATHERSTONE 1 DK","DAKOTA",1.8445530247279553,707.11200000000008,1304.3055784214341,0.17500000000000004,228.25347622375102]
[916,null,"TERESA LAURUNEN 1 FR","FRONTIER",1.8445530247279553,414.01799999999997,763.67815419181852,0.15500000000000003,118.37011389973189]
[917,null,"UP 11-19-104 A1 3 MORR","MORRISON",1.8445530247279553,169.00800000000001,311.7442176032223,0.15000000000000002,46.761632640483349]
[918,null,"UPRR 11-19-104 #1  DK","DAKOTA",1.8445530247279553,1203.7339999999999,2220.3511906678805,0.15000000000000002,333.05267860018211]
[919,null,"UPRR 35-20-104 1  DK","DAKOTA",1.8445530247279553,876.37499999999989,1616.5201570459617,0.15000000000000002,242.4780235568943]
[920,"PINEDALE (WY)","MESA 12A4-8 LANCE","LANCE",1.8445530247279553,135135.94600000003,249265.41794377367,0.21871569370647798,54518.258802607619]
[921,null,"MESA 4B2-16 LANCE","LANCE",1.8445530247279553,47060.136999999995,86804.918047461964,0.16146353402870528,14015.828839015348]
[922,null,"MESA UNIT 1 LANCE","LANCE",1.8445530247279553,26403.303,48702.2924114587,0.18802333333333335,9157.1673601771708]
[923,null,"MESA UNIT 10-16 LANCE","LANCE",1.8445530247279553,18732.536,34553.155939625314,0.16606118067763384,5737.9378714725763]
[924,null,"MESA UNIT 10-7D LANCE","LANCE",1.8445530247279553,45397.376000000004,83737.867215512291,0.21459404564900905,17969.647699796304]
[925,null,"MESA UNIT 10A1-16 LANCE","LANCE",1.8445530247279553,6124.067,11296.166308486656,0.15973186745092083,1804.3577394907481]
[926,null,"MESA UNIT 10A-16 LANCE","LANCE",1.8445530247279553,11756.632,21685.731116213472,0.17314277563908706,3754.727677224118]
[927,null,"MESA UNIT 10A2-16 LANCE","LANCE",1.8445530247279553,11523.159,21255.07778787116,0.15891728232064015,3377.7991975622886]
[928,null,"MESA UNIT 10B1-16 LANCE","LANCE",1.8445530247279553,3054.9169999999999,5634.9563926428509,0.15934556457447613,897.90530773822843]
[929,null,"MESA UNIT 10B1-7 LANCE","LANCE",1.8445530247279553,95884.399000000019,176863.85819967216,0.21923531136067373,38774.803020855172]
[930,null,"MESA UNIT 10B2-16 LANCE","LANCE",1.8445530247279553,18257.422000000002,33676.782973834721,0.16017168344014432,5394.067021767497]
[931,null,"MESA UNIT 10C2-16 LANCE","LANCE",1.8445530247279553,18600.724999999999,34310.023560882895,0.1605168577514294,5507.337171370431]
[932,null,"MESA UNIT 10C3-7 LANCE","LANCE",1.8445530247279553,87995.952000000019,162313.19942541601,0.21932752057727259,35599.751586940882]
[933,null,"MESA UNIT 10C4-16 LANCE","LANCE",1.8445530247279553,23149.505999999998,42700.491313257946,0.17855998309987034,7624.5990072514987]
[934,null,"MESA UNIT 10C4-7 LANCE","LANCE",1.8445530247279553,140923.06300000002,259940.06211057826,0.21763085554998193,56570.978108840587]
[935,null,"MESA UNIT 10D2-16 LANCE","LANCE",1.8445530247279553,21023.197,38778.401615801675,0.1771839574301742,6870.9106611044026]
[936,null,"MESA UNIT 10D4-16 LANCE","LANCE",1.8445530247279553,10317.689999999999,19031.526297705375,0.17564123670606832,3342.7208153330339]
[937,null,"MESA UNIT 11-16 LANCE","LANCE",1.8445530247279553,14643.830000000002,27011.320920101978,0.16253713216040649,4390.3426382177677]
[938,null,"MESA UNIT 11A-16D LANCE","LANCE",1.8445530247279553,7177.1790000000001,13238.687233463961,0.15598881469780587,2065.087129703018]
[939,null,"MESA UNIT 11B1-16 LANCE","LANCE",1.8445530247279553,25726.100000000006,47453.155569453862,0.16041605958495306,7612.2482313235578]
[940,null,"MESA UNIT 11B2-16 LANCE","LANCE",1.8445530247279553,22313.429,41158.302954002473,0.16064526514322411,6611.8864908908708]
[941,null,"MESA UNIT 11C2-16 LANCE","LANCE",1.8445530247279553,26479.242999999999,48842.367768156539,0.16130474217446553,7878.5055400329156]
[942,null,"MESA UNIT 11D1-16 LANCE","LANCE",1.8445530247279553,14490.315999999999,26728.156207063887,0.16130773545836821,4311.4583507390034]
[943,null,"MESA UNIT 11D2-16 LANCE","LANCE",1.8445530247279553,16006.949000000002,29525.666194616126,0.15862030005683414,4683.370031167934]
[944,null,"MESA UNIT 12-16 LANCE","LANCE",1.8445530247279553,17578.475999999999,32424.431075907767,0.1601988918589527,5194.3579275174134]
[945,null,"MESA UNIT 12-8 LANCE","LANCE",1.8445530247279553,54028.292000000001,99658.049429485196,0.2118612219351633,21113.676127805636]
[946,null,"MESA UNIT 12A-16 LANCE","LANCE",1.8445530247279553,14002.389000000003,25828.148983367457,0.15974326246146506,4125.87278194389]
[947,null,"MESA UNIT 12B1-16 LANCE","LANCE",1.8445530247279553,40062.667999999998,73897.715438071857,0.15885288079212032,11738.864981294058]
[948,null,"MESA UNIT 12B-16D LANCE","LANCE",1.8445530247279553,11787.532999999999,21742.72964923059,0.16178215508277546,3517.5856600346838]
[949,null,"MESA UNIT 12C2-16 LANCE","LANCE",1.8445530247279553,27835.596000000001,51344.23279690538,0.17814795909463726,9146.870284048633]
[950,null,"MESA UNIT 12C3-8 LANCE","LANCE",1.8445530247279553,145413.51800000001,268222.944463233,0.21896880707964608,58732.458180504291]
[951,null,"MESA UNIT 12D1-16 LANCE","LANCE",1.8445530247279553,16034.538000000002,29576.555568015345,0.16348451164052363,4835.308743045799]
[952,null,"MESA UNIT 12D2-16 LANCE","LANCE",1.8445530247279553,24866.888999999999,45868.295320524318,0.18474765965335066,8474.0602127556031]
[953,null,"MESA UNIT 13-05V LANCE","LANCE",1.8445530247279553,30341.187000000005,55965.928254686529,0.20475464566929127,11459.283809341317]
[954,null,"MESA UNIT 13-9D LANCE","LANCE",1.8445530247279553,23699.631000000001,43715.226045986419,0.17501400024029512,7650.7765817168229]
[955,null,"MESA UNIT 13A-16D LANCE","LANCE",1.8445530247279553,12315.856,22717.249436913939,0.16207701499726726,3681.9439776833615]
[956,null,"MESA UNIT 13A1-9 LANCE","LANCE",1.8445530247279553,41162.093000000001,75925.663147283398,0.17884088250596711,13578.612602110947]
[957,null,"MESA UNIT 13A2-9 LANCE","LANCE",1.8445530247279553,26965.83,49739.903290799841,0.1746395406611537,8686.553863235491]
[958,null,"MESA UNIT 13AA-16D LANCE","LANCE",1.8445530247279553,14811.13,27319.914641138959,0.1754845382200193,4794.2226050106146]
[959,null,"MESA UNIT 13B1-16 LANCE","LANCE",1.8445530247279553,53036.571000000004,97828.767459248964,0.17908837804037789,17519.995289966198]
[960,null,"MESA UNIT 13B1-9 LANCE","LANCE",1.8445530247279553,52695.182000000001,97199.057346690111,0.1773073165485036,17234.104029185739]
[961,null,"MESA UNIT 13B2-16 LANCE","LANCE",1.8445530247279553,21835.596000000001,40276.914648537648,0.18014543642253578,7255.7023671140387]
[962,null,"MESA UNIT 13C1-16 LANCE","LANCE",1.8445530247279553,33439.081000000006,61680.15800267311,0.18495113258938817,11407.815080886807]
[963,null,"MESA UNIT 13C2-16 LANCE","LANCE",1.8445530247279553,28652.463,52850.987292555823,0.17712108905794205,9361.0244270449439]
[964,null,"MESA UNIT 13C2-5 LANCE","LANCE",1.8445530247279553,127479.32200000001,235142.36898536902,0.20241841305925246,47597.14517301158]
[965,null,"MESA UNIT 13D1-16 LANCE","LANCE",1.8445530247279553,18378.025999999998,33899.243446829001,0.1756062868827854,5952.9202698332365]
[966,null,"MESA UNIT 13D1-5 LANCE","LANCE",1.8445530247279553,160151.87200000003,295408.61991344439,0.21682376229346673,64051.608383553728]
[967,null,"MESA UNIT 13D1-9 LANCE","LANCE",1.8445530247279553,26235.002,48391.852292843956,0.17994848034361852,8708.0402811101212]
[968,null,"MESA UNIT 13D2-9 LANCE","LANCE",1.8445530247279553,25452.074999999997,46947.701926852766,0.17755827280997685,8335.9528665295984]
[969,null,"MESA UNIT 14-16 LANCE","LANCE",1.8445530247279553,16464.659,30369.93655956435,0.16702222123805621,5072.4542630372889]
[970,null,"MESA UNIT 14-6D LANCE","LANCE",1.8445530247279553,118051.70000000001,217752.62030927718,0.21087100972050571,45917.714913903175]
[971,null,"MESA UNIT 14A-16D LANCE","LANCE",1.8445530247279553,14236.805,26260.541725212079,0.16990476815254588,4461.7912533824156]
[972,null,"MESA UNIT 14A2-16 LANCE","LANCE",1.8445530247279553,17930.88,33074.458940034005,0.17327562120691622,5730.9974189170362]
[973,null,"MESA UNIT 14B1-16 LANCE","LANCE",1.8445530247279553,15591.698,28759.713706544811,0.173422907174996,4987.5931605095811]
[974,null,"MESA UNIT 14B1-6 LANCE","LANCE",1.8445530247279553,83443.111000000019,153915.24278776057,0.2175211671697839,33479.82325641434]
[975,null,"MESA UNIT 14B-16D LANCE","LANCE",1.8445530247279553,4600.3379999999988,8485.5673726709501,0.16153743228329803,1370.7367648481968]
[976,null,"MESA UNIT 14B1-9 LANCE","LANCE",1.8445530247279553,46266.388999999996,85340.807773190187,0.17147017692816746,14633.403408061651]
[977,null,"MESA UNIT 14B2-9 LANCE","LANCE",1.8445530247279553,44835.83,82702.065842688404,0.18028720938024972,14910.124660759962]
[978,null,"MESA UNIT 14C1-16 LANCE","LANCE",1.8445530247279553,13136.040999999999,24230.124159500432,0.17146607506095693,4154.6442878692069]
[979,null,"MESA UNIT 14C1-9 LANCE","LANCE",1.8445530247279553,46271.475999999995,85350.191014426979,0.17447457362147334,14891.438185753452]
[980,null,"MESA UNIT 14C2-16 LANCE","LANCE",1.8445530247279553,11569.622000000001,21340.781255059097,0.17452689709603181,3724.5403340506236]
[981,null,"MESA UNIT 14C2-6 LANCE","LANCE",1.8445530247279553,132430.13100000002,244274.39870116941,0.21635717902083715,52850.519809996258]
[982,null,"MESA UNIT 14C2-9 LANCE","LANCE",1.8445530247279553,25845.716,47673.793624059712,0.1788077841686104,8524.4454008297434]
[983,null,"MESA UNIT 14D1-16 LANCE","LANCE",1.8445530247279553,10700.568000000001,19737.76507070717,0.17238788793584589,3402.5516331131207]
[984,null,"MESA UNIT 14D1-9 LANCE","LANCE",1.8445530247279553,12950.508,23887.898703163584,0.17877525146635012,4270.5650976607685]
[985,null,"MESA UNIT 15-06V LANCE","LANCE",1.8445530247279553,42063.109999999993,77587.636779964698,0.19257007611565097,14941.057120351283]
[986,null,"MESA UNIT 15-16 LANCE","LANCE",1.8445530247279553,17018.347999999998,31391.245279272945,0.16568682570714235,5201.1157853170516]
[987,null,"MESA UNIT 15A1-16 LANCE","LANCE",1.8445530247279553,16406.777000000002,30263.170141387054,0.17985397681021864,5442.9515008127282]
[988,null,"MESA UNIT 15A1-9 LANCE","LANCE",1.8445530247279553,41934.960999999996,77351.259154398838,0.17793548511053087,13763.533821548348]
[989,null,"MESA UNIT 15A1R-16 LANCE","LANCE",1.8445530247279553,33676.858,62118.750287233845,0.18111107465135354,11250.393620519997]
[990,null,"MESA UNIT 15A2-9 LANCE","LANCE",1.8445530247279553,19808.073000000004,36537.040966182154,0.18247319533204695,6667.0306130771578]
[991,null,"MESA UNIT 15B1-16 LANCE","LANCE",1.8445530247279553,9292.0930000000026,17139.758249203467,0.18091577485149929,3100.852644422022]
[992,null,"MESA UNIT 15B1-6 LANCE","LANCE",1.8445530247279553,183651.51900000003,338754.96486733359,0.21737860478951801,73638.081628383166]
[993,null,"MESA UNIT 15B2-9 LANCE","LANCE",1.8445530247279553,18262.394,33685.954091473664,0.17760710182525938,5982.8646784053763]
[994,null,"MESA UNIT 15C1-9 LANCE","LANCE",1.8445530247279553,7593.8870000000015,14007.327235292301,0.18003003032103088,2521.7395468862746]
[995,null,"MESA UNIT 15C2-16 LANCE","LANCE",1.8445530247279553,22138.141,40834.974943403962,0.17955864802179736,7332.2728928415863]
[996,null,"MESA UNIT 15C2-9 LANCE","LANCE",1.8445530247279553,13447.557000000001,24804.731939551591,0.1773400464424445,4398.8723141524661]
[997,null,"MESA UNIT 15D2-16 LANCE ","LANCE",1.8445530247279553,29444.604999999996,54312.13521466987,0.181607177185064,9863.4735632297052]
[998,null,"MESA UNIT 15D2-9 LANCE","LANCE",1.8445530247279553,31339.065000000006,57806.567137896011,0.17658387953188459,10207.707887630027]
[999,null,"MESA UNIT 16-6D LANCE","LANCE",1.8445530247279553,68255.17300000001,125900.28581047989,0.19656010805424268,24746.973782967965]
[1000,null,"MESA UNIT 16B2-6 LANCE","LANCE",1.8445530247279553,73917.377999999997,136344.5231698596,0.21657617370610627,29528.975133911743]
[1001,null,"MESA UNIT 16D3-6 LANCE","LANCE",1.8445530247279553,72580.076000000001,133877.79872078489,0.19963114081587774,26726.177688548745]
[1002,null,"MESA UNIT 1-7D LANCE","LANCE",1.8445530247279553,71391.091,131684.65284267871,0.19427508367142873,25583.046949254451]
[1003,null,"MESA UNIT 1A3-16 LANCE","LANCE",1.8445530247279553,27234.535,50235.543911309367,0.17255303114420653,8668.2953730743193]
[1004,null,"MESA UNIT 1A-7D LANCE","LANCE",1.8445530247279553,39121.815999999999,72162.264035650514,0.19935842349779073,14386.155194178609]
[1005,null,"MESA UNIT 1B1-16 LANCE","LANCE",1.8445530247279553,32199.905999999999,59394.434008255834,0.17446914498318469,10362.496118180583]
[1006,null,"MESA UNIT 1B4-16 LANCE","LANCE",1.8445530247279553,28419.873,52421.962704534351,0.17942690771833328,9405.9106646003947]
[1007,null,"MESA UNIT 1C2-16 LANCE","LANCE",1.8445530247279553,38111.869000000006,70299.3632419856,0.17500754685234401,12302.919106261745]
[1008,null,"MESA UNIT 1C3-7 LANCE","LANCE",1.8445530247279553,119669.274,220736.32132369847,0.20444660869826992,45128.792311161757]
[1009,null,"MESA UNIT 1D1-7 LANCE","LANCE",1.8445530247279553,137076.94,252845.68429745245,0.2033065679828753,51405.18830379664]
[1010,null,"MESA UNIT 1D2-16 LANCE","LANCE",1.8445530247279553,36495.307999999997,67317.530759778339,0.1746312097723268,11755.741835465913]
[1011,null,"MESA UNIT 2 LANCE","LANCE",1.8445530247279553,1718.297,3169.4899287309713,0.19807338666666668,627.79160418963556]
[1012,null,"MESA UNIT 2-16D LANCE","LANCE",1.8445530247279553,7571.3970000000008,13965.843237766168,0.1605199381248949,2241.7962923882073]
[1013,null,"MESA UNIT 2-7D LANCE","LANCE",1.8445530247279553,71874.820000000007,132576.91663277734,0.19928023737952127,26419.959417624872]
[1014,null,"MESA UNIT 2A1-16 LANCE","LANCE",1.8445530247279553,10788.061,19899.150548499689,0.18576902538013132,3696.6458032872929]
[1015,null,"MESA UNIT 2A1-7 LANCE","LANCE",1.8445530247279553,182225.486,336124.57138382166,0.19874443502353759,66802.888037206372]
[1016,null,"MESA UNIT 2A2-16 LANCE","LANCE",1.8445530247279553,11270.426000000001,20788.898368272592,0.18216038388072869,3786.9137072219896]
[1017,null,"MESA UNIT 2A-7D LANCE","LANCE",1.8445530247279553,73906.646999999997,136324.72927135127,0.1923927910503688,26227.895153701182]
[1018,null,"MESA UNIT 2B1-16 LANCE","LANCE",1.8445530247279553,12178.002,22462.970424243089,0.16378275134862583,3679.047099545342]
[1019,null,"MESA UNIT 2B1-7 LANCE","LANCE",1.8445530247279553,150173.587,277003.14413509675,0.19329425074275877,53543.115198981941]
[1020,null,"MESA UNIT 2B2-16 LANCE","LANCE",1.8445530247279553,5138.1409999999996,9477.573523028721,0.16524612513966322,1566.1323004067629]
[1021,null,"MESA UNIT 2C2-16 LANCE","LANCE",1.8445530247279553,21236.491999999998,39171.835553211022,0.1846830045537258,7234.3722838514695]
[1022,null,"MESA UNIT 2C3-7 LANCE","LANCE",1.8445530247279553,86763.642000000007,160040.13828751349,0.2053675638987626,32867.053326127731]
[1023,null,"MESA UNIT 2D1-16 LANCE","LANCE",1.8445530247279553,38008.934000000008,70109.49417638524,0.17476110517478244,12252.412685510059]
[1024,null,"MESA UNIT 3 LANCE","LANCE",1.8445530247279553,18352.442999999996,33852.054246797386,0.15630809883457225,5291.3502409617067]
[1025,null,"MESA UNIT 3-16D LANCE","LANCE",1.8445530247279553,28751.281999999999,53033.264177906414,0.16404507072891669,8699.8455730499809]
[1026,null,"MESA UNIT 3-7 LANCE","LANCE",1.8445530247279553,39748.667000000001,73318.523943754262,0.20456547539449055,14998.438705776429]
[1027,null,"MESA UNIT 3A1-16 LANCE","LANCE",1.8445530247279553,13618.653999999999,25120.329428423465,0.16242437749182945,4080.1538698013651]
[1028,null,"MESA UNIT 3A1-7 LANCE","LANCE",1.8445530247279553,114794.98400000003,211745.43496079728,0.21758360241981484,46072.334534720874]
[1029,null,"MESA UNIT 3A2-16 LANCE","LANCE",1.8445530247279553,24841.843000000001,45822.096645466983,0.16133210813105556,7392.5754507981574]
[1030,null,"MESA UNIT 3B1-16 LANCE","LANCE",1.8445530247279553,16214.962000000001,29909.357202948861,0.16474805156609976,4927.5083227803161]
[1031,null,"MESA UNIT 3B2-7 LANCE","LANCE",1.8445530247279553,88179.258999999976,162651.31890671974,0.21760727923573428,35394.110971395028]
[1032,null,"MESA UNIT 3C1-16 LANCE","LANCE",1.8445530247279553,36523.515000000007,67369.560066946855,0.1605237947686223,10814.417433838949]
[1033,null,"MESA UNIT 3C4-7 LANCE","LANCE",1.8445530247279553,105440.70800000001,194490.97687085715,0.21540014381022629,41893.384387774022]
[1034,null,"MESA UNIT 3D1-16 LANCE","LANCE",1.8445530247279553,24563.516000000003,45308.707735753531,0.18169261896901806,8232.2577706108677]
[1035,null,"MESA UNIT 3D2-16 LANCE","LANCE",1.8445530247279553,25068.082000000002,46239.406477228418,0.18307121068301388,8465.1041250502003]
[1036,null,"MESA UNIT 3D4-7 LANCE","LANCE",1.8445530247279553,99139.298999999999,182867.69383985916,0.21847254238098046,39951.56999254079]
[1037,null,"MESA UNIT 4-16D LANCE","LANCE",1.8445530247279553,27290.155999999999,50338.139795097755,0.1584657683911174,7976.8720020096507]
[1038,null,"MESA UNIT 4-8 LANCE","LANCE",1.8445530247279553,57028.851999999999,105192.74145336291,0.19599672780504607,20617.433113701354]
[1039,null,"MESA UNIT 4A1-16 LANCE","LANCE",1.8445530247279553,37278.587,68762.330408434238,0.16059466326365102,11042.863297166406]
[1040,null,"MESA UNIT 4A2-16 LANCE","LANCE",1.8445530247279553,44933.436000000002,82882.105285220008,0.16010046201487066,13269.463348928877]
[1041,null,"MESA UNIT 4A2-8 LANCE","LANCE",1.8445530247279553,168395.66400000002,310614.7313822725,0.21890757982433445,67995.919104679022]
[1042,null,"MESA UNIT 4B1-16 LANCE","LANCE",1.8445530247279553,49699.597999999991,91673.543818663427,0.1603223157655678,14697.314839444374]
[1043,null,"MESA UNIT 4C1-16 LANCE","LANCE",1.8445530247279553,18979.445,35008.592682407871,0.15958891047025414,5586.9831632823843]
[1044,null,"MESA UNIT 4C2-16 LANCE","LANCE",1.8445530247279553,28707.632999999998,52952.751282930061,0.17266711947950014,9143.1990325379393]
[1045,null,"MESA UNIT 4D1-16 LANCE","LANCE",1.8445530247279553,20557.087,37918.637005445729,0.15917334094312435,6035.6361361663849]
[1046,null,"MESA UNIT 4D-16D LANCE","LANCE",1.8445530247279553,27172.117999999999,50120.412445164919,0.15967293202475283,8002.8732094093939]
[1047,null,"MESA UNIT 4D1-8 LANCE","LANCE",1.8445530247279553,75370.837,139025.50536462769,0.20782367996478848,28892.792133841369]
[1048,null,"MESA UNIT 5-8 LANCE","LANCE",1.8445530247279553,23763.558999999997,43833.144631751224,0.20719855424441661,9082.1641956852636]
[1049,null,"MESA UNIT 5A-16D LANCE","LANCE",1.8445530247279553,10192.126,18799.916841708437,0.15794572419634748,2969.3664803947486]
[1050,null,"MESA UNIT 5A2-16 LANCE","LANCE",1.8445530247279553,20800.497000000003,38367.619657194766,0.15911708033041702,6104.9436190807464]
[1051,null,"MESA UNIT 5B1-16 LANCE","LANCE",1.8445530247279553,27082.432999999997,49954.983707142186,0.15798687529184152,7892.2317811462481]
[1052,null,"MESA UNIT 5B1-8 LANCE","LANCE",1.8445530247279553,69471.423999999999,128143.72527135827,0.19729497019716721,25282.112458366613]
[1053,null,"MESA UNIT 5B2-16 LANCE","LANCE",1.8445530247279553,28549.06,52660.254976139884,0.15943483936688191,8395.8792931399057]
[1054,null,"MESA UNIT 5B3-8 LANCE","LANCE",1.8445530247279553,94242.936000000016,173836.09265804314,0.21648465551502374,37632.846635154216]
[1055,null,"MESA UNIT 5C2-16 LANCE","LANCE",1.8445530247279553,19317.577999999998,35632.296930318204,0.15789094556434755,5626.0170549575396]
[1056,null,"MESA UNIT 5C3-8 LANCE","LANCE",1.8445530247279553,117165.484,216117.94790591486,0.2187330968654497,47272.148033666686]
[1057,null,"MESA UNIT 5C4-8 LANCE","LANCE",1.8445530247279553,98270.388999999996,181264.94327114278,0.21651056864681806,39245.775943368339]
[1058,null,"MESA UNIT 5D1-16 LANCE","LANCE",1.8445530247279553,21792.727999999999,40197.842349473605,0.16025139484512829,6441.7603062677144]
[1059,null,"MESA UNIT 5D2-16 LANCE","LANCE",1.8445530247279553,2875.3429999999998,5303.7226277803529,0.16005531480111326,848.88899480717203]
[1060,null,"MESA UNIT 5D4-8 LANCE","LANCE",1.8445530247279553,95455.862000000008,176073.39898011432,0.21785248364017676,38358.027270785671]
[1061,null,"MESA UNIT 6 LANCE","LANCE",1.8445530247279553,3032.5299999999997,5593.6623840782659,0.17636500160130178,986.52627532510485]
[1062,null,"MESA UNIT 6-16 LANCE","LANCE",1.8445530247279553,2585.9840000000004,4769.9846090980973,0.20850189518186457,994.55083098527871]
[1063,null,"MESA UNIT 6-7D LANCE","LANCE",1.8445530247279553,28046.026000000002,51732.382089898885,0.21336936707095838,11038.105623594709]
[1064,null,"MESA UNIT 6A1-16 LANCE","LANCE",1.8445530247279553,10773.615000000002,19872.504135504474,0.162176954883126,3222.8622065984441]
[1065,null,"MESA UNIT 6A-16D LANCE","LANCE",1.8445530247279553,28785.974999999999,53097.257255993303,0.1577039958484692,8373.6496378642696]
[1066,null,"MESA UNIT 6A1-7 LANCE","LANCE",1.8445530247279553,63671.897999999994,117446.19204606985,0.22138067536401507,26000.317314090757]
[1067,null,"MESA UNIT 6B1-16 LANCE","LANCE",1.8445530247279553,31172.402000000002,57499.148397135767,0.16114606926923458,9265.761750526839]
[1068,null,"MESA UNIT 6B2-7 LANCE","LANCE",1.8445530247279553,48976.220999999998,90339.236585294799,0.21020574870467948,18989.826863821065]
[1069,null,"MESA UNIT 6B3-16 LANCE","LANCE",1.8445530247279553,15868.308999999999,29269.937363267836,0.1759151494169669,5149.0254046845239]
[1070,null,"MESA UNIT 6B3-7 LANCE","LANCE",1.8445530247279553,56149.679000000004,103571.06023695377,0.22034058873752044,22820.908388779586]
[1071,null,"MESA UNIT 6C2-7 LANCE","LANCE",1.8445530247279553,100643.91399999999,185643.03598916018,0.21378807397822244,39688.267111592388]
[1072,null,"MESA UNIT 6D2-16 LANCE","LANCE",1.8445530247279553,24434.466,45070.668167912387,0.15816184986510651,7128.460252093394]
[1073,null,"MESA UNIT 6D2-7 LANCE","LANCE",1.8445530247279553,87588.714000000007,161562.02734073182,0.22039845845233072,35608.021770330604]
[1074,null,"MESA UNIT 6D3-16 LANCE","LANCE",1.8445530247279553,23543.920999999998,43428.010694506025,0.16022280630141666,6958.1577455616907]
[1075,null,"MESA UNIT 6D3-7 LANCE","LANCE",1.8445530247279553,80004.594999999987,147572.71769938502,0.22015471481282736,32488.82957926199]
[1076,null,"MESA UNIT 7-16D LANCE","LANCE",1.8445530247279553,23642.071999999996,43609.055418436095,0.1599278055266701,6974.3005341614271]
[1077,null,"MESA UNIT 7-7V LANCE","LANCE",1.8445530247279553,22060.042000000001,40690.917196725735,0.19589471514884155,7971.1356333976855]
[1078,null,"MESA UNIT 7A2-16 LANCE","LANCE",1.8445530247279553,21979.621000000003,40542.576397924095,0.16007342292277119,6489.7889781236645]
[1079,null,"MESA UNIT 7A2-7 LANCE","LANCE",1.8445530247279553,81901.728000000003,151072.08011284628,0.20520109711792786,31000.156583043547]
[1080,null,"MESA UNIT 7B1-16 LANCE","LANCE",1.8445530247279553,12331.986999999999,22747.003921755822,0.16181508201595257,3680.8083052161132]
[1081,null,"MESA UNIT 7B2-16 LANCE","LANCE",1.8445530247279553,22802.368000000002,42060.176865359943,0.15867002087459195,6673.689141215692]
[1082,null,"MESA UNIT 7B4-7 LANCE","LANCE",1.8445530247279553,95003.494999999995,175238.98406197719,0.20268416360703809,35518.166915948925]
[1083,null,"MESA UNIT 7C-16D LANCE","LANCE",1.8445530247279553,16831.126,31045.904372877332,0.15735119738488698,4885.1102269689472]
[1084,null,"MESA UNIT 7C1-7 LANCE","LANCE",1.8445530247279553,68908.23,127104.88407514963,0.20316124694850007,25822.78674195195]
[1085,null,"MESA UNIT 7C2-16 LANCE","LANCE",1.8445530247279553,16210.981999999998,29902.015881910436,0.15910847331523956,4757.6640960188161]
[1086,null,"MESA UNIT 7C3-7 LANCE","LANCE",1.8445530247279553,98460.091,181614.85866903974,0.20318503196886212,36901.420864689215]
[1087,null,"MESA UNIT 7D1-16 LANCE","LANCE",1.8445530247279553,17883.911,32987.822129015556,0.15996689584756185,5276.9595067501277]
[1088,null,"MESA UNIT 7D2-16 LANCE","LANCE",1.8445530247279553,22575.004999999997,41640.793755998711,0.15960687091275752,6646.1567937184454]
[1089,null,"MESA UNIT 7D3-7 LANCE","LANCE",1.8445530247279553,86604.055999999997,159745.77344850922,0.19965053031913899,31893.328385235898]
[1090,null,"MESA UNIT 7D4-7 LANCE","LANCE",1.8445530247279553,73603.929000000004,135766.34986881167,0.20109390214985917,27301.78507576236]
[1091,null,"MESA UNIT 8-17 LANCE","LANCE",1.8445530247279553,36219.735000000001,66809.221749094984,0.1657145062919787,11071.257197902602]
[1092,null,"MESA UNIT 8-7D LANCE","LANCE",1.8445530247279553,31358.661,57842.712998968571,0.19820366324668995,11464.637608522502]
[1093,null,"MESA UNIT 8A1-16 LANCE","LANCE",1.8445530247279553,10990.705000000002,20272.938151642666,0.18261355933738635,3702.1133940981613]
[1094,null,"MESA UNIT 8A1-17 LANCE","LANCE",1.8445530247279553,33694.023999999998,62150.413884456313,0.17026424616129807,10581.993368649626]
[1095,null,"MESA UNIT 8A2-7 LANCE","LANCE",1.8445530247279553,121524.019,224157.49682354752,0.20290504819611141,45482.687696501598]
[1096,null,"MESA UNIT 8B1-16 LANCE","LANCE",1.8445530247279553,30290.916000000005,55873.200729580429,0.17738547087789572,9911.0940208718112]
[1097,null,"MESA UNIT 8B1-17 LANCE","LANCE",1.8445530247279553,34130.251000000004,62955.057716774332,0.17136267377295025,10788.147017876854]
[1098,null,"MESA UNIT 8B3-7 LANCE","LANCE",1.8445530247279553,67219.326000000015,123989.61109347452,0.22149869077492243,27463.536526896405]
[1099,null,"MESA UNIT 8C1-16 LANCE","LANCE",1.8445530247279553,26974.554000000004,49755.995171387571,0.17546622337055384,8730.4965627668898]
[1100,null,"MESA UNIT 8C2-16 LANCE","LANCE",1.8445530247279553,39890.403000000006,73579.963511267109,0.18403300870464531,13541.142065356504]
[1101,null,"MESA UNIT 8C2-17 LANCE","LANCE",1.8445530247279553,33418.303,61641.831879925303,0.17430848173523572,10744.694126368431]
[1102,null,"MESA UNIT 8C4-7 LANCE","LANCE",1.8445530247279553,96700.064000000013,178368.39554258689,0.22558787886096027,40237.748006284935]
[1103,null,"MESA UNIT 8D1-16 LANCE","LANCE",1.8445530247279553,45261.029999999992,83486.369788802709,0.17622084113564307,14712.038307544153]
[1104,null,"MESA UNIT 8D1-17 LANCE","LANCE",1.8445530247279553,23035.303999999996,42489.83966872796,0.1761550632397326,7484.8003938908723]
[1105,null,"MESA UNIT 8D2-17 LANCE","LANCE",1.8445530247279553,17207.965000000004,31741.003890162796,0.17607947581382705,5588.9393267845098]
[1106,null,"MESA UNIT 8D4-7 LANCE","LANCE",1.8445530247279553,92678.22,170949.89102740289,0.22145203923000822,37857.201974166055]
[1107,null,"MESA UNIT 9-16 LANCE","LANCE",1.8445530247279553,18963.852999999999,34979.832411646312,0.17200788427431893,6016.806965397529]
[1108,null,"MESA UNIT 9-17D LANCE","LANCE",1.8445530247279553,15363.976000000001,28339.668402647712,0.16606230071798228,4706.1505365283847]
[1109,null,"MESA UNIT 9-7 LANCE","LANCE",1.8445530247279553,33685.763999999996,62135.177876472058,0.19640335556318378,12203.557433454413]
[1110,null,"MESA UNIT 9A1-16 LANCE","LANCE",1.8445530247279553,17746.146000000001,32733.707281563908,0.1785189757718422,5843.5878971200818]
[1111,null,"MESA UNIT 9A2-16 LANCE","LANCE",1.8445530247279553,38236.132999999994,70528.574779050381,0.18022936255530966,12711.32007436274]
[1112,null,"MESA UNIT 9A2-17 LANCE","LANCE",1.8445530247279553,32888.834999999999,60665.20007902864,0.17748195154366289,10766.978100812776]
[1113,null,"MESA UNIT 9B1-16 LANCE","LANCE",1.8445530247279553,30684.715000000007,56599.583866165274,0.17680775301784224,10007.245245121598]
[1114,null,"MESA UNIT 9B1-17 LANCE","LANCE",1.8445530247279553,27981.443000000003,51613.255321902878,0.17081384119628421,8816.2583981787884]
[1115,null,"MESA UNIT 9B2-16 LANCE","LANCE",1.8445530247279553,24468.237000000005,45132.96056811048,0.18173543231766565,8202.2581006217151]
[1116,null,"MESA UNIT 9B3-17 LANCE","LANCE",1.8445530247279553,26978.143,49762.615272193318,0.17069027599668987,8493.9945351277711]
[1117,null,"MESA UNIT 9B3-7 LANCE","LANCE",1.8445530247279553,103418.683,190761.24454103157,0.21921202070177895,41817.157887425732]
[1118,null,"MESA UNIT 9B-7D LANCE","LANCE",1.8445530247279553,66168.552999999985,122051.404578022,0.20871669522772118,25474.165811426312]
[1119,null,"MESA UNIT 9C1-17 LANCE","LANCE",1.8445530247279553,41035.144999999997,75691.500829900222,0.17544098695610069,13279.391609786209]
[1120,null,"MESA UNIT 9C2-16 LANCE","LANCE",1.8445530247279553,11752.723000000002,21678.520758439812,0.1831777010835611,3971.0215954232622]
[1121,null,"MESA UNIT 9C3-7 LANCE","LANCE",1.8445530247279553,90214.267999999996,166405.00091301839,0.21870354650134921,36393.363855237374]
[1122,null,"MESA UNIT 9C4-7 LANCE","LANCE",1.8445530247279553,80835.421000000002,149105.22031070769,0.21752568021099888,32434.214471097537]
[1123,null,"MESA UNIT 9D1-16 LANCE","LANCE",1.8445530247279553,31569.216000000004,58231.092861090168,0.17902400799732002,10424.763634056491]
[1124,null,"MESA UNIT 9D2-16 LANCE","LANCE",1.8445530247279553,19048.334000000003,35135.662095728359,0.17950338988222725,6306.9704519397219]
[1125,null,"MESA UNIT 9D2-17 LANCE","LANCE",1.8445530247279553,30067.223999999998,55460.588974372971,0.17757560810749098,9848.4478131238902]
[1126,null,"MESA UNIT 9D3-7 LANCE","LANCE",1.8445530247279553,112081.16,206739.64269301793,0.22373373602390098,46254.632643955279]
[1127,null,"STEWART POINT 10A2-20 LANCE","MESAVERDE",1.8445530247279553,252062.91400000005,464943.41044044256,0.20794450000000006,96682.425012332635]
[1128,null,"STEWART POINT 10B2-20 LANCE","MESAVERDE",1.8445530247279553,282348.11100000003,520806.06217127456,0.20794450000000006,108298.75619517463]
[1129,null,"STEWART POINT 10D3-20 LANCE","LANCE",1.8445530247279553,111676.251,205992.76657232834,0.20794450000000006,42835.062848499547]
[1130,null,"STEWART POINT 11A4-20 LANCE","LANCE",1.8445530247279553,297057.18900000001,547937.73648713389,0.20794450000000006,113940.63864494885]
[1131,null,"STEWART POINT 11D3-20 LANCE","LANCE",1.8445530247279553,234418.38100000005,432397.13372538035,0.20794450000000006,89914.605773957373]
[1132,null,"STEWART POINT 1-20D LANCE","LANCE",1.8445530247279553,79871.580000000016,147327.36447880088,0.20794450000000006,30635.915142862017]
[1133,null,"STEWART POINT 13C3-20 LANCE","LANCE",1.8445530247279553,29683.811000000002,54753.363365502955,0.20794450000000006,11385.660768357833]
[1134,null,"STEWART POINT 14-20 LANCE","LANCE",1.8445530247279553,43896.344999999994,80969.135944251844,0.20794450000000006,16837.086489359481]
[1135,null,"STEWART POINT 14B4-20 LANCE","LANCE",1.8445530247279553,205359.94700000004,378797.31139682268,0.20794450000000006,78768.817519756616]
[1136,null,"STEWART POINT 14D2-20 LANCE","MESAVERDE",1.8445530247279553,177799.95599999998,327961.44663629733,0.20794450000000006,68197.779040061549]
[1137,null,"STEWART POINT 15-20D LANCE","LANCE",1.8445530247279553,51680.028000000006,95326.551965425431,0.20794450000000006,19822.632185174414]
[1138,null,"STEWART POINT 15B3-20 LANCE","LANCE",1.8445530247279553,113391.09300000002,209155.88357035891,0.20794450000000006,43492.815631096513]
[1139,null,"STEWART POINT 15D3-20 LANCE","LANCE",1.8445530247279553,166095.93900000001,306372.76667747996,0.20794450000000006,63708.531780365251]
[1140,null,"STEWART POINT 16A1-20 LANCE","LANCE",1.8445530247279553,126661.298,233633.48034186891,0.20794450000000006,48582.797252949771]
[1141,null,"STEWART POINT 16A2-20 LANCE","LANCE",1.8445530247279553,177465.94700000001,327345.34932506102,0.20794450000000006,68069.664992725171]
[1142,null,"STEWART POINT 16B3-20 LANCE","LANCE",1.8445530247279553,192376.552,354848.7508783348,0.20794450000000006,73788.846077019916]
[1143,null,"STEWART POINT 16D4-20 LANCE","LANCE",1.8445530247279553,231139.87400000001,426349.75372193853,0.20794450000000006,88657.086362831673]
[1144,null,"STEWART POINT 1A3-29 LANCE","LANCE",1.8445530247279553,307469.96999999997,567144.66317651363,0.20794450000000006,117934.61341190858]
[1145,null,"STEWART POINT 1B2-29 LANCE","LANCE",1.8445530247279553,401508.85499999998,740604.37294530799,0.20794450000000006,154004.60602992564]
[1146,null,"STEWART POINT 1C3-20 LANCE","LANCE",1.8445530247279553,37373.808000000005,68937.97059200186,0.20794450000000006,14335.271825768536]
[1147,null,"STEWART POINT 1C3-29 LANCE","MESAVERDE",1.8445530247279553,332411.72700000001,613151.05649289337,0.20794450000000006,127501.3898668865]
[1148,null,"STEWART POINT 1C4-20 LANCE","LANCE",1.8445530247279553,27012.576999999997,49826.130611046792,0.20794450000000006,10361.069816848823]
[1149,null,"STEWART POINT 1D3-20 LANCE","LANCE",1.8445530247279553,32192.442999999996,59380.668109032282,0.20794450000000006,12347.883339598668]
[1150,null,"STEWART POINT 2-20 LANCE","LANCE",1.8445530247279553,80098.178000000014,147745.33650509821,0.20794450000000006,30722.830126884404]
[1151,null,"STEWART POINT 2B3-29 LANCE","LANCE",1.8445530247279553,174967.36299999998,322736.57865032408,0.20794450000000006,67111.296479152341]
[1152,null,"STEWART POINT 2C3-29 LANCE","LANCE",1.8445530247279553,174626.32299999997,322107.51228677086,0.20794450000000006,66980.485588716445]
[1153,null,"STEWART POINT 2D1-29 LANCE","MESAVERDE",1.8445530247279553,322421.81600000005,594724.1359410804,0.20794450000000006,123669.61308620003]
[1154,null,"STEWART POINT 3-20D LANCE","LANCE",1.8445530247279553,122073.34500000003,225170.75775840928,0.20794450000000006,46823.020636693553]
[1155,null,"STEWART POINT 3A2-29 LANCE","LANCE",1.8445530247279553,169751.15299999999,313115.00271720794,0.20794450000000006,65110.542682528467]
[1156,null,"STEWART POINT 4-29D LANCE","LANCE",1.8445530247279553,39306.630000000005,72503.163258362605,0.20794450000000006,15076.634032178586]
[1157,null,"STEWART POINT 4A3-20 LANCE","LANCE",1.8445530247279553,42944.002,79212.488783023364,0.20794450000000006,16471.801373741408]
[1158,null,"STEWART POINT 4B3-20 LANCE","LANCE",1.8445530247279553,727.01400000000001,1341.0158727195696,0.20794450000000006,278.8568751447346]
[1159,null,"STEWART POINT 4B4-20 LANCE","LANCE",1.8445530247279553,51521.646000000001,95034.407968262967,0.20794450000000006,19761.882447756463]
[1160,null,"STEWART POINT 4C3-20 LANCE ","LANCE",1.8445530247279553,17799.458999999999,32832.045936971226,0.20794450000000006,6827.2433763405152]
[1161,null,"STEWART POINT 4C4-20 LANCE","LANCE",1.8445530247279553,29632.474999999999,54658.671391425516,0.20794450000000006,11365.970093154287]
[1162,null,"STEWART POINT 4D3-20 LANCE","LANCE",1.8445530247279553,50981.06,94037.26842683737,0.20794450000000006,19554.53276438449]
[1163,null,"STEWART POINT 5-20V LANCE","LANCE",1.8445530247279553,20993.448999999997,38723.529852422063,0.20839888000000001,8069.9402508913236]
[1164,null,"STEWART POINT 5A3-20 LANCE","LANCE",1.8445530247279553,43127.221000000005,79550.445943661005,0.20794450000000006,16542.077706531622]
[1165,null,"STEWART POINT 5B3-20 LANCE","LANCE",1.8445530247279553,34819.102000000006,64225.679912411208,0.20794450000000006,13355.376896546397]
[1166,null,"STEWART POINT 5B4-20 LANCE","LANCE",1.8445530247279553,34053.273000000001,62813.067714036813,0.20794450000000006,13061.631959261533]
[1167,null,"STEWART POINT 7-20 LANCE","LANCE",1.8445530247279553,30801.048000000003,56814.166253190946,0.20794450000000006,11814.193394436668]
[1168,null,"STEWART POINT 7D3-20 LANCE","LANCE",1.8445530247279553,124568.65999999999,229773.49858930823,0.20794450000000006,47780.135277404421]
[1169,null,"STEWART POINT 8A3-20 LANCE","LANCE",1.8445530247279553,21232.220999999994,39163.957467242399,0.20794450000000006,8143.9295535469892]
[1170,null,"STEWART POINT 8B3-20 LANCE","LANCE",1.8445530247279553,37469.811999999998,69115.055060587838,0.20794450000000006,14372.095567046412]
[1171,null,"STEWART POINT 8B4-20 LANCE ","LANCE",1.8445530247279553,49619.423999999999,91525.658624458898,0.20794450000000006,19032.2573198338]
[1172,null,"STEWART POINT 8C3-20 LANCE","LANCE",1.8445530247279553,49678.053,91633.802923745679,0.20794450000000006,19054.74533207684]
[1173,null,"STEWART POINT 8C4-20 LANCE","LANCE",1.8445530247279553,28083.811000000005,51802.078525938232,0.20794450000000006,10771.957318036966]
[1174,null,"STEWART POINT 8D3-20 LANCE","LANCE",1.8445530247279553,19058.433000000001,35154.290236725079,0.20794450000000006,7310.1413061306803]
[1175,null,"STEWART POINT 9C3-20 LANCE","LANCE",1.8445530247279553,107722.41399999999,198699.70457469701,0.20794450000000006,41318.510717933095]
[1176,null,"STEWART POINT 9C4-20 LANCE","LANCE",1.8445530247279553,164207.606,302889.63633063633,0.20794450000000006,62984.233981956022]
[1177,null,"STEWART POINT 3D4-20 LANCE","LANCE",1.8445530247279553,102151.541,188423.93393217173,0.20794450000000006,39181.720729558496]
[1178,null,"STEWART POINT 3D3-20 LANCE","LANCE",1.8445530247279553,187865.617,346528.09207973356,0.20794450000000006,72058.610843474176]
[1179,null,"STEWART POINT 3B2-20 LANCE","LANCE",1.8445530247279553,182281.19200000004,336227.32405461726,0.20794450000000006,69916.622786875378]
[1180,null,"STEWART POINT 12A3-20 LANCE","MESAVERDE",1.8445530247279553,273282.30000000005,504083.69306961261,0.20283262795999948,102244.6201770913]
[1181,null,"STEWART POINT 11B1-20","LANCE",1.8445530247279553,272993.86699999997,503551.66310703108,0.20283262795999948,102136.70714162743]
[1182,null,"STEWART POINT 6C3-20","MESAVERDE",1.8445530247279553,295718.913,545469.21544341312,0.20283262795999948,110638.95443966662]
[1183,null,"STEWART POINT 6B4-20","LANCE",1.8445530247279553,276973.38799999998,510892.10060454952,0.20283262795999948,103625.58736962522]
[1184,null,"STEWART POINT 11B3-20 LANCE","MESAVERDE",1.8445530247279553,348707.81100000005,643210.04752631427,0.20283262795999948,130463.98427003849]
[1185,null,"STEWART POINT 6D4-20 LANCE","LANCE",1.8445530247279553,401155.11700000003,739951.88444744691,0.20283262795999948,150086.38528642952]
[1186,null,"MESA UNIT 10A2-7 LANCE","LANCE",1.8445530247279553,107670.44800000002,198603.85053221407,0.21521996979231489,42743.514712180535]
[1187,null,"STEWART POINT 3A1-20 LANCE","LANCE",1.8445530247279553,197520.88400000002,364337.74402913963,0.20794450000000006,75762.030013267446]
[1188,null,"STEWART POINT 2B1-20 LANCE","LANCE",1.8445530247279553,65827.388999999996,121422.10948989373,0.20794450000000006,25249.059846821216]
[1189,null,"STEWART POINT 2C2-20 LANCE","LANCE",1.8445530247279553,70373.252999999997,129807.19668109565,0.20794450000000006,26992.692610252103]
[1190,"POWDER WASH (CO)","BW MUSSER 23 FT UN","FORT UNION",1.8445530247279553,80177.801999999996,147892.20719513911,0.11004610000000004,16274.960622217004]
[1191,null,"BW MUSSER 24 FT UN","FORT UNION",1.8445530247279553,41676.491999999998,76874.499378650435,0.11004610000000004,8459.7388460729071]
[1192,null,"BW MUSSER 26R FT UN","FORT UNION",1.8445530247279553,43096.023000000001,79492.899578395532,0.11004610000000004,8747.8835762940762]
[1193,null,"BW MUSSER 27 FT UN","FORT UNION",1.8445530247279553,76180.221999999994,140518.45891454711,0.11004599999999998,15463.494329710247]
[1194,null,"BW MUSSER 28 FT UN","FORT UNION",1.8445530247279553,13160.23,24274.74205261558,0.11004599999999998,2671.3382639221336]
[1195,null,"BW MUSSER 29 FT UN","FORT UNION",1.8445530247279553,42890.533000000003,79113.862377344194,0.11004599999999998,8706.1640991772165]
[1196,null,"BW MUSSER 31 FT UN","FORT UNION",1.8445530247279553,34381.920000000006,63419.274531954594,0.11004599999999998,6979.0374851434735]
[1197,null,"BW MUSSER 32 FT UN","FORT UNION",1.8445530247279553,64833.926000000007,119589.61430828844,0.11004599999999998,13160.358696169907]
[1198,null,"BW MUSSER 34 FT UN","FORT UNION",1.8445530247279553,23668.174000000003,43657.201941487554,0.11004599999999998,4804.3004448529382]
[1199,null,"BW MUSSER 36 FT UN","FORT UNION",1.8445530247279553,48579.789000000004,89607.99674059586,0.11004599999999998,9861.00160931561]
[1200,null,"BW MUSSER 37 FT UN","FORT UNION",1.8445530247279553,141582.34399999998,261156.14087327383,0.11004599999999998,28739.188678540286]
[1201,null,"BW MUSSER 38 FT UN","FORT UNION",1.8445530247279553,93635.423999999999,172715.50456088458,0.11004599999999998,19006.650414907101]
[1202,null,"BW MUSSER 39 FT UN","FORT UNION",1.8445530247279553,110035.60900000001,202966.51540873264,0.11004599999999998,22335.653154669388]
[1203,null,"BW MUSSER 42 FT UN","FORT UNION",1.8445530247279553,22381.080999999998,41283.090655231368,0.11004599999999998,4543.0389942455904]
[1204,null,"BW MUSSER 72 FT UN","FORT UNION",1.8445530247279553,9472.9789999999994,17473.412067634399,0.11004599999999998,1922.8791043948947]
[1205,null,"BW MUSSER 73 FT UN","FORT UNION",1.8445530247279553,58390.546000000002,107704.45823981681,0.11004599999999998,11852.444811458878]
[1206,null,"BW MUSSER A 1 WAS","WASATCH",1.8445530247279553,6063.65,11184.723948391666,0.11004610000000004,1230.8352500971046]
[1207,null,"BW MUSSER A 14 FT UN","FORT UNION",1.8445530247279553,10925.974999999999,20153.540234352018,0.11004610000000004,2217.8185039835262]
[1208,null,"BW MUSSER B 10 FT UN","FORT UNION",1.8445530247279553,13359.364000000001,24642.05527464176,0.11004610000000004,2711.7620789587554]
[1209,null,"BW MUSSER B 11 FT UN","FORT UNION",1.8445530247279553,12407.114,22885.579656844558,0.11004610000000004,2518.468787475083]
[1210,null,"BW MUSSER B 13 FT UN","FORT UNION",1.8445530247279553,12641.594000000001,23318.090450082775,0.11004610000000004,2566.064913478855]
[1211,null,"BW MUSSER B 18 FT UN","FORT UNION",1.8445530247279553,33125.985999999997,61102.637673395897,0.11004610000000004,6724.1069756702946]
[1212,null,"BW MUSSER B 19 FT UN","FORT UNION",1.8445530247279553,28698.502999999997,52935.910513814299,0.11004610000000004,5825.3905019942613]
[1213,null,"BW MUSSER B 20 FT UN","FORT UNION",1.8445530247279553,10691.481999999998,19721.005461924487,0.11004610000000004,2170.2197391634891]
[1214,null,"BW MUSSER B 6 WAS","FRONTIER",1.8445530247279553,15095.366999999998,27844.204859228557,0.11004610000000004,3064.1461523591529]
[1215,null,"CARL ALLEN 22 FT UN","FORT UNION",1.8445530247279553,63075.926999999989,116346.89193536968,0.11004610000000004,12803.521704608889]
[1216,null,"CARL ALLEN 23 FT UN","FORT UNION",1.8445530247279553,47298.266000000011,87244.159614687436,0.11004610000000004,9600.8795133738586]
[1217,null,"CARL ALLEN 25 FT UN","WASATCH",1.8445530247279553,110679.186,204153.62731072798,0.11004610000000004,22466.31048639911]
[1218,null,"CARL ALLEN 26 FT UN","MESAVERDE",1.8445530247279553,68063.081000000006,125545.96193085384,0.11004610000000004,13815.843481238939]
[1219,null,"CARL ALLEN 27 FT UN","FORT UNION",1.8445530247279553,56011.023000000008,103315.3018927571,0.11004599999999998,11369.435712090344]
[1220,null,"CARL ALLEN 28 FT UN","FORT UNION",1.8445530247279553,38520.467999999993,71053.045763336399,0.11004599999999998,7819.1034740721161]
[1221,null,"CARL ALLEN 29 FT UN","FORT UNION",1.8445530247279553,70526.475999999995,130089.82462920355,0.11004599999999998,14315.864841145331]
[1222,null,"CARL ALLEN 30 FT UN","FORT UNION",1.8445530247279553,62250.457000000009,114824.26875004754,0.11004599999999998,12635.95147886773]
[1223,null,"CARL ALLEN 31 FT UN","FORT UNION",1.8445530247279553,112746.30100000001,207966.53053643851,0.11004599999999998,22885.88481941291]
[1224,null,"CARL ALLEN 32 FT UN","FORT UNION",1.8445530247279553,71547.312000000005,131972.81076075474,0.11004599999999998,14523.079932978013]
[1225,null,"CARL ALLEN 33 FT UN","FORT UNION",1.8445530247279553,9240.5590000000011,17044.701053627134,0.11004599999999998,1875.7011721474512]
[1226,null,"CARL ALLEN 34 FT UN","FORT UNION",1.8445530247279553,82238.067999999999,151692.47707718328,0.11004599999999998,16693.150332435707]
[1227,null,"CARL ALLEN 35 FT UN","FORT UNION",1.8445530247279553,53027.933999999994,97812.83605477438,0.11004599999999998,10763.911356483699]
[1228,null,"CARL ALLEN 36 FT UN","FORT UNION",1.8445530247279553,104482.452,192723.42286759341,0.11004599999999998,21208.441792887181]
[1229,null,"CARL ALLEN 40 FT UN","FORT UNION",1.8445530247279553,31218.218000000001,57583.658438516701,0.11004599999999998,6336.851276525008]
[1230,null,"CARL ALLEN A 16 WAS","WASATCH",1.8445530247279553,26008.290999999994,47973.671832054846,0.11004610000000004,5279.3154877974921]
[1231,null,"CARL ALLEN A 19 FT UN","FORT UNION",1.8445530247279553,57058.923999999999,105248.21085192253,0.11004610000000004,11582.155136231755]
[1232,null,"CARL ALLEN A 2 WAS","WASATCH",1.8445530247279553,11997.68,22130.356933718096,0.11004610000000004,2435.3594721636359]
[1233,null,"CARL ALLEN A 8 FT UN","FORT UNION",1.8445530247279553,18973.099999999999,34996.888993465967,0.11004610000000004,3851.2711458638564]
[1234,null,"CARL ALLEN B 10 WAS","WASATCH",1.8445530247279553,1318.98,2432.9285485556784,0.11004610000000004,267.7342983472131]
[1235,null,"CARL ALLEN B 15 WAS","WASATCH",1.8445530247279553,3805.0250000000001,7018.5703729154884,0.11004610000000004,772.36629711489536]
[1236,null,"CARL ALLEN B 17 WAS","WASATCH",1.8445530247279553,9285.0709999999999,17126.805797863821,0.11004610000000004,1884.7381835123024]
[1237,null,"CARL ALLEN B 6 FT UN","FORT UNION",1.8445530247279553,32593.317999999999,60120.103302820113,0.11004610000000004,6615.9829000724749]
[1238,null,"CARL ALLEN B 6 LOWER FT UN","FORT UNION",1.8445530247279553,32593.317999999999,60120.103302820113,0.11004610000000004,6615.9829000724749]
[1239,null,"CARL ALLEN B 7 FT UN","FORT UNION",1.8445530247279553,3599.8159999999998,6640.0514912640892,0.11004610000000004,730.71177041279736]
[1240,null,"CARL ALLEN B 9 UPPER WAS","WASATCH",1.8445530247279553,5215.7299999999996,9620.6905476643369,0.11004610000000004,1058.7194740773248]
[1241,null,"H STEWART 6 FT UN","FORT UNION",1.8445530247279553,55062.962999999982,101566.55495213346,0.11004599999999998,11176.993106262476]
[1242,null,"H STEWART A 1 FT UN","FORT UNION",1.8445530247279553,4782.2050000000008,8821.0306976191532,0.11004610000000004,970.72002625326741]
[1243,null,"H STEWART A 2 FT UN","FORT UNION",1.8445530247279553,28425.833999999999,52432.958085114755,0.11004610000000004,5770.0425487303482]
[1244,null,"JA LEE 1 FT UN","FORT UNION",1.8445530247279553,7924.8109999999997,14617.734100447373,0.11004610000000004,1608.6246285912421]
[1245,null,"JC DONNELL 14 FT UN","FORT UNION",1.8445530247279553,32352.555,59676.003182927539,0.11004599999999998,6567.1054462684424]
[1246,null,"JC DONNELL 14-29 FT UN","FORT UNION",1.8445530247279553,77213.206000000006,142423.85267624271,0.11004610000000004,15673.189533995077]
[1247,null,"JC DONNELL 15 FT UN","FORT UNION",1.8445530247279553,51669.91399999999,95307.896156133313,0.11004599999999998,10488.252740397844]
[1248,null,"JC DONNELL 16 FT UN","FORT UNION",1.8445530247279553,68473.288,126302.61049346841,0.11004599999999998,13899.097074364223]
[1249,null,"JC DONNELL 18 FT UN","FORT UNION",1.8445530247279553,1894.039,3493.6553664027119,0.11004599999999998,384.46279845115276]
[1250,null,"JC DONNELL A 1 FT UN","FORT UNION",1.8445530247279553,14189.537999999999,26173.355237392261,0.11004610000000004,2880.2756677895936]
[1251,null,"JC DONNELL A 11 FT UN","FORT UNION",1.8445530247279553,59104.607000000004,109021.58161720709,0.11004610000000004,11997.399872805338]
[1252,null,"JC DONNELL B 10 FT UN","FORT UNION",1.8445530247279553,22287.189000000002,41109.901882633618,0.11004610000000004,4523.984373566489]
[1253,null,"JC DONNELL B 3 WAS","WASATCH",1.8445530247279553,46080.450999999994,84997.835272878321,0.11004610000000004,9353.6802802226975]
[1254,null,"JC DONNELL B 5 FT UN","FORT UNION",1.8445530247279553,16910.653999999999,31192.597985827895,0.11004610000000004,3432.6237572082164]
[1255,null,"JC DONNELL B 9 FT UN","FORT UNION",1.8445530247279553,9474.0950000000012,17475.47058881,0.11004610000000004,1923.1073839632447]
[1256,null,"MFS 20-1 FT UN (PC)","FORT UNION",1.8445530247279553,48831.021000000001,90071.407486104305,0.125,11258.925935763038]
[1257,null,"POWDER WASH GOVT 1 FT UN","FORT UNION",1.8445530247279553,5351.9,9871.8633330415432,0.11004610000000004,1086.3600595342234]
[1258,null,"POWDER WASH GOVT 17 FT UN","FORT UNION",1.8445530247279553,7324.2330000000002,13509.936133962306,0.11004599999999998,1486.7144317980158]
[1259,null,"CARL ALLEN 11 FT UN","FORT UNION",1.8445530247279553,1350.9649999999999,2491.9265770516022,0.11004610000000004,274.22680129087843]
[1260,null,"BW MUSSER B 15 UPPER FT UN","FORT UNION",1.8445530247279553,2933.694,5411.3541413262537,0.11004610000000004,595.49841897180329]
[1261,null,"CARL ALLEN 20 FT UN","FORT UNION",1.8445530247279553,22367.637000000002,41258.292484366932,0.11004610000000004,4540.3141805638934]
[1262,null,"HW STEWART 5 FT UN","FORT UNION",1.8445530247279553,97089.786999999997,179087.26028104292,0.11004610000000004,19707.854553613684]
[1263,null,"CARL ALLEN 11 LOWER FT UN","FORT UNION",1.8445530247279553,25671.989999999994,47353.346805285815,0.11004599999999998,5211.0464025344818]
[1264,null,"CARL ALLEN 37 FT UN (NP)","FRONTIER",1.8445530247279553,2,3.6891060494559107,0.11004610000000004,0.40597173322903024]
[1265,"SHUTE CR (WY)","SHUTE CREEK UNIT 15 FR","FRONTIER",1.8445530247279553,82.996999999999986,153.09236739334608,0.17823297856830436,27.28610863658923]
[1266,null,"SHUTE CREEK UNIT 34 FR","FRONTIER",1.8445530247279553,207.08800000000002,381.98479678486285,0.17781543419078832,67.922792494580435]
[1267,"SUGAR LOAF (CO)","SUGARLOAF GOVT 1 MESA","MESAVERDE",1.8445530247279553,70209.237999999998,129504.6623167449,0.13375000000000004,17321.248584864636]
[1268,null,"SUGARLOAF GOVT 15 MESA","MESAVERDE",1.8445530247279553,62050.341000000008,114455.14417695107,0.13375000000000004,15308.375533667209]
[1269,null,"SUGARLOAF GOVT 17 ALMOND","ALMOND",1.8445530247279553,99782.969000000012,184054.97728528583,0.20374999999999999,37501.201621876986]
[1270,null,"SUGARLOAF GOVT 3 FT UN","FORT UNION",1.8445530247279553,21594.776999999998,39832.711233675676,0.13375000000000004,5327.6251275041232]
[1271,null,"SUGARLOAF GOVT 6 MESA","MESAVERDE",1.8445530247279553,57223.416999999987,105551.62691261907,0.13375000000000004,14117.530099562806]
[1272,null,"SUGARLOAF GOVT 8 MESA","MESAVERDE",1.8445530247279553,34178.297000000006,63043.681111400416,0.13375000000000004,8432.0923486498086]
[1273,null,"SUGARLOAF GOVERNMENT 12 MESA","MESAVERDE",1.8445530247279553,7312.924,13489.076083805658,0.13375000000000004,1804.1639262090073]
[1274,null,"SUGARLOAF GOVERNMENT 4 MESA","MESAVERDE",1.8445530247279553,11364.394,20962.227326900229,0.13375000000000004,2803.6979049729061]
[1275,null,"SUGARLOAF GOVERNMENT 14 MESA","MESAVERDE",1.8445530247279553,27200.816000000003,50173.347427868568,0.13375000000000004,6710.6852184774225]
[1276,null,"SUGARLOAF GOVERNMENT  10 MESA","MESAVERDE",1.8445530247279553,14784.997000000001,27271.710936943749,0.13375000000000004,3647.5913378162277]
[1277,null,"SUGARLOAF GOVERNMENT 2 MESA","MESAVERDE",1.8445530247279553,95342.734999999986,175864.73023008587,0.13375000000000004,23521.907668273991]
[1278,null,"SUGARLOAF STATE LAND 2 MESA","MESAVERDE",1.8445530247279553,24186.337,44612.981070439659,0.125,5576.6226338049573]
[1279,"TRAIL (WY)","TRAIL UNIT 03C-10J MESA","MESAVERDE",1.8445530247279553,120470.06200000002,222213.41725126436,0.13524037536921907,30052.22596113789]
[1280,null,"TRAIL UNIT 07A-03J MESA","MESAVERDE",1.8445530247279553,65631.385999999999,121060.57156338797,0.13524037536921907,16372.277140644797]
[1281,null,"TRAIL UNIT 104 MESA","MESAVERDE",1.8445530247279553,67948.485000000001,125334.58353243211,0.13523994172718318,16950.241773326892]
[1282,null,"TRAIL UNIT 10B-21D MESA","MESAVERDE",1.8445530247279553,41289.052999999993,76159.847599302841,0.13541854348367693,10313.4556338364]
[1283,null,"TRAIL UNIT 114 MESA","MESAVERDE",1.8445530247279553,44007.847999999998,81174.809140168101,0.13524644635772132,10978.60446997401]
[1284,null,"TRAIL UNIT 115 MESA","MESAVERDE",1.8445530247279553,57728.259000000013,106482.83475072883,0.13523994172718318,14400.732366633842]
[1285,null,"TRAIL UNIT 116 MESA","MESAVERDE",1.8445530247279553,54482.516999999993,100495.89152714223,0.13523994172718318,13591.058513952037]
[1286,null,"TRAIL UNIT 11B-3D MESA","MESAVERDE",1.8445530247279553,215370.38499999998,397262.09508857422,0.13524037536921907,53725.874859741176]
[1287,null,"TRAIL UNIT 12 UPPER MESA","MESAVERDE",1.8445530247279553,151500.60399999999,279450.89735631214,0.13523994172718318,37792.923074076702]
[1288,null,"TRAIL UNIT 13 MESA","MESAVERDE",1.8445530247279553,129795.859,239415.34431561321,0.13524037536921907,32378.62103439436]
[1289,null,"TRAIL UNIT 132 MESA","MESAVERDE",1.8445530247279553,97895.267999999996,180573.0126959538,0.13523994172718318,24420.683714502702]
[1290,null,"TRAIL UNIT 14D-3W MESA","MESAVERDE",1.8445530247279553,180155.79500000001,332306.91658951947,0.13524037536921907,44941.312137354384]
[1291,null,"TRAIL UNIT 15 MESA","MESAVERDE",1.8445530247279553,36007.031999999992,66416.879787076265,0.13524037536921907,8982.2437532564927]
[1292,null,"TRAIL UNIT 15 UPPER MESA","MESAVERDE",1.8445530247279553,189038.61700000003,348691.75277773954,0.13524037536921907,47157.203533812433]
[1293,null,"TRAIL UNIT 155 MESA","MESAVERDE",1.8445530247279553,169434.087,312530.15766786953,0.13523994172718318,42266.560310990048]
[1294,null,"TRAIL UNIT 16 MESA","MESAVERDE",1.8445530247279553,146655.34000000003,270513.55098950677,0.13523994172718318,36584.236872234287]
[1295,null,"TRAIL UNIT 16 UPPER MESA","MESAVERDE",1.8445530247279553,106197.092,195886.16726591295,0.13523994172718318,26491.633846203324]
[1296,null,"TRAIL UNIT 16C-3D MESA","MESAVERDE",1.8445530247279553,113757.924,209832.52280097286,0.13524037536921907,28377.829148273788]
[1297,null,"TRAIL UNIT 16D-9D MESA","MESAVERDE",1.8445530247279553,138760.37700000001,255950.87310774141,0.13524037536921907,34614.89215517031]
[1298,null,"TRAIL UNIT 17 MESA","MESAVERDE",1.8445530247279553,58971.705000000016,108776.43683111471,0.13524037536921907,14710.9661483661]
[1299,null,"TRAIL UNIT 18 MESA","MESAVERDE",1.8445530247279553,76737.895000000004,141547.11633350624,0.13524037536921907,19142.885145373904]
[1300,null,"TRAIL UNIT 1B-21D MESA","MESAVERDE",1.8445530247279553,29621.329999999998,54638.113847964923,0.13541854348367693,7399.0137959867288]
[1301,null,"TRAIL UNIT 1B-9D MESA","MESAVERDE",1.8445530247279553,145042.47399999996,267538.53413072572,0.13523994172718318,36181.895765615351]
[1302,null,"TRAIL UNIT 1D-16W MESA","MESAVERDE",1.8445530247279553,125108.13000000002,230768.57960955828,0.13524037536921907,31209.229329818176]
[1303,null,"TRAIL UNIT 2 MESA","MESAVERDE",1.8445530247279553,18205.717000000001,33581.410359691159,0.13524037536921907,4541.562542472414]
[1304,null,"TRAIL UNIT 2 UPPER MESA","UPPER MESA",1.8445530247279553,64547.321000000011,119060.95618863629,0.13523994172718318,16101.796776933881]
[1305,null,"TRAIL UNIT 20 MESA","MESAVERDE",1.8445530247279553,24711.433999999997,45581.550330065234,0.13770523751522534,6276.8182145138317]
[1306,null,"TRAIL UNIT 21 MESA CC/TRAIL","LANCE",1.8445530247279553,63798.352000000006,117679.44315425881,0.13524037536921907,15915.012065422639]
[1307,null,"TRAIL UNIT 21 UPPER MESA","UPPER MESA",1.8445530247279553,77972.822000000015,143825.00466667447,0.13523994172718318,19450.885250032905]
[1308,null,"TRAIL UNIT 22W MESA","MESAVERDE",1.8445530247279553,127727.64499999999,235600.41392612847,0.13524037536921907,31862.688416513003]
[1309,null,"TRAIL UNIT 23W MESA","MESAVERDE",1.8445530247279553,132991.204,245309.32760041254,0.13524037536921907,33175.72554625052]
[1310,null,"TRAIL UNIT 25W MESA","MESAVERDE",1.8445530247279553,156493.26099999997,288660.11792709131,0.13524037536921907,39038.502702582875]
[1311,null,"TRAIL UNIT 26 MESA","MESAVERDE",1.8445530247279553,68993.265999999989,127261.73748616037,0.13523994172718318,17210.869961728411]
[1312,null,"TRAIL UNIT 27 MESA","MESAVERDE",1.8445530247279553,56413.464,104057.62565658161,0.13523994172718318,14072.747230065139]
[1313,null,"TRAIL UNIT 28 MESA","MESAVERDE",1.8445530247279553,155836.85700000002,287449.3459434479,0.13523994172718318,38874.632794908815]
[1314,null,"TRAIL UNIT 29 MESA","MESAVERDE",1.8445530247279553,53837.772000000004,99306.625187214027,0.13523994172718318,13430.222203442047]
[1315,null,"TRAIL UNIT 3 MESA","MESAVERDE",1.8445530247279553,31180.219000000001,57513.567268130064,0.13524037536921907,7778.1564261647409]
[1316,null,"TRAIL UNIT 3 UPPER MESA","UPPER MESA",1.8445530247279553,176671.65700000001,325880.23930304986,0.13523994172718318,44072.024573384973]
[1317,null,"TRAIL UNIT 32 MESA","MESAVERDE",1.8445530247279553,90553.582999999999,167030.88542260395,0.13523994172718318,22589.247211192767]
[1318,null,"TRAIL UNIT 33 MESA","MESAVERDE",1.8445530247279553,39047.99,72026.088064046955,0.13537754051135248,9750.7146547647571]
[1319,null,"TRAIL UNIT 35 MESA","MESAVERDE",1.8445530247279553,57877.489000000001,106758.09739860897,0.13523994172718318,14437.958871092822]
[1320,null,"TRAIL UNIT 37 MESA","MESAVERDE",1.8445530247279553,72556.848000000013,133834.95344312652,0.13523994172718318,18099.831304708703]
[1321,null,"TRAIL UNIT 38 MESA","MESAVERDE",1.8445530247279553,96447.11500000002,177901.81769953499,0.13523994172718318,24059.431458845076]
[1322,null,"TRAIL UNIT 3C-15D MESA","MESAVERDE",1.8445530247279553,69714.608000000007,128592.29105412372,0.13524037536921907,17390.869711747564]
[1323,null,"TRAIL UNIT 4 UPPER MESA","MESAVERDE",1.8445530247279553,90154.498000000007,166294.7519787304,0.13523994172718318,22489.692567139879]
[1324,null,"TRAIL UNIT 40 MESA","MESAVERDE",1.8445530247279553,38174.165999999997,70414.273361767075,0.13523994172718318,9522.822226207325]
[1325,null,"TRAIL UNIT 41 MESA","MESAVERDE",1.8445530247279553,52046.741999999998,96002.975383335506,0.13537754051135248,12996.646689167877]
[1326,null,"TRAIL UNIT 43 MESA","MESAVERDE",1.8445530247279553,64608.277999999998,119173.39460736461,0.13523994172718318,16117.002942130595]
[1327,null,"TRAIL UNIT 44 MESA","MESAVERDE",1.8445530247279553,49057.024000000005,90488.282003351909,0.13523994172718318,12237.62998512623]
[1328,null,"TRAIL UNIT 45 MESA","MESAVERDE",1.8445530247279553,46258.205000000002,85325.711951235833,0.13523994172718318,11539.444312115551]
[1329,null,"TRAIL UNIT 46 MESA","MESAVERDE",1.8445530247279553,59618.093999999997,109968.73561621556,0.13523994172718318,14872.165396549006]
[1330,null,"TRAIL UNIT 47 MESA","MESAVERDE",1.8445530247279553,81165.11,149713.34915287723,0.13523994172718318,20247.224615216546]
[1331,null,"TRAIL UNIT 48 MESA","MESAVERDE",1.8445530247279553,55904.964999999989,103119.67228806046,0.13523994172718318,13945.898471163524]
[1332,null,"TRAIL UNIT 49 MESA","MESAVERDE",1.8445530247279553,113087.84600000002,208596.52839926924,0.13523994172718318,28210.582345209885]
[1333,null,"TRAIL UNIT 4C-22D MESA","MESAVERDE",1.8445530247279553,55742.278000000006,102819.58749012658,0.135223254069267,13903.599202474612]
[1334,null,"TRAIL UNIT 4D-16W MESA","MESAVERDE",1.8445530247279553,83714.371000000014,154415.59624124825,0.13523994172718318,20883.156237434658]
[1335,null,"TRAIL UNIT 50 MESA","MESAVERDE",1.8445530247279553,51074.290000000008,94209.236105332777,0.13523994172718318,12740.851601047647]
[1336,null,"TRAIL UNIT 51 MESA","MESAVERDE",1.8445530247279553,51925.573000000004,95779.472737882257,0.13523994172718318,12953.210311731526]
[1337,null,"TRAIL UNIT 52 MESA","MESAVERDE",1.8445530247279553,69054.12000000001,127373.98591592722,0.13523994172718318,17226.050432829048]
[1338,null,"TRAIL UNIT 53 MESA","MESAVERDE",1.8445530247279553,131154.11900000001,241920.72690698021,0.13523994172718318,32717.3450094978]
[1339,null,"TRAIL UNIT 54 MESA","MESAVERDE",1.8445530247279553,104566.41100000001,192878.28969499655,0.13523994172718318,26084.848658790088]
[1340,null,"TRAIL UNIT 55 MESA","MESAVERDE",1.8445530247279553,71942.728000000003,132702.17653958057,0.13523994172718318,17946.634622283251]
[1341,null,"TRAIL UNIT 56 MESA","MESAVERDE",1.8445530247279553,44320.007999999994,81750.604812367164,0.13523994172718318,11055.947030986516]
[1342,null,"TRAIL UNIT 57 MESA","MESAVERDE",1.8445530247279553,33124.828000000001,61100.501680993271,0.13523994172718318,8263.2282868391885]
[1343,null,"TRAIL UNIT 5D-22D MESA","MESAVERDE",1.8445530247279553,61704.396000000001,113817.03028081155,0.13541854348367693,15412.936464265054]
[1344,null,"TRAIL UNIT 6 UPPER MESA","UPPER MESA",1.8445530247279553,131522.00099999999,242599.30476282316,0.13523994172718318,32809.115839179358]
[1345,null,"TRAIL UNIT 61 MESA","MESAVERDE",1.8445530247279553,29392.699999999997,54216.393689921366,0.13523994172718318,7332.2219232829875]
[1346,null,"TRAIL UNIT 62 MESA","MESAVERDE",1.8445530247279553,48446.502,89362.141801588936,0.13523994172718318,12085.330849863167]
[1347,null,"TRAIL UNIT 6-22W MESA","MESAVERDE",1.8445530247279553,147581.39500000002,272221.70854082116,0.13879679143874571,37783.499705439375]
[1348,null,"TRAIL UNIT 63 MESA","MESAVERDE",1.8445530247279553,57973.678999999996,106935.52495405755,0.13523994172718318,14461.954163352486]
[1349,null,"TRAIL UNIT 64 MESA","MESAVERDE",1.8445530247279553,36128.183000000012,66640.349230575113,0.13523994172718318,9012.4369466221142]
[1350,null,"TRAIL UNIT 67 MESA","MESAVERDE",1.8445530247279553,142797.78,263398.07702343713,0.13523994172718318,35621.940587701742]
[1351,null,"TRAIL UNIT 70 MESA","MESAVERDE",1.8445530247279553,114971.81,212071.59989394777,0.13540884456969426,28716.370307685964]
[1352,null,"TRAIL UNIT 71 MESA","MESAVERDE",1.8445530247279553,81483.692999999999,150300.99238915413,0.13523994172718318,20326.697452247005]
[1353,null,"TRAIL UNIT 74 MESA","MESAVERDE",1.8445530247279553,88092.823999999993,162491.8849660274,0.13523994172718318,21975.393053945696]
[1354,null,"TRAIL UNIT 75 MESA","MESAVERDE",1.8445530247279553,106972.94599999998,197317.2711083602,0.13523994172718318,26685.17624646144]
[1355,null,"TRAIL UNIT 7B-21D MESA","MESAVERDE",1.8445530247279553,43386.400999999998,80028.517196609988,0.13541854348367693,10837.345235923316]
[1356,null,"TRAIL UNIT 7C-10W MESA","MESAVERDE",1.8445530247279553,150605.65300000002,277800.11278227891,0.13523994172718318,37569.671064480317]
[1357,null,"TRAIL UNIT 8 MESA","MESAVERDE",1.8445530247279553,14822.562999999998,27341.003415870673,0.13524037536921907,3697.6075649334507]
[1358,null,"TRAIL UNIT 83 MESA","MESAVERDE",1.8445530247279553,43063.525000000001,79432.95529419792,0.1352399124043277,10742.505916004206]
[1359,null,"TRAIL UNIT 8C-16D MESA","MESAVERDE",1.8445530247279553,143739.05400000003,265134.30682723498,0.13524037536921907,35856.863178572959]
[1360,null,"TRAIL UNIT 8C-21W MESA","MESAVERDE",1.8445530247279553,31319.753999999997,57770.946974435472,0.13541854348367693,7823.2574949507843]
[1361,null,"TRAIL UNIT 93 MESA","MESAVERDE",1.8445530247279553,66122.03300000001,121965.5959713117,0.13523994172718318,16494.620091881363]
[1362,null,"TRAIL UNIT 94 MESA","MESAVERDE",1.8445530247279553,77075.455000000002,142169.76365253341,0.13523994172718318,19227.030551736025]
[1363,null,"TRAIL UNIT 95 MESA","MESAVERDE",1.8445530247279553,118473.43799999999,218530.53841281988,0.13523994172718318,29554.057280559726]
[1364,null,"TRAIL UNIT 9D-4D MESA","MESAVERDE",1.8445530247279553,149112.361,275045.65650687681,0.13523994172718318,37197.158558304858]
[1365,null,"TRAIL UNIT 177 MESA","MESAVERDE",1.8445530247279553,159673.10399999999,294525.50695090136,0.13523994172718318,39831.612397208984]
[1366,null,"TRAIL UNIT 105 MESA","MESAVERDE",1.8445530247279553,88837.56700000001,163865.60291932241,0.13523994172718318,22161.174589898899]
[1367,null,"TRAIL UNIT 106 MESA","MESAVERDE",1.8445530247279553,139757.851,257790.76679152888,0.13523994172718318,34863.608278692234]
[1368,null,"TRAIL UNIT 82 MESA","MESAVERDE",1.8445530247279553,82475.943000000014,152131.25012794047,0.13523994172718318,20574.221402186198]
[1369,null,"TRAIL UNIT 84 MESA","MESAVERDE",1.8445530247279553,123748.12099999997,228259.97089495097,0.13523994172718318,30869.865162481696]
[1370,null,"TRAIL UNIT 68 MESA (SLD)","MESAVERDE",1.8445530247279553,99104.830000000016,182804.11394164985,0.13523994172718318,24722.41771695808]
[1371,"W HIAW (CO)","WHEELER 5 MESA","MESAVERDE",1.8445530247279553,954.10600000000011,1759.8991082110908,0.26249999999999996,461.97351590541126]
[1372,null,"WHEELER 7 MESA","MESAVERDE",1.8445530247279553,2138.0749999999998,3943.7927083452228,0.26249999999999996,1035.2455859406209]
[1373,null,"WHEELER 9   (MESA)","MESAVERDE",1.8445530247279553,5675.3009999999995,10468.393625791588,0.26249999999999996,2747.9533267702914]
[1374,null,"WHEELER 6 MESA","MESAVERDE",1.8445530247279553,8380.3249999999989,15457.9538269533,0.26249999999999996,4057.7128795752405]
[1375,null,"LASHER 8 MESA","MESAVERDE",1.8445530247279553,3037.8440000000005,5603.4643388516715,0.25406249999999997,1423.6301585895026]
[1376,null,"LASHER 9   (iMESA)","MESAVERDE",1.8445530247279553,5380.2240000000002,9924.1084529139389,0.25406249999999997,2521.3438038184472]
[1377,null,"LASHER 10 MESA","MESAVERDE",1.8445530247279553,6298.8680000000004,11618.596021762127,0.25406249999999997,2951.8495517789402]
[1378,null,"LASHER 12 MESA","MESAVERDE",1.8445530247279553,9625.9499999999989,17755.575188380059,0.25406249999999997,4511.0258212978079]
[1379,null,"LASHER 11 MESA","MESAVERDE",1.8445530247279553,14093.356,25995.942438367878,0.25406249999999997,6604.594125747838]
[1380,null,"LASHER 7 MESA","FORT UNION",1.8445530247279553,1507.0530000000003,2779.8391695753398,0.23250000000000004,646.31260692626665]
[1381,null,"WHEELER 6 FT UN","FORT UNION",1.8445530247279553,3400.4719999999998,6272.3509131027195,0.1925,1207.4275507722734]
[1382,null,"WHEELER 7 LEWIS","LEWIS",1.8445530247279553,4754.3439999999991,8769.6396057972051,0.1925,1688.1556241159619]
[1383,null,"WHEELER 5 LEWIS","LEWIS",1.8445530247279553,9862.9779999999992,18192.785902725278,0.1925,3502.1112862746163]
[1384,null,"WB LASHER A 2 WAS","WASATCH",1.8445530247279553,7841.9719999999998,14464.933172431933,0.1925,2784.499635693147]
[1385,null,"WHEELER 6 LEWIS","LEWIS",1.8445530247279553,10874.041999999999,20057.747062118826,0.1925,3861.1163094578742]
[1386,null,"WHEELER 3  (FT UN)","FORT UNION",1.8445530247279553,9513.1530000000002,17547.515140849824,0.1925,3377.8966646135914]
[1387,null,"WHEELER  4 (LEWIS)","LEWIS",1.8445530247279553,13041.368999999999,24055.49663554339,0.1925,4630.6831023421028]
[1388,null,"WHEELER 9 FT UN","FORT UNION",1.8445530247279553,17021.576000000001,31397.199496436773,0.1925,6043.9609030640786]
[1389,null,"LASHER 6 FT UN","FORT UNION",1.8445530247279553,13917.738000000001,25672.005725271207,0.1925,4941.8611021147071]
[1390,null,"LASHER 6 LANCE","LANCE/LEWIS",1.8445530247279553,13918.883000000002,25674.117738484521,0.1925,4942.2676646582704]
[1391,null,"WHEELER 5 FT UN","FORT UNION",1.8445530247279553,20995.303,38726.949653729913,0.1925,7454.9378083430083]
[1392,null,"WHEELER 2  FT UN","FORT UNION",1.8445530247279553,14815.315000000001,27327.634095547448,0.1925,5260.5695633928835]
[1393,null,"LASHER 6 LEWIS ","LANCE/LEWIS",1.8445530247279553,14783.678,27269.277971504129,0.1925,5249.3360095145454]
[1394,null,"LASHER 7 LEWIS","LEWIS",1.8445530247279553,22592.183999999997,41672.481332410513,0.1925,8021.9526564890239]
[1395,null,"WB LASHER A 4 FT UN","FORT UNION",1.8445530247279553,21714.005000000001,40052.633601707945,0.1925,7710.1319683287793]
[1396,null,"LASHER 7 FT UN","FORT UNION",1.8445530247279553,26100.653999999995,48144.040283077797,0.1925,9267.7277544924764]
[1397,null,"WHEELER 9   (LEWIS)","LEWIS",1.8445530247279553,34041.252,62790.894342126558,0.1925,12087.247160859362]
[1398,null,"WHEELER 4 FT UN","FORT UNION",1.8445530247279553,36005.271000000001,66413.631529199731,0.1925,12784.624069370948]
[1399,null,"LASHER 9 FT UN","FORT UNION",1.8445530247279553,4226.9069999999992,7796.7540920937663,0.18406250000000002,1435.090050076009]
[1400,null,"LASHER 8 FT UN","FORT UNION",1.8445530247279553,5608.817,10345.760362495575,0.18406250000000002,1904.266516721842]
[1401,null,"LASHER 10 FT UN","FORT UNION",1.8445530247279553,6114.915,11279.284959204346,0.18406250000000002,2076.0933878035503]
[1402,null,"LASHER 10 LEWIS","LEWIS",1.8445530247279553,6114.915,11279.284959204346,0.18406250000000002,2076.0933878035503]
[1403,null,"WB LASHER A 5 FT UN","FORT UNION",1.8445530247279553,7938.4449999999988,14642.882736386511,0.18406250000000002,2695.2056036661425]
[1404,null,"LASHER 12 FT UN","FORT UNION",1.8445530247279553,9631.7459999999992,17766.266217711385,0.18406250000000002,3270.1033756975021]
[1405,null,"LASHER 12 LEWIS","LEWIS",1.8445530247279553,9631.7459999999992,17766.266217711385,0.18406250000000002,3270.1033756975021]
[1406,null,"LASHER 12 LANCE","LANCE",1.8445530247279553,9631.7459999999992,17766.266217711385,0.18406250000000002,3270.1033756975021]
[1407,null,"LASHER 11 FT UN","FORT UNION",1.8445530247279553,14090.43,25990.545276217523,0.18406250000000002,4783.8847399037886]
[1408,null,"LASHER 11 LEWIS","LEWIS",1.8445530247279553,14090.43,25990.545276217523,0.18406250000000002,4783.8847399037886]
[1409,null,"LASHER 11 LANCE","LANCE",1.8445530247279553,14090.43,25990.545276217523,0.18406250000000002,4783.8847399037886]
[1410,null,"LASHER 8 LEWIS","LEWIS",1.8445530247279553,14722.220000000001,27155.9154317104,0.18406250000000002,4998.3856841491961]
[1411,null,"LASHER 9   (LEWIS)","LEWIS",1.8445530247279553,28809.575999999997,53140.790551929902,0.18406250000000002,9781.2267609645987]
[1412,null,"LASHER 6 MESA","MESAVERDE",1.8445530247279553,405.971,748.8350360018328,0.26254,196.59915035192117]
[1413,null,"WHEELER 8 MESA","MESAVERDE",1.8445530247279553,8,14.756424197823643,0.26249999999999996,3.8735613519287058]
[1414,null,"WHEELER 8 LEW/LAN/FT UN","FORT UNION",1.8445530247279553,90.007999999999981,166.02452864971377,0.1925,31.959721765069901]
[1415,"MOSU (CO)","F WILSON B 13 WAS","WASATCH",1.8445530247279553,12.000999999999999,22.13648084976019,0.1825,4.0399077550812343]
[]
[{"$f":"A1425+1","v":1416},"Totals Before Adjustment",null,null,null,{"$f":"SUM(F11:F1425)","v":55805228.905000009},{"$f":"SUM(G11:G1425)","v":106096862.53415377},null,{"$f":"SUM(I11:I1425)","v":17534463.404037833}]
[]
[{"$f":"+A1427+1","v":1417},"Test-Year Adjustment for IRP Production Forecast",null,null,null,{"$f":"F1437-F1427","v":-5747470.9050000086},null,"+",{"$f":"I1427/F1427*F1429","v":-1805902.7841469052}]
[]
[]
[{"$f":"+A1429+1","v":1418},"Total Wexpro I Test-Year Royalties",null,null,null,null,null,null,{"$f":"I1427+I1429","v":15728560.619890928}]
[]
[{"$f":"+A1432+1","v":1419},"Wexpro I Operator Service Fee",null,null,null,null,null,"+",{"$f":"'Monthly Inputs'!S107","v":169504821.75115463}]
[]
[]
[{"$f":"+A1434+1","v":1420},"Total Wexpro I Company Production",null,null,null,{"$f":"+'Monthly Inputs'!S7","v":50057758},null,null,{"$f":"I1432+I1434","v":185233382.37104556}]
[]
[]
[null,"WEXPRO II"]
[null,null,null,null,null,"Base Year","Market ","Royalty","Test-Year"]
[null,"Field Name","Well Name","Formation","Price $","Dth","Value $","Rate","Royalty $"]
[{"$f":"A1437+1","v":1421},"CANYON CR (WY)","CANYON CREEK 11B-4D MESA","MESAVERDE",2.0480095700898606,85.000999999999991,174.08286146720823,0.16319156100731588,28.408853907454031]
[{"$f":"+A1443+1","v":1422},null,"CANYON CREEK 11D-25D MESA","MESAVERDE",2.0480095700898606,77599.303,158924.11517630282,0.16319195705051903,25935.13737814295]
[{"$f":"+A1444+1","v":1423},null,"CANYON CREEK 13-31 MESA","MESAVERDE",2.0480095700898606,15430.028999999999,31600.84705876408,0.21400050000000004,6762.5970709990434]
[1424,null,"CANYON CREEK 13B-4D MESA","MESAVERDE",2.0480095700898606,3822.2840000000006,7828.0742116013544,0.16319156100731588,1277.4756502723385]
[1425,null,"CANYON CREEK 225 MESA","MESAVERDE",2.0480095700898606,87196.944000000018,178580.17579458968,0.16319195705051903,29142.848378344817]
[1426,null,"CANYON CREEK 226 MESA","MESAVERDE",2.0480095700898606,53093.847000000002,108736.70676888684,0.16319224196663776,17744.98696168352]
[1427,null,"CANYON CREEK 25 UPPER MESA","MESAVERDE",2.0480095700898606,16605.147000000001,34007.49996874894,0.16319224196663776,5549.7601635805031]
[1428,null,"CANYON CREEK 2A-25D MESA","MESAVERDE",2.0480095700898606,44608.220999999998,91358.063512683482,0.16319195705051903,14908.901176980433]
[1429,null,"CANYON CREEK 2A-9D MESA","MESAVERDE",2.0480095700898606,38945.343000000001,79760.435174432161,0.16319156100731588,13016.22992273841]
[1430,null,"CANYON CREEK 2D-4W MESA","MESAVERDE",2.0480095700898606,10577.440999999999,21662.700395060863,0.16319156100731588,3535.1698931037809]
[1431,null,"CANYON CREEK 33 UPPER MESA","MESAVERDE",2.0480095700898606,32472.824999999997,66504.656367853269,0.16319195705051903,10853.025025642237]
[1432,null,"CANYON CREEK 35 MESA REC","MESAVERDE",2.0480095700898606,27040.754999999994,55379.725022455234,0.16319156100731588,9037.5037745703812]
[1433,null,"CANYON CREEK 39 UPPER MESA","MESAVERDE",2.0480095700898606,63646.451999999997,130348.54279826494,0.16319195705051903,21271.833797932195]
[1434,null,"CANYON CREEK 3A-25D MESA","MESAVERDE",2.0480095700898606,72913.471999999994,149327.48844447907,0.16319195705051903,24369.045080693304]
[1435,null,"CANYON CREEK 49 MESA","MESAVERDE",2.0480095700898606,25197.163,51604.030963114143,0.16319195705051903,8421.3628045661771]
[1436,null,"CANYON CREEK 50 MESA","MESAVERDE",2.0480095700898606,28134.544999999998,57619.817410123833,0.16319195705051903,9403.0907680516775]
[1437,null,"CANYON CREEK 79 MESA","MESAVERDE",2.0480095700898606,115020.21299999999,235562.49697777416,0.16319263801007278,38442.065298042762]
[1438,null,"CANYON CREEK 7B-25W MESA","MESAVERDE",2.0480095700898606,76786.339000000007,157259.15712416431,0.16319195705051903,25663.429615207446]
[1439,null,"CANYON CREEK 8C-25D MESA","MESAVERDE",2.0480095700898606,50863.573999999993,104169.0863209738,0.16319195705051903,16999.557060884166]
[1440,null,"CANYON CREEK SHALLOW 12-3 WAS","WASATCH",2.0480095700898606,1835.3390000000004,3758.7918363591557,0.16500000000000004,620.2006529992608]
[1441,null,"CANYON CREEK SHALLOW 4-16","WASATCH",2.0480095700898606,1984.0749999999998,4063.40458777604,0.16498060000000003,670.38292693404389]
[1442,null,"CANYON CREEK SHALLOW 6-35","WASATCH",2.0480095700898606,258.07000000000005,528.52982975309044,0.16247060000000002,85.870558557882461]
[1443,null,"CANYON CREEK SHALLOW 7-10","WASATCH",2.0480095700898606,1028.854,2107.1028382252334,0.16498060000000003,347.63109051210199]
[1444,null,"CANYON CREEK SHALLOW 9-25","WASATCH",2.0480095700898606,10844.405000000001,22209.445221930335,0.16247060000000002,3608.381890874155]
[1445,null,"CANYON CREEK UNIT 05B-03W MESA","MESAVERDE",2.0480095700898606,19899.092999999997,40753.532900108148,0.16319156100731588,6650.6326505316538]
[1446,null,"CANYON CREEK UNIT 06A-09W MESA","MESAVERDE",2.0480095700898606,50748.270000000004,103932.94262550418,0.9163192922925959,95235.760432488954]
[1447,null,"CANYON CREEK UNIT 10 MESA","MESAVERDE",2.0480095700898606,24889.600999999999,50974.141043718162,0.16319156100731588,8318.549647931457]
[1448,null,"CANYON CREEK UNIT 101 MESA","MESAVERDE",2.0480095700898606,46606.555,95450.67066891944,0.16319195705051903,15576.781748245538]
[1449,null,"CANYON CREEK UNIT 107 MESA","MESAVERDE",2.0480095700898606,7081.054000000001,14502.066358323091,0.16319195705051903,2366.6205902912388]
[1450,null,"CANYON CREEK UNIT 108 MESA","MESAVERDE",2.0480095700898606,5203.2849999999999,10656.377475905019,0.16319161657074216,1739.0314670809851]
[1451,null,"CANYON CREEK UNIT 10C-35J MESA","MESAVERDE",2.0480095700898606,21997.447999999997,45050.984021554061,0.16319156100731588,7351.9404073930527]
[1452,null,"CANYON CREEK UNIT 11 CC/TR","MESAVERDE",2.0480095700898606,13951.678,28573.170062812165,0.16319156100731588,4662.9002254778234]
[1453,null,"CANYON CREEK UNIT 11 MESA","MESAVERDE",2.0480095700898606,937.10400000000004,1919.1979601694889,0.16318301343240038,313.18050651377314]
[1454,null,"CANYON CREEK UNIT 110 MESA","MESAVERDE",2.0480095700898606,47069.843999999997,96399.490974636807,0.16319195705051903,15731.621590824827]
[1455,null,"CANYON CREEK UNIT 112 MESA","MESAVERDE",2.0480095700898606,37985.692999999999,77795.062790495431,0.16319138721769949,12695.484215468985]
[1456,null,"CANYON CREEK UNIT 113 MESA","MESAVERDE",2.0480095700898606,31978.025000000005,65491.301232572827,0.16319195705051903,10687.653617928629]
[1457,null,"CANYON CREEK UNIT 114 MESA","MESAVERDE",2.0480095700898606,31506.243999999999,64525.08922958625,0.16319195705051903,10529.975590235548]
[1458,null,"CANYON CREEK UNIT 115 MESA","MESAVERDE",2.0480095700898606,32882.748,67344.182594853221,0.16319195705051903,10990.028953621599]
[1459,null,"CANYON CREEK UNIT 116 MESA","MESAVERDE",2.0480095700898606,28979.669000000002,59350.639450036462,0.16319195705051903,9685.54700405119]
[1460,null,"CANYON CREEK UNIT 117 MESA","MESAVERDE",2.0480095700898606,22010.334000000003,45077.374672874248,0.16319195705051903,7356.2649915658485]
[1461,null,"CANYON CREEK UNIT 118 MESA","MESAVERDE",2.0480095700898606,29123.127,59644.44280694241,0.16319195705051903,9733.493348852684]
[1462,null,"CANYON CREEK UNIT 119 MESA","MESAVERDE",2.0480095700898606,64601.221999999987,132303.92089549961,0.16319195705051903,21590.935776393642]
[1463,null,"CANYON CREEK UNIT 11C-34W MESA","MESAVERDE",2.0480095700898606,32277.951999999997,66105.554598901159,0.16319156100731588,10787.86864624903]
[1464,null,"CANYON CREEK UNIT 12 ALMOND","MESAVERDE",2.0480095700898606,28550.199000000001,58471.080779969969,0.16319127609096529,9541.9702869012126]
[1465,null,"CANYON CREEK UNIT 121 MESA","MESAVERDE",2.0480095700898606,12375.841999999999,25345.842853920039,0.16319161657074216,4136.2290686792039]
[1466,null,"CANYON CREEK UNIT 122 MESA","MESAVERDE",2.0480095700898606,11837.694,24243.710599795322,0.16319224196663776,3956.3854863709389]
[1467,null,"CANYON CREEK UNIT 123 MESA","MESAVERDE",2.0480095700898606,21594.591999999997,44225.931078185939,0.16319195705051903,7217.3162450305344]
[1468,null,"CANYON CREEK UNIT 124 MESA","MESAVERDE",2.0480095700898606,36925.718000000001,75624.223846439432,5.2423504156027118E-2,3964.4868131101425]
[1469,null,"CANYON CREEK UNIT 125 MESA","MESAVERDE",2.0480095700898606,31306.962999999996,64116.959834449168,0.16319195705051903,10463.372155513283]
[1470,null,"CANYON CREEK UNIT 126 MESA","MESAVERDE",2.0480095700898606,67393.933999999994,138023.42179800442,0.16319195705051903,22524.312322025609]
[1471,null,"CANYON CREEK UNIT 129 MESA","MESAVERDE",2.0480095700898606,41421.445,84831.515766950804,0.1631928117982932,13843.893587119945]
[1472,null,"CANYON CREEK UNIT 13 MESA","MESAVERDE",2.0480095700898606,40826.464,83612.988984929165,0.16319195705051903,13644.96730729408]
[1473,null,"CANYON CREEK UNIT 13 UPPER MESA","MESAVERDE",2.0480095700898606,63855.649999999994,130776.98230430859,0.16319195705051903,21341.751679401215]
[1474,null,"CANYON CREEK UNIT 130 MESA","MESAVERDE",2.0480095700898606,32498.804000000004,66557.861608474646,0.16319195705051903,10861.707692984584]
[1475,null,"CANYON CREEK UNIT 131 MESA","MESAVERDE",2.0480095700898606,138076.76200000002,282782.52998302004,0.16319224196663776,46147.915056927006]
[1476,null,"CANYON CREEK UNIT 134 MESA","MESAVERDE",2.0480095700898606,172308.72099999999,352889.90961794375,0.16319224196663776,57588.895517956407]
[1477,null,"CANYON CREEK UNIT 13C-15W MESA","MESAVERDE",2.0480095700898606,19792.889000000003,40536.026091726337,0.16319156100731588,6615.1373749421073]
[1478,null,"CANYON CREEK UNIT 14 MESA","MESAVERDE",2.0480095700898606,3583.0190000000002,7338.0572018138027,0.16319156100731588,1197.5090095249709]
[1479,null,"CANYON CREEK UNIT 14 UPPER MESA ","MESAVERDE",2.0480095700898606,23960.474999999999,49071.282103898848,0.16319138721769949,8008.010599086324]
[1480,null,"CANYON CREEK UNIT 146 MESA","MESAVERDE",2.0480095700898606,37351.731,76496.702547422115,0.16319195705051903,12483.64659662524]
[1481,null,"CANYON CREEK UNIT 14A-04W MESA","MESAVERDE",2.0480095700898606,30185.539999999997,61820.274798330283,0.16319156100731588,10088.547146240749]
[1482,null,"CANYON CREEK UNIT 15 MESA","MESAVERDE",2.0480095700898606,43852.160000000003,89809.643349111793,0.16319156100731588,14656.175891651857]
[1483,null,"CANYON CREEK UNIT 16 UP MESA","MESAVERDE",2.0480095700898606,20255.667999999998,41483.801912562943,0.16318270853613154,6769.4391564683747]
[1484,null,"CANYON CREEK UNIT 160 MESA","MESAVERDE",2.0480095700898606,110446.95099999999,226196.41263524588,0.16319224196663776,36913.499702756482]
[1485,null,"CANYON CREEK UNIT 162 MESA","MESAVERDE",2.0480095700898606,85116.050999999992,174318.48701625664,0.16319604280784142,28448.087269303167]
[1486,null,"CANYON CREEK UNIT 163 MESA","MESAVERDE",2.0480095700898606,105688.12699999999,216450.29554087258,0.16319138721769949,35322.823992996033]
[1487,null,"CANYON CREEK UNIT 16C-09J MESA","MESAVERDE",2.0480095700898606,73989.67,151531.55224779065,0.16319156100731588,24728.670553178603]
[1488,null,"CANYON CREEK UNIT 17 MESA","MESAVERDE",2.0480095700898606,38270.710999999996,78378.782382143298,0.16319668946844978,12791.157809333843]
[1489,null,"CANYON CREEK UNIT 174 MESA","MESAVERDE",2.0480095700898606,64454.074000000001,132002.56038328007,0.16319224196663776,21541.793774283953]
[1490,null,"CANYON CREEK UNIT 178 MESA","MESAVERDE",2.0480095700898606,62972.18499999999,128967.63752946915,0.16319224196663776,21046.517909574763]
[1491,null,"CANYON CREEK UNIT 18 MESA","MESAVERDE",2.0480095700898606,21895.155999999999,44841.489026610434,0.16319156100731588,7317.7525921449824]
[1492,null,"CANYON CREEK UNIT 19 MESA","MESAVERDE",2.0480095700898606,16954.846999999998,34723.688915409359,0.16319156100731588,5666.6129980380847]
[1493,null,"CANYON CREEK UNIT 197 MESA","MESAVERDE",2.0480095700898606,2734.0560000000005,5599.3728531616052,0.16319195705051903,913.77261416299086]
[1494,null,"CANYON CREEK UNIT 216 MESA","MESAVERDE",2.0480095700898606,44161.078999999998,90442.312417494366,0.16319195705051903,14759.457963585364]
[1495,null,"CANYON CREEK UNIT 218 MESA","MESAVERDE",2.0480095700898606,34469.196000000004,70593.243281303148,0.16319195705051903,11520.249525619265]
[1496,null,"CANYON CREEK UNIT 219 MESA","MESAVERDE",2.0480095700898606,3142.26,6435.3785517105662,0.16319195705051903,1050.202020214582]
[1497,null,"CANYON CREEK UNIT 22 MESA","MESAVERDE",2.0480095700898606,58562.535000000003,119936.63212872243,0.16319184592347247,19572.680390930669]
[1498,null,"CANYON CREEK UNIT 23 MESA","MESAVERDE",2.0480095700898606,19996.112999999994,40952.230788598259,0.16319156100731588,6683.0584691232125]
[1499,null,"CANYON CREEK UNIT 24 MESA","MESAVERDE",2.0480095700898606,11921.573999999999,24415.497642534458,0.16319156100731588,3984.4031730556389]
[1500,null,"CANYON CREEK UNIT 25 MESA","MESAVERDE",2.0480095700898606,11540.557000000003,23635.171180167537,0.16319156100731588,3857.060479566665]
[1501,null,"CANYON CREEK UNIT 26 MESA","MESAVERDE",2.0480095700898606,2427.0909999999999,4970.7055954789694,0.16319156100731588,811.17720543401265]
[1502,null,"CANYON CREEK UNIT 26 UPR MESA","MESAVERDE",2.0480095700898606,6429.8489999999983,13168.392286232716,0.16319156100731588,2148.9704931470142]
[1503,null,"CANYON CREEK UNIT 27 MESA","MESAVERDE",2.0480095700898606,15331.175999999999,31398.39516873199,0.16319156100731588,5123.953120709939]
[1504,null,"CANYON CREEK UNIT 28 MESA","MESAVERDE",2.0480095700898606,15031.310000000001,30784.266730987427,0.16319156100731588,5023.7325422954191]
[1505,null,"CANYON CREEK UNIT 29 MESA","MESAVERDE",2.0480095700898606,16707.127,34216.355984706701,0.16319156100731588,5583.8205451263011]
[1506,null,"CANYON CREEK UNIT 3 MESA","MESAVERDE",2.0480095700898606,22301.898000000001,45674.500535167921,0.16319156100731588,7453.6930405635376]
[1507,null,"CANYON CREEK UNIT 32 MESA","MESAVERDE",2.0480095700898606,17515.471999999998,35871.85428064099,0.16319156100731588,5853.9838962847698]
[1508,null,"CANYON CREEK UNIT 37 MESA","MESAVERDE",2.0480095700898606,36310.788999999997,74364.843369513634,0.16319156100731588,12135.714873535475]
[1509,null,"CANYON CREEK UNIT 38 MESA","MESAVERDE",2.0480095700898606,26709.729999999996,54701.782654516246,0.16319156100731588,8926.869301273422]
[1510,null,"CANYON CREEK UNIT 39 MESA","MESAVERDE",2.0480095700898606,13040.71,26707.498880766543,0.16319156100731588,4358.4384329534341]
[1511,null,"CANYON CREEK UNIT 4 MESA","MESAVERDE",2.0480095700898606,33251.349000000002,68099.080970397918,0.16319156100731588,11113.195326722836]
[1512,null,"CANYON CREEK UNIT 40 W MESA","MESAVERDE",2.0480095700898606,25399.980000000003,52019.402120091065,0.16319156100731588,8489.1274346449391]
[1513,null,"CANYON CREEK UNIT 42 MESA","MESAVERDE",2.0480095700898606,28805.387999999999,58993.710294151628,0.16319195705051903,9627.2990365739552]
[1514,null,"CANYON CREEK UNIT 43 MESA","MESAVERDE",2.0480095700898606,35932.856,73590.832968660863,0.16319195705051903,12009.432053133623]
[1515,null,"CANYON CREEK UNIT 44 W MESA","MESAVERDE",2.0480095700898606,46400.644,95028.962970332665,0.16319156100731588,15507.924808035004]
[1516,null,"CANYON CREEK UNIT 45 MESA","MESAVERDE",2.0480095700898606,27911.105999999996,57162.212199792521,0.16319156100731588,9328.3906395155773]
[1517,null,"CANYON CREEK UNIT 46 MESA ","MESAVERDE",2.0480095700898606,58163.990000000005,119120.40815461097,0.16319309671382989,19439.62828856632]
[1518,null,"CANYON CREEK UNIT 48 MESA","MESAVERDE",2.0480095700898606,45906.077999999994,94016.087069291592,0.16319195705051903,15342.669243069691]
[1519,null,"CANYON CREEK UNIT 5 UP MESA","MESAVERDE",2.0480095700898606,24222.095999999998,49607.084415635327,0.16319156100731588,8095.4575428092212]
[1520,null,"CANYON CREEK UNIT 51 MESA","MESAVERDE",2.0480095700898606,42527.464999999997,87096.655311661583,0.16319195705051903,14213.473632864538]
[1521,null,"CANYON CREEK UNIT 6 MESA","MESAVERDE",2.0480095700898606,1979.5,4054.0349439928791,0.15704964840367813,636.68476257030659]
[1522,null,"CANYON CREEK UNIT 63 MESA","MESAVERDE",2.0480095700898606,36087.821000000004,73908.202771689845,0.16319156100731588,12061.194981557295]
[1523,null,"CANYON CREEK UNIT 64","MESAVERDE",2.0480095700898606,69306.866999999998,141941.12688894515,0.16319224196663776,23163.690724277971]
[1524,null,"CANYON CREEK UNIT 68 MESA","MESAVERDE",2.0480095700898606,19126.719000000001,39171.703556419568,0.16319195705051903,6392.5069643748857]
[1525,null,"CANYON CREEK UNIT 69 MESA","MESAVERDE",2.0480095700898606,37736.235999999997,77284.172467169512,0.16319138721769949,12612.111314889329]
[1526,null,"CANYON CREEK UNIT 7 MESA","MESAVERDE",2.0480095700898606,1879.2979999999998,3848.8202890507346,0.13321607213810671,512.72472127279138]
[1527,null,"CANYON CREEK UNIT 70 MESA","MESAVERDE",2.0480095700898606,34714.050000000003,71094.706616577925,0.1631928117982932,11602.145076734072]
[1528,null,"CANYON CREEK UNIT 71 MESA","MESAVERDE",2.0480095700898606,57205.618000000009,117157.65312690481,0.16319195705051903,19119.186697225457]
[1529,null,"CANYON CREEK UNIT 72 MESA","MESAVERDE",2.0480095700898606,38340.978999999999,78522.691918614379,0.16319195705051903,12814.271767073655]
[1530,null,"CANYON CREEK UNIT 73 MESA","MESAVERDE",2.0480095700898606,67335.714000000007,137904.18668083384,0.16319195705051903,22504.854109905395]
[1531,null,"CANYON CREEK UNIT 75 MESA","MESAVERDE",2.0480095700898606,26063.374999999996,53378.041428840814,0.16319195705051903,8710.8670442962157]
[1532,null,"CANYON CREEK UNIT 76 MESA","MESAVERDE",2.0480095700898606,122314.86500000001,250502.01408424936,0.16319224196663776,40879.985295566919]
[1533,null,"CANYON CREEK UNIT 77 MESA","MESAVERDE",2.0480095700898606,165498.84599999999,338943.22044682805,0.16319224196663776,55312.904044110204]
[1534,null,"CANYON CREEK UNIT 78 MESA","MESAVERDE",2.0480095700898606,154668.35999999999,316762.28147010377,0.16319224196663776,51693.14688357339]
[1535,null,"CANYON CREEK UNIT 8 MESA","MESAVERDE",2.0480095700898606,16940.540999999997,34694.390090499655,0.16319184592347247,5661.8415620576698]
[1536,null,"CANYON CREEK UNIT 80 MESA","MESAVERDE",2.0480095700898606,67483.876999999993,138207.62592276701,0.16319195705051903,22554.372953642396]
[1537,null,"CANYON CREEK UNIT 82 MESA","MESAVERDE",2.0480095700898606,68828.402000000002,140961.22598999212,0.16319263801007278,23003.834326440847]
[{"$f":"+A1559+1","v":1538},null,"CANYON CREEK UNIT 83 MESA","MESAVERDE",2.0480095700898606,83847.182000000001,171719.83116106631,0.16319263801007278,28023.412245818708]
[1539,null,"CANYON CREEK UNIT 84 MESA","MESAVERDE",2.0480095700898606,5219.0930000000008,10688.752411189002,0.16319195705051903,1744.3184244103873]
[1540,null,"CANYON CREEK UNIT 9 MESA","MESAVERDE",2.0480095700898606,246.99900000000002,505.85631580262555,0.16319156100731588,82.551481821240216]
[1541,null,"CANYON CREEK UNIT 95 MESA","MESAVERDE",2.0480095700898606,17201.307999999997,35228.443402063276,0.16319195705051903,5748.9986226261508]
[1542,null,"CANYON CREEK UNIT 96 MESA","MESAVERDE",2.0480095700898606,33209.725999999995,68013.836668062053,0.16319195705051903,11099.311112375399]
[1543,null,"CANYON CREEK UNIT 97 MESA","MESAVERDE",2.0480095700898606,22777.062999999998,46647.643002539669,0.16319195705051903,7612.5201533783984]
[1544,null,"CANYON CREEK UNIT 98 MESA","MESAVERDE",2.0480095700898606,16128.841,33032.020722457717,0.16319195705051903,5390.5601070311741]
[1545,null,"CANYON CREEK UNIT 99 MESA","MESAVERDE",2.0480095700898606,17984.125000000004,36831.660109692319,0.16319195705051903,6010.6306947202238]
[1546,null,"CANYON CREEK UNIT 65 MESA","MESAVERDE",2.0480095700898606,22688.495000000003,46466.254890935961,0.16319156100731588,7582.9006698156663]
[1547,null,"CANYON CREEK UNIT 66 MESA","MESAVERDE",2.0480095700898606,38614.700000000004,79083.275146148953,0.16319224196663776,12905.776973164529]
[1548,null,"CANYON CREEK UNIT 67 MESA","MESAVERDE",2.0480095700898606,32025.32,65588.161845190218,0.16319224196663776,10703.479177987281]
[1549,null,"CANYON CREEK UNIT 153 MESA","MESAVERDE",2.0480095700898606,13288.117999999999,27214.192832483335,0.16205668241123022,4410.2418049317293]
[1550,null,"CANYON CREEK 227 MESA","MESAVERDE",2.0480095700898606,309764.484,634400.6277059475,0.16500000000000004,104676.10357148136]
[1551,null,"CANYON CREEK 220 MESA","MESAVERDE",2.0480095700898606,240504.35399999999,492555.21864027961,0.16500000000000004,81271.611075646157]
[1552,null,"CANYON CREEK 11-30 MESA","MESAVERDE",2.0480095700898606,88046.962999999989,180321.02284134785,0.16319195705051903,29426.940614830899]
[1553,null,"CANYON CREEK 221 MESA","LANCE",2.0480095700898606,74005.87,151564.73000282611,0.16500000000000004,25008.180450466312]
[1554,null,"CANYON CREEK 15-11 MESA","MESAVERDE",2.0480095700898606,664.18499999999995,1360.257236310134,0.21540000000000004,292.99940870120292]
[1555,"TRAIL (WY)","TRAIL UNIT 03C-10J MESA","MESAVERDE",1.8480095700898607,119381.52400000002,220618.19884391243,0.17254442339236128,38066.439909384178]
[1556,null,"TRAIL UNIT 07A-03J MESA","MESAVERDE",1.8480095700898607,64906.024000000005,119946.95350848218,0.17254442339236128,20696.177930791426]
[1557,null,"TRAIL UNIT 104 MESA","MESAVERDE",1.8480095700898607,67335.494000000006,124436.6373187284,0.17257198175363464,21474.277104851248]
[1558,null,"TRAIL UNIT 10B-21D MESA","MESAVERDE",1.8480095700898607,40775.39,75353.310944146404,0.17250250110305895,12998.634604261759]
[1559,null,"TRAIL UNIT 114 MESA","MESAVERDE",1.8480095700898607,43603.291000000005,80579.299055413096,0.17254442339236128,13903.508692876894]
[1560,null,"TRAIL UNIT 115 MESA","MESAVERDE",1.8480095700898607,57211.154999999999,105726.76195589438,0.17254442339236128,18242.563178821238]
[1561,null,"TRAIL UNIT 116 MESA","MESAVERDE",1.8480095700898607,53947.271000000001,99695.073088231205,0.17254514929505801,17201.901269990572]
[1562,null,"TRAIL UNIT 11B-3D MESA","MESAVERDE",1.8480095700898607,212946.77300000002,393527.67442375317,0.17254442339236128,67901.00567238337]
[1563,null,"TRAIL UNIT 12 UPPER MESA","MESAVERDE",1.8480095700898607,149819.486,276867.84391394391,0.13600035617229708,37654.125384952327]
[1564,null,"TRAIL UNIT 13 MESA","MESAVERDE",1.8480095700898607,128801.53099999999,238026.46193022584,0.13600035617229708,32371.683600942426]
[1565,null,"TRAIL UNIT 132 MESA","MESAVERDE",1.8480095700898607,96766.085999999996,178824.65298813846,0.17254442339236128,30855.196638177447]
[1566,null,"TRAIL UNIT 14D-3W MESA","MESAVERDE",1.8480095700898607,178142.024,329208.16518717766,0.17254442339236128,56803.033038278794]
[1567,null,"TRAIL UNIT 15 MESA","MESAVERDE",1.8480095700898607,35606.585999999996,65801.311686227637,0.17253861612493668,11353.267257547341]
[1568,null,"TRAIL UNIT 15 UPPER MESA","MESAVERDE",1.8480095700898607,186944.61800000005,345475.4431407933,0.18225340825525801,62964.076980905178]
[1569,null,"TRAIL UNIT 155 MESA","MESAVERDE",1.8480095700898607,168959.35600000003,312238.50684421975,0.17254442339236128,53875.01312432775]
[1570,null,"TRAIL UNIT 16 MESA","MESAVERDE",1.8480095700898607,145002.55600000001,267966.11117549095,0.17254442339236128,46236.058141468464]
[1571,null,"TRAIL UNIT 16 UPPER MESA","MESAVERDE",1.8480095700898607,105001.51400000001,194043.80274592451,0.17254442339236128,33481.176057656638]
[1572,null,"TRAIL UNIT 16C-3D MESA","MESAVERDE",1.8480095700898607,112491.61000000002,207885.57183481631,0.17254442339236128,35869.496123829682]
[1573,null,"TRAIL UNIT 16D-9D MESA","MESAVERDE",1.8480095700898607,137548.62100000001,254191.16796066321,0.17254442339236128,43859.268507203495]
[1574,null,"TRAIL UNIT 17 MESA","MESAVERDE",1.8480095700898607,58342.109000000004,107816.7757712258,0.13600035617229708,14663.119906235399]
[1575,null,"TRAIL UNIT 18 MESA","MESAVERDE",1.8480095700898607,75949.724000000002,140355.81679768357,0.17254442339236128,24217.613479120209]
[1576,null,"TRAIL UNIT 1B-21D MESA","MESAVERDE",1.8480095700898607,29104.638000000003,53785.649558001031,0.17250250110305895,9278.1590722078145]
[1577,null,"TRAIL UNIT 1B-9D MESA","MESAVERDE",1.8480095700898607,143349.39299999998,264911.05013057246,0.17254442339236128,45708.924395044538]
[1578,null,"TRAIL UNIT 1D-16W MESA","MESAVERDE",1.8480095700898607,124007.004,229166.13015017164,0.17254442339236128,39541.337787820186]
[1579,null,"TRAIL UNIT 2 MESA","LANCE",1.8480095700898607,17994.866999999998,33254.68642849422,0.13600035617229708,4522.6491986732681]
[1580,null,"TRAIL UNIT 2 UPPER MESA","MESAVERDE",1.8480095700898607,63802.725999999995,117908.04824582116,0.13600035617229708,16035.536557012067]
[1581,null,"TRAIL UNIT 20 MESA","MESAVERDE",1.8480095700898607,24543.778999999999,45357.138478170549,0.17191984109024158,7797.7920394751627]
[1582,null,"TRAIL UNIT 21 MESA CC/TRAIL","MESAVERDE",1.8480095700898607,63073.912000000004,116561.19299900571,0.17254442339236128,20111.98383593918]
[1583,null,"TRAIL UNIT 21 UPPER MESA","MESAVERDE",1.8480095700898607,77090.937999999995,142464.7911912041,0.17254639725361337,24581.786455530582]
[1584,null,"TRAIL UNIT 22W MESA","MESAVERDE",1.8480095700898607,126556.17500000002,233877.0225539672,0.17254442339236128,40354.176001296546]
[1585,null,"TRAIL UNIT 23W MESA","MESAVERDE",1.8480095700898607,131489.74300000002,242994.30343265631,0.17254442339236128,41927.311973416159]
[1586,null,"TRAIL UNIT 25W MESA","MESAVERDE",1.8480095700898607,154762.18599999999,286002.00081602705,0.17254442339236128,49348.050319863032]
[1587,null,"TRAIL UNIT 26 MESA","MESAVERDE",1.8480095700898607,68360.726999999999,126331.27771430033,0.17254442339236128,21797.757469634213]
[1588,null,"TRAIL UNIT 27 MESA","MESAVERDE",1.8480095700898607,55924.46,103348.93728210761,0.17254442339236128,17832.282791554568]
[1589,null,"TRAIL UNIT 28 MESA","MESAVERDE",1.8480095700898607,154472.024,285465.77866315068,0.17254442339236128,49255.528177684762]
[1590,null,"TRAIL UNIT 29 MESA","MESAVERDE",1.8480095700898607,53369.397000000004,98627.15640592511,0.17254442339236128,17017.56583288858]
[1591,null,"TRAIL UNIT 3 MESA","MESAVERDE",1.8480095700898607,30908.307000000008,57118.847131275448,0.13600035617229708,7768.1835540044503]
[1592,null,"TRAIL UNIT 3 UPPER MESA","MESAVERDE",1.8480095700898607,175149.68800000002,323678.29962225328,0.13600035617229708,44020.364033869941]
[1593,null,"TRAIL UNIT 32 MESA","MESAVERDE",1.8480095700898607,89611.444999999992,165602.80794958118,0.17254442339236128,28573.841009816428]
[1594,null,"TRAIL UNIT 33 MESA","MESAVERDE",1.8480095700898607,38645.002999999997,71416.335380151373,0.17251001251755713,12320.032910387972]
[1595,null,"TRAIL UNIT 35 MESA","MESAVERDE",1.8480095700898607,57297.470999999998,105886.27474994626,0.17254442339236128,18270.08622189462]
[1596,null,"TRAIL UNIT 37 MESA","MESAVERDE",1.8480095700898607,71816.999000000011,132718.50144713398,0.17254442339236128,22899.837305694]
[1597,null,"TRAIL UNIT 38 MESA","MESAVERDE",1.8480095700898607,95423.318000000014,176343.2048737281,0.17254442339236128,30427.036604098448]
[1598,null,"TRAIL UNIT 3C-15D MESA","MESAVERDE",1.8480095700898607,69059.834000000003,127623.23414081715,0.17254442339236128,22020.677346295612]
[1599,null,"TRAIL UNIT 4 UPPER MESA","MESAVERDE",1.8480095700898607,89095.678000000014,164649.66559764469,0.13600035617229708,22392.413164929287]
[1600,null,"TRAIL UNIT 40 MESA","MESAVERDE",1.8480095700898607,37794.14,69843.932413316012,0.17254442339236128,12051.181045710664]
[1601,null,"TRAIL UNIT 41 MESA","MESAVERDE",1.8480095700898607,51507.967000000004,95187.215951872742,0.17251001251755713,16420.747815368981]
[{"$f":"+A1623+1","v":1602},null,"TRAIL UNIT 43 MESA","MESAVERDE",1.8480095700898607,63934.772000000004,118152.07051751328,0.17254442339236128,20386.480880057938]
[1603,null,"TRAIL UNIT 44 MESA","MESAVERDE",1.8480095700898607,48609.917000000001,89831.591817273817,0.17254442339236128,15499.940212529471]
[1604,null,"TRAIL UNIT 45 MESA","MESAVERDE",1.8480095700898607,45849.790000000008,84730.850706610407,0.17254442339236128,14619.83577871634]
[1605,null,"TRAIL UNIT 46 MESA","MESAVERDE",1.8480095700898607,58921.57,108887.62524471963,0.17254442339236128,18787.952512413671]
[1606,null,"TRAIL UNIT 47 MESA","MESAVERDE",1.8480095700898607,80218.675000000003,148244.87909992825,0.17254442339236128,25578.827185167429]
[1607,null,"TRAIL UNIT 48 MESA","MESAVERDE",1.8480095700898607,55262.983999999997,102126.52330372285,0.17254442339236128,17621.362076507405]
[1608,null,"TRAIL UNIT 49 MESA","MESAVERDE",1.8480095700898607,112049.739,207068.98999807111,0.1822542855269256,37739.210826880553]
[1609,null,"TRAIL UNIT 4C-22D MESA","MESAVERDE",1.8480095700898607,55030.899000000005,101697.62800264855,0.17254442339236128,17547.358584087848]
[1610,null,"TRAIL UNIT 4D-16W MESA","MESAVERDE",1.8480095700898607,82892.689999999988,153186.48441049206,0.17254442339236128,26431.473624111295]
[1611,null,"TRAIL UNIT 50 MESA","MESAVERDE",1.8480095700898607,50489.289999999994,93304.691107042294,0.17254442339236128,16099.204126866993]
[1612,null,"TRAIL UNIT 51 MESA","MESAVERDE",1.8480095700898607,51338.873999999996,94874.730469637521,0.17254442339236128,16370.105663389297]
[1613,null,"TRAIL UNIT 52 MESA","MESAVERDE",1.8480095700898607,68253.656000000003,126133.40948162125,0.17254442339236128,21763.616409518934]
[1614,null,"TRAIL UNIT 53 MESA","MESAVERDE",1.8480095700898607,129962.302,240171.57784690862,0.1822542855269256,43772.299324362721]
[1615,null,"TRAIL UNIT 54 MESA","MESAVERDE",1.8480095700898607,103633.87099999998,191516.38539345804,0.1822542855269256,34904.681986584023]
[1616,null,"TRAIL UNIT 55 MESA","MESAVERDE",1.8480095700898607,71314.63900000001,131790.13535950362,0.17254442339236128,22739.652914406797]
[1617,null,"TRAIL UNIT 56 MESA","MESAVERDE",1.8480095700898607,43929.623000000007,81182.363714439663,0.17254442339236128,14007.564136736944]
[1618,null,"TRAIL UNIT 57 MESA","MESAVERDE",1.8480095700898607,32751.614000000001,60525.296107889066,0.17254442339236128,10443.302317587648]
[1619,null,"TRAIL UNIT 5D-22D MESA","MESAVERDE",1.8480095700898607,60900.602000000006,112544.89532023371,0.17250250110305895,19414.275929122272]
[1620,null,"TRAIL UNIT 6 UPPER MESA","MESAVERDE",1.8480095700898607,130302.09299999999,240799.51486673902,0.13600035617229708,32748.819787992852]
[1621,null,"TRAIL UNIT 61 MESA","MESAVERDE",1.8480095700898607,29067.858,53717.67976601312,0.17254442339236128,9268.686081202246]
[1622,null,"TRAIL UNIT 62 MESA","MESAVERDE",1.8480095700898607,47904.02900000001,88527.104037862242,0.17254442339236128,15274.85812080852]
[1623,null,"TRAIL UNIT 6-22W MESA","MESAVERDE",1.8480095700898607,128508.90900000001,237485.69367380705,0.17254442339236128,40976.832078881976]
[1624,null,"TRAIL UNIT 63 MESA","MESAVERDE",1.8480095700898607,57323.092000000004,105933.62260314154,0.17254442339236128,18278.255829923066]
[1625,null,"TRAIL UNIT 64 MESA","MESAVERDE",1.8480095700898607,35719.925999999999,66010.765090901637,0.17254442339236128,11389.789400298234]
[1626,null,"TRAIL UNIT 67 MESA","MESAVERDE",1.8480095700898607,141541.065,261569.24268071103,0.17257198175363464,45139.522575207695]
[1627,null,"TRAIL UNIT 68 MESA","MESAVERDE",1.8480095700898607,98222.328999999998,181515.80398851485,0.17254442339236128,31319.539735799168]
[1628,null,"TRAIL UNIT 70 MESA","MESAVERDE",1.8480095700898607,113626.40700000002,209982.68755092556,0.17254442339236128,36231.341745852813]
[1629,null,"TRAIL UNIT 71 MESA","MESAVERDE",1.8480095700898607,80749.495999999999,149225.84138793292,0.17257198175363464,25752.199177169136]
[1630,null,"TRAIL UNIT 74 MESA","MESAVERDE",1.8480095700898607,87199.506000000008,161145.52159510824,0.17254442339236128,27804.761105889254]
[1631,null,"TRAIL UNIT 75 MESA","MESAVERDE",1.8480095700898607,105826.87400000001,195569.07592469387,0.17254442339236128,33744.353438803228]
[1632,null,"TRAIL UNIT 7B-21D MESA","MESAVERDE",1.8480095700898607,42834.232000000004,79158.070663449354,0.17250250110305895,13654.965171937691]
[1633,null,"TRAIL UNIT 7C-10W MESA","MESAVERDE",1.8480095700898607,149324.367,275952.85926361056,0.17254442339236128,47614.126985113107]
[1634,null,"TRAIL UNIT 8 MESA","MESAVERDE",1.8480095700898607,14560.936999999998,26908.750925475542,0.13600035617229708,3659.5997100163027]
[1635,null,"TRAIL UNIT 83 MESA","MESAVERDE",1.8480095700898607,42581.29099999999,78690.633274781241,0.17254438555028606,13577.626966960024]
[1636,null,"TRAIL UNIT 8C-16D MESA","MESAVERDE",1.8480095700898607,142409.50100000002,263174.1207197216,0.17254442339236128,45409.226911376041]
[1637,null,"TRAIL UNIT 8C-21W MESA","MESAVERDE",1.8480095700898607,30919.734999999997,57139.966184642413,0.17250250110305895,9856.7870797950291]
[1638,null,"TRAIL UNIT 93 MESA","MESAVERDE",1.8480095700898607,65432.127000000008,120919.19688733517,0.17254442339236128,20863.933103992655]
[1639,null,"TRAIL UNIT 94 MESA","MESAVERDE",1.8480095700898607,76261.84599999999,140932.62124071913,0.17254442339236128,24317.137869153932]
[1640,null,"TRAIL UNIT 95 MESA","MESAVERDE",1.8480095700898607,117407.45599999998,216970.10228790418,0.1822542855269256,39543.730973185942]
[1641,null,"TRAIL UNIT 9D-4D MESA","MESAVERDE",1.8480095700898607,147381.66200000004,272362.72183174925,0.17254442339236128,46994.668792033262]
[1642,null,"TRAIL UNIT 177 MESA","MESAVERDE",1.8480095700898607,158674.41,293231.82820836228,0.17254442339236128,50595.516718499806]
[1643,null,"TRAIL UNIT 105 MESA","MESAVERDE",1.8480095700898607,88448.964000000007,163454.53193653357,0.17254442339236128,28203.16796385749]
[1644,null,"TRAIL UNIT 106 MESA","MESAVERDE",1.8480095700898607,138870.29299999998,256633.63046518294,0.1822542855269256,46772.578962612963]
[1645,null,"TRAIL UNIT 82 MESA","MESAVERDE",1.8480095700898607,81553.103000000003,150710.91481452412,0.1822542855269256,27467.71010063044]
[1646,null,"TRAIL UNIT 84 MESA","LANCE",1.8480095700898607,122365.273,226132.19555065845,0.17254442339236128,39017.849291737046]
[1647,null,"TRAIL BUFFER 22-9 MESA","LANCE",1.8480095700898607,274065.46899999998,506475.60954316601,0.15000000000000002,75971.34143147491]
[1648,"WHISKEY CANYON (WY)","WHISKEY CANYON 16-13 ALMOND","ALMOND",1.8480095700898607,56639.578000000001,104670.48218985113,0.14633312000000001,15316.758230745349]
[1649,null,"WHISKEY CANYON UNIT 10 MESA","MESAVERDE",1.8480095700898607,366203.93900000001,676748.38387660356,0.14633333333333334,99030.846840609665]
[1650,null,"WHISKEY CANYON UNIT 12 MESA","MESAVERDE",1.8480095700898607,382015.92200000002,705969.0797827018,0.14633333333333334,103306.80867486871]
[1651,null,"WHISKEY CANYON UNIT 13 MESA","MESAVERDE",1.8480095700898607,526766.43900000001,973469.42047415685,0.14633333333333334,142451.02519605163]
[1652,null,"WHISKEY CANYON UNIT 15 MESA","MESAVERDE",1.8480095700898607,284618.36800000007,525977.46788735793,0.14633333333333334,76968.036134183378]
[1653,null,"WHISKEY CANYON UNIT 3 MESA","MESAVERDE",1.8480095700898607,55871.436000000002,103250.94842266316,0.1516666666666667,15659.727177437249]
[1654,null,"WHISKEY CANYON UNIT 4-26 ALMOND","ALMOND",1.8480095700898607,26568.970999999994,49099.712675439965,0.12499994482758617,6137.4613754803286]
[1655,null,"WHISKEY CANYON UNIT 5 MESA","MESAVERDE",1.8480095700898607,345737.28,638925.80217683781,0.14633333333333334,93496.142385210609]
[1656,null,"WHISKEY CANYON UNIT 8 MESA","MESAVERDE",1.8480095700898607,256436.53700000001,473897.17449670268,0.14633333333333334,69346.953201350829]
[1657,null,"WHISKEY CANYON UNIT 9 MESA","MESAVERDE",1.8480095700898607,238213.92500000002,440221.61312866834,0.14633333333333334,64419.096054495138]
[1658,null,"WHISKEY CANYON UNIT 9-23 ALMOND","ALMOND",1.8480095700898607,28285.777000000002,52272.386593427669,0.1516666666666667,7927.9786333365319]
[]
[{"$f":"A1680+1","v":1659},"Totals Before Adjustment",null,null,null,{"$f":"SUM(F1443:F1680)","v":16457522.488000004},{"$f":"SUM(G1443:G1680)","v":31532067.457193084},null,{"$f":"SUM(I1443:I1680)","v":5228882.2337412648}]
[]
[{"$f":"+A1682+1","v":1660},"Test-Year Adjustment for IRP Production Forecast",null,null,null,{"$f":"F1692-F1682","v":-4278535.4880000036},null,"+",{"$f":"I1682/F1682*F1684","v":-1359375.8243956366}]
[]
[]
[{"$f":"+A1684+1","v":1661},"Total Wexpro II Test-Year Royalties",null,null,null,null,null,null,{"$f":"I1682+I1684","v":3869506.4093456282}]
[]
[{"$f":"+A1687+1","v":1662},"Wexpro II Operator Service Fee",null,null,null,null,null,"+",{"$f":"'Monthly Inputs'!S109","v":34179099.044726923}]
[]
[]
[{"$f":"+A1689+1","v":1663},"Total Wexpro II Company Production",null,null,null,{"$f":"'Monthly Inputs'!S13","v":12178987},null,null,{"$f":"I1687+I1689","v":38048605.45407255}]
[]
[]
[]
[null,"TOTAL WEXPRO"]
[null,null,null,null,null,"Base Year",null,null,"Test-Year"]
[null,null,null,null,null,"Dth",null,null,"Royalty $"]
[]
[{"$f":"+A1692+1","v":1664},"Total Wexpro Test-Year Royalties",null,null,null,null,null,null,{"$f":"I1687+I1432","v":19598067.029236555}]
[]
[{"$f":"+A1700+1","v":1665},"Total Wexpro Operator Service Fee",null,null,null,null,null,"+",{"$f":"I1689+I1434","v":203683920.79588157}]
[]
[]
[{"$f":"+A1702+1","v":1666},"Total Wexpro Company Production",null,null,null,{"$f":"F1692+F1437","v":62236745},null,null,{"$f":"I1700+I1702","v":223281987.82511812}]

{"sheet":"SDR#1","index":14,"n_rows":41,"n_cols":5,"rows_kept":41,"cut":false,"hidden":false,"merged":[[3,1,3,4],[4,1,4,4]]}
[null,null,null,null,{"$f":"'Control Panel'!E32","v":"Dominion Energy Utah"}]
[null,null,null,null,{"$f":"'Control Panel'!E33","v":"Docket No. 19-057-18"}]
[]
[null,"Standard Data Request #1"]
[null,"Summary of Sources of Supply and Demand"]
[]
[]
[1,"DEMAND","Total","Utah","Wyoming"]
[]
[{"$f":"A8+1","v":2},"SALES IN DTHS",{"$f":"D10+E10","v":117352653},{"$f":"Calculations!P20","v":113424472},{"$f":"Calculations!P39","v":3928181}]
[{"$f":"A10+1","v":3},"DIST. CO. USE &",0]
[{"$f":"A11+1","v":4},"DIST. LOST & UNACCT.  (0.49%)",{"$f":"Calculations!P148","v":530474}]
[]
[]
[{"$f":"A12+1","v":5},"TOTAL",{"$f":"SUM(C10:C12)","v":117883127}]
[]
[]
[]
[{"$f":"A15+1","v":6},"SUPPLY","Total","Utah","Wyoming"]
[]
[{"$f":"A19+1","v":7},"COMPANY PRODUCTION",{"$f":"'Royalty Detail'!F1437+'Royalty Detail'!F1692","v":62236745},{"$f":"$D$10/$C$10*C21","v":60153475.530064411},{"$f":"$E$10/$C$10*C21","v":2083269.4699355881}]
[{"$f":"A21+1","v":8},"   GAS REIMBURSEMENT",{"$f":"C21*-'Other Inputs'!$E$269","v":-2310290.2111450001},{"$f":"D21*-'Other Inputs'!$E$269","v":-2232957.1651515211},{"$f":"E21*-'Other Inputs'!$E$269","v":-77333.045993478969}]
[]
[]
[{"$f":"A22+1","v":9},"CONTRACT GAS",{"$f":"'Ut 1.2 p4'!F24","v":61970614},{"$f":"$D$10/$C$10*C25","v":59896252.813865297},{"$f":"$E$10/$C$10*C25","v":2074361.1861347011}]
[{"$f":"A25+1","v":10},"   GAS REIMBURSEMENT",{"$f":"C25*-'Other Inputs'!$E$268","v":-972938.63979999989},{"$f":"D25*-'Other Inputs'!$E$268","v":-940371.16917768505},{"$f":"E25*-'Other Inputs'!$E$268","v":-32567.470622314806}]
[]
[{"$f":"A26+1","v":11},"STORAGE"]
[{"$f":"A28+1","v":12},"   INJECTIONS",{"$f":"'Ut 1.2 p5'!G18","v":-18154302},{"$f":"$D$10/$C$10*C29","v":-17546617.534744136},{"$f":"$E$10/$C$10*C29","v":-607684.46525586431}]
[{"$f":"A29+1","v":13},"   WITHDRAWALS",{"$f":"'Ut 1.2 p5'!G17","v":16042662},{"$f":"$D$10/$C$10*C30","v":15505661.101879513},{"$f":"$E$10/$C$10*C30","v":537000.89812048816}]
[{"$f":"A30+1","v":14},"NET (INJECTIONS) WITHDRAWALS",{"$f":"C29+C30","v":-2111640},{"$f":"D29+D30","v":-2040956.4328646231},{"$f":"E29+E30","v":-70683.567135376157}]
[]
[{"$f":"A31+1","v":15},"Storage Fuel",{"$f":"Calculations!P165+Calculations!P166-1","v":-929364.75619999995},{"$f":"D10/C10*C33","v":-898255.84741909266},{"$f":"E10/C10*C33","v":-31108.908780907339}]
[]
[]
[{"$f":"A33+1","v":16},"TOTAL SUPPLY",{"$f":"C21+C22+C25+C26+C29+C30+C33","v":117883125.392855},{"$f":"SUM(D21:D30)+D33","v":113937187.72931679},{"$f":"SUM(E21:E30)+E33","v":3945937.663538212}]
[]
[{"$f":"A36+1","v":17},"Company Use & Loss %",{"$f":"(+C36-C10)/C36","v":4.4999858214410373E-3},{"$f":"(+D36-D10)/D36","v":4.4999858214409905E-3},{"$f":"(+E36-E10)/E36","v":4.499985821440994E-3}]
[]
[]
[null,"Difference",{"$f":"C15-C36","v":1.6071449965238571}]

{"sheet":"SDR#2","index":15,"n_rows":70,"n_cols":25,"rows_kept":70,"cut":false,"hidden":false,"merged":[[28,9,28,11],[4,0,4,6],[5,0,5,6],[9,20,9,22],[8,20,8,22],[8,2,8,3]]}
[null,null,null,null,null,null,null,{"$f":"'Control Panel'!E32","v":"Dominion Energy Utah"}]
[null,null,null,null,null,null,null,{"$f":"'Control Panel'!E33","v":"Docket No. 19-057-18"}]
[]
[]
["Standard Data Request #2"]
["Supplier Non-Gas Costs"]
[]
[null," (A)  ","(B)","(C)","(D)","(E)","(F)",null,null,null,null,null,null,null,null,null,null,null,null,"withdraw"]
["I.  Transportation (QPC T-1)",null,"Volume (Dth)",null,null,null,"Utah Total",null,null,"Utah gas","Utah Co.","Utah gas","Wyo gas","Wyo Co.","Wyo gas",null,"@city gate","@city gate",null,"loss","Kern River"]
[null,"Month ","Utah","Wyoming","$/dth","Demand","b*d+e*(Ut %)",null,null,"purchased","production","withdrawn","purchased","production","withdrawn","Total","purchased","co production","withdrawls",{"$f":"-Calculations!P165/Calculations!P137","v":3.0163302910701476E-2},"Transportation"]
[]
[null,"Oct19",{"$f":"J12+K12+L12-(T12+$B$48*U12)*$J$39","v":9706333.4892331623},{"$f":"M12+N12+O12-(T12+$B$48*U12)*$K$39","v":336155.27689711831},{"$f":"'Other Inputs'!$F$40","v":2.6700000000000001E-3},{"$f":"('Other Inputs'!$D$28)*('Other Inputs'!$F$28)-('Other Inputs'!$E$273/12)+('Other Inputs'!$D$35*'Other Inputs'!$F$35)","v":4111924.2103399993},{"$f":"(+C12)*E12+F12*$J$33/$L$33","v":4011735.5348523613},null,null,{"$f":"Q12*$J$39","v":5121811.9834330333},{"$f":"R12*$J$39","v":5265816.2485966124},{"$f":"S12*$J$39","v":0},{"$f":"Q12-J12","v":177381.51356696617},{"$f":"R12-K12","v":182368.75140338764},{"$f":"S12-L12","v":0},{"$f":"SUM(J12:O12)-U12","v":9700828.4970000014},{"$f":"Calculations!D169","v":5299193.4969999995},{"$f":"Calculations!D161","v":5448185},{"$f":"Calculations!D163+Calculations!D164","v":0},{"$f":"S12*$T$10","v":0},{"$f":"V12*W12","v":1046550},34885,30,{"$f":"B12","v":"Oct19"},4]
[null,"Nov19",{"$f":"J13+K13+L13-(T13+$B$48*U13)*$J$39","v":12847882.822833354},444955.20503617922,{"$f":"'Other Inputs'!$F$40","v":2.6700000000000001E-3},{"$f":"('Other Inputs'!$D$28)*('Other Inputs'!$F$28)-('Other Inputs'!$E$273/12)+('Other Inputs'!$D$35*'Other Inputs'!$F$35)","v":4111924.2103399993},{"$f":"(+C13)*E13+F13*$J$33/$L$33","v":4020123.4715730739},null,null,{"$f":"Q13*$J$39","v":7198957.1913999459},{"$f":"R13*$J$39","v":4988744.9401633553},1406613.3637968628,249318.39100005385,172773.05983664468,48714.636203137226,{"$f":"SUM(J13:O13)-U13","v":12983686.582400002},{"$f":"Calculations!E169","v":7448275.5823999997},{"$f":"Calculations!E161","v":5161518},{"$f":"Calculations!E163+Calculations!E164","v":1455328},{"$f":"S13*$T$10","v":43897.499298425355},{"$f":"V18*W18","v":1081435},34885,31,{"$f":"B13","v":"Nov19"},5]
[null,"Dec19",16429642.342891354,569000.74340342858,{"$f":"'Other Inputs'!$F$40","v":2.6700000000000001E-3},{"$f":"('Other Inputs'!$D$28)*('Other Inputs'!$F$28)-('Other Inputs'!$E$273/12)+('Other Inputs'!$D$35*'Other Inputs'!$F$35)","v":4111924.2103399993},{"$f":"(+C14)*E14+F14*$J$33/$L$33","v":4029686.7694916287},null,null,{"$f":"Q14*$J$39","v":9963341.9158993084},5176881.2946413746,3703388.1495709522,345056.13930069096,179288.70535862539,128257.8504290483,15959664.055199999,{"$f":"Calculations!F169","v":10308398.055199999},{"$f":"Calculations!F161","v":5356170},{"$f":"Calculations!F163+Calculations!F164","v":3831646.0000000005},115575.09894457768,{"$f":"V19*W19","v":3536550},34885,30,"Dec19",6]
[null,"Jan20",16839201.853683032,583184.84195194207,{"$f":"'Other Inputs'!$F$40","v":2.6700000000000001E-3},{"$f":"('Other Inputs'!$D$28)*('Other Inputs'!$F$28)-('Other Inputs'!$E$273/12)+('Other Inputs'!$D$35*'Other Inputs'!$F$35)","v":4111924.2103399993},4030780.2933854423,null,null,{"$f":"Q15*$J$39","v":11441795.626534108},5056785.5199991092,3863876.0413761074,396258.7913658917,175129.48000089079,133815.95862389216,15834551.4179,{"$f":"Calculations!G169","v":11838054.4179},{"$f":"Calculations!G161","v":5231915},{"$f":"Calculations!G163+Calculations!G164","v":3997691.9999999995},120583.59473968799,5233110,34885,31,"Jan20",7]
[null,"Feb20",13729949.894938387,475503.45491799165,{"$f":"'Other Inputs'!$F$40","v":2.6700000000000001E-3},{"$f":"('Other Inputs'!$D$28)*('Other Inputs'!$F$28)-('Other Inputs'!$E$273/12)+('Other Inputs'!$D$35*'Other Inputs'!$F$35)","v":4111924.2103399993},4022478.5906555941,null,null,8952365.0048407223,4742778.3938687434,3548550.572832061,310043.41035927646,164254.60613125656,122895.42716793949,12607777.415199999,{"$f":"Calculations!H169","v":9262408.4151999988},{"$f":"Calculations!H161","v":4907033},{"$f":"Calculations!H163+Calculations!H164","v":3671446.0000000005},110742.9378182833,5233110,34885,31,"Feb20",8]
[null,"Mar20",10398711.211907828,360134.09705009032,{"$f":"'Other Inputs'!$F$40","v":2.6700000000000001E-3},{"$f":"('Other Inputs'!$D$28)*('Other Inputs'!$F$28)-('Other Inputs'!$E$273/12)+('Other Inputs'!$D$35*'Other Inputs'!$F$35)","v":4111924.2103399993},4013584.1833719029,null,null,5740972.9038318405,4951409.9469406977,2983232.9743035296,198824.64766815957,171480.0530593032,103317.0256964704,9253747.5515000001,{"$f":"Calculations!I169","v":5939797.5515000001},{"$f":"Calculations!I161","v":5122890.0000000009},{"$f":"Calculations!I163+Calculations!I164","v":3086550},93100.542599025634,4895490,34885,30,"Mar20",9]
[null,"Apr20",6964910.0555911213,241212.73711621872,{"$f":"'Other Inputs'!$F$40","v":2.6700000000000001E-3},{"$f":"('Other Inputs'!$D$28)*('Other Inputs'!$F$28)-('Other Inputs'!$E$273/12)+('Other Inputs'!$D$35*'Other Inputs'!$F$35)","v":4111924.2103399993},{"$f":"(+C18)*E18+F18*$J$33/$L$33","v":4004415.9342845371},null,null,4647785.7580079408,4696128.982874346,0,160964.76699205954,162639.01712565403,0,6013083.5250000022,{"$f":"Calculations!J169","v":4808750.5250000004},{"$f":"Calculations!J161","v":4858768},{"$f":"Calculations!J163+Calculations!J164","v":0},0,3654435,34885,31,"Apr20",10]
[null,"May20",6637309.941011711,229867.10311856944,{"$f":"'Other Inputs'!$F$40","v":2.6700000000000001E-3},{"$f":"('Other Inputs'!$D$28)*('Other Inputs'!$F$28)-('Other Inputs'!$E$273/12)+('Other Inputs'!$D$35*'Other Inputs'!$F$35)","v":4111924.2103399993},4003541.2419786099,null,null,2553061.686662728,4765542.9971454674,0,88419.088337272406,165043.00285453256,0,6525516.7750000004,{"$f":"Calculations!K169","v":2641480.7750000004},{"$f":"Calculations!K161","v":4930586},{"$f":"Calculations!K163+Calculations!K164","v":0},0,{"$f":"V12*W12","v":1046550},117885,30,"May20",11]
[null,"Jun20",5659459.5635860451,196001.63118191075,{"$f":"'Other Inputs'!$F$40","v":2.6700000000000001E-3},{"$f":"('Other Inputs'!$D$28)*('Other Inputs'!$F$28)-('Other Inputs'!$E$273/12)+('Other Inputs'!$D$35*'Other Inputs'!$F$35)","v":4111924.2103399993},{"$f":"(+C20)*E20+F20*$J$33/$L$33","v":4000930.3814708837},null,null,1829309.5581320517,4534154.5730103608,0,63353.691867948277,157029.42698963918,0,5502412.25,{"$f":"Calculations!L169","v":1892663.25},{"$f":"Calculations!L161","v":4691184},{"$f":"Calculations!L163+Calculations!L164","v":0},0,{"$f":"V13*W13","v":1081435},168810,31,"Jun20",12]
[null,"Jul20",4202538.0738593088,145544.6952709709,{"$f":"'Other Inputs'!$F$40","v":2.6700000000000001E-3},{"$f":"('Other Inputs'!$D$28)*('Other Inputs'!$F$28)-('Other Inputs'!$E$273/12)+('Other Inputs'!$D$35*'Other Inputs'!$F$35)","v":4111924.2103399993},{"$f":"(+C21)*E21+F21*$J$33/$L$33","v":3997040.401093313},null,null,271178.87842958269,4612653.9382262109,0,9391.6215704173082,159748.06177378912,0,4006422.5,{"$f":"Calculations!M169","v":280570.5},{"$f":"Calculations!M161","v":4772402},{"$f":"Calculations!M163+Calculations!M164","v":0},0,{"$f":"V14*W14","v":1046550},168810,31,"Jul20",1]
[null,"Aug20",3997616.9449010803,138447.74986687582,{"$f":"'Other Inputs'!$F$40","v":2.6700000000000001E-3},{"$f":"('Other Inputs'!$D$28)*('Other Inputs'!$F$28)-('Other Inputs'!$E$273/12)+('Other Inputs'!$D$35*'Other Inputs'!$F$35)","v":4111924.2103399993},{"$f":"(+C22)*E22+F22*$J$33/$L$33","v":3996493.2616789946},null,null,48977.532173985026,4652643.9802834624,0,1696.217826014974,161133.01971653756,0,3783015.75,{"$f":"Calculations!N169","v":50673.75},{"$f":"Calculations!N161","v":4813777},{"$f":"Calculations!N163+Calculations!N164","v":0},0,{"$f":"V15*W15","v":1081435},168810,29,"Aug20",2]
[null,"Sep20",4959297.1737710005,171753.20799695596,{"$f":"'Other Inputs'!$F$40","v":2.6700000000000001E-3},{"$f":"('Other Inputs'!$D$28)*('Other Inputs'!$F$28)-('Other Inputs'!$E$273/12)+('Other Inputs'!$D$35*'Other Inputs'!$F$35)","v":4111924.2103399993},{"$f":"(+C23)*E23+F23*$J$33/$L$33","v":3999060.9478900773},null,null,1186323.0215602391,4476978.7197671281,0,41085.415439760778,155049.28023287188,0,4778001.4369999999,{"$f":"Calculations!O169","v":1227408.4369999999},{"$f":"Calculations!O161","v":4632028},{"$f":"Calculations!O163+Calculations!O164","v":0},0,{"$f":"V16*W16","v":1081435},117885,31,"Sep20",3]
[]
[]
[null,null,{"$f":"SUM(C12:C23)","v":112372853.36820738},{"$f":"SUM(D12:D23)","v":3891760.7438082518},null,null,{"$f":"SUM(G12:G23)","v":48129871.011726417},null,null,{"$f":"SUM(J12:J25)","v":58955881.060905486},57920519.535516873,15505661.101879515,2041793.6952945122,2005936.4644831326,537000.89812048757,{"$f":"SUM(P12:P23)","v":106948707.75620002},60997674.756199986,59926456,16042662,483899.67339999997,30018085]
[]
[]
[null,null,"Months",null,null,"System","Utah",null,null,"Allocation Factors"]
[null,null,"or Days","Dth","Rate","Total","Total"]
[null,null,null,null,null,null,null,null,null,"Peak Demand Allocation Base"]
["II.  Transportation (ML 104  demand)",null,{"$f":"'Other Inputs'!E29","v":12},{"$f":"'Other Inputs'!D29","v":30000},{"$f":"'Other Inputs'!F29","v":5.2880399999999996},{"$f":"C32*D32*E32","v":1903694.4},{"$f":"F32*J34","v":1845311.8565192907},null,null,"Utah","Wyo","Total"]
[null,null," "," "," "," "," ",null,null,{"$f":"'Other Inputs'!E141","v":1182617},{"$f":"'Other Inputs'!E142","v":37416},{"$f":"J33+K33","v":1220033}]
["III.  Transportation (TL 112  demand)",null,{"$f":"'Other Inputs'!E30","v":12},{"$f":"'Other Inputs'!D30","v":12000},{"$f":"'Other Inputs'!F30","v":5.2880399999999996},{"$f":"C34*D34*E34","v":761477.75999999989},{"$f":"F34*J34","v":738124.74260771624},null,null,{"$f":"J33/L33","v":0.96933197708586571},{"$f":"K33/L33","v":3.0668022914134289E-2}]
[null,null,{"$f":"'Other Inputs'!E31","v":5},{"$f":"'Other Inputs'!D31","v":75000},{"$f":"'Other Inputs'!F31","v":6.8088699999999998},{"$f":"C35*D35*E35","v":2553326.25},{"$f":"F35*J34","v":2475020.7820577393}]
[null,null,null,null,null,null,null,null,null,"Dth Sales Allocation Base"]
["III.  Transportation (Hyrum)",null,{"$f":"+'Other Inputs'!E32","v":11},{"$f":"'Other Inputs'!D32","v":100000},{"$f":"'Other Inputs'!F32","v":5.2880399999999996},{"$f":"C37*D37*E37","v":5816844},{"$f":"F37*J34","v":5638452.8949200558},null,null,"Utah","Wyo","Total"]
[null,null,null,null,null,null,null,null,null,{"$f":"Calculations!P20","v":113424472},{"$f":"Calculations!P39","v":3928181},{"$f":"J38+K38","v":117352653}]
["IV.  Transportation (KR  2003 Expansion)",null,{"$f":"'Other Inputs'!E55","v":12},{"$f":"'Other Inputs'!D55","v":33000},{"$f":"'Other Inputs'!F55","v":3.1879000000000004},{"$f":"C39*D39*E39","v":1262408.4000000001},null,null,null,{"$f":"J38/L38","v":0.96652669624776189},{"$f":"K38/L38","v":3.3473303752238136E-2}]
[null,null,{"$f":"'Other Inputs'!E56","v":5},{"$f":"'Other Inputs'!D56","v":50000},{"$f":"'Other Inputs'!F56","v":3.1879000000000004},{"$f":"C40*D40*E40","v":796975.00000000012},{"$f":"(F39+F40+F41)*J34","v":2343375.2546998132}]
[null,null,{"$f":"'Other Inputs'!E57","v":12},{"$f":"'Other Inputs'!D57","v":1885},{"$f":"'Other Inputs'!F57","v":15.832549999999999},{"$f":"C41*D41*E41","v":358132.28099999996}]
[]
["V.  Transportation (KR #20024)",null,{"$f":"+'Other Inputs'!E65","v":5},{"$f":"+'Other Inputs'!D65","v":27000},{"$f":"+'Other Inputs'!F65","v":8.8159999999999989},{"$f":"C43*D43*E43","v":1190159.9999999998},{"$f":"F43*J34","v":1153660.1458485138}]
[]
["VI.  Transportation (KR #20017)",null,{"$f":"+'Other Inputs'!E61","v":3},{"$f":"+'Other Inputs'!D61","v":56925},{"$f":"+'Other Inputs'!F61","v":8.7966666666666651},1502250.7499999998,{"$f":"F45*J34","v":1456179.6895762244}]
[null,null,{"$f":"+'Other Inputs'!E63","v":2},{"$f":"+'Other Inputs'!D63","v":6000},{"$f":"+'Other Inputs'!F63","v":8.8449999999999989},106139.99999999999,{"$f":"F46*J34","v":102884.89604789377}]
[]
["VIII.  Trans (KR  2003 Expansion)",{"$f":"'Other Inputs'!C70","v":0.67353660204454602},{"$f":"'Other Inputs'!E69","v":366},{"$f":"'Other Inputs'!D69","v":34885},{"$f":"'Other Inputs'!F69","v":4.4000000000000003E-3},{"$f":"B48*C48*D48*E48","v":37838.480753086551}]
[null,{"$f":"'Other Inputs'!C69","v":0.67353660204454602},{"$f":"'Other Inputs'!E70","v":152},{"$f":"'Other Inputs'!D70","v":50000},{"$f":"'Other Inputs'!F70","v":4.4000000000000003E-3},{"$f":"B49*C49*D49*E49","v":22523.063972369622},{"$f":"(F48+F49)*J39","v":58341.044403906672}]
[]
["IX. Transportation (KR #20024)",{"$f":"+'Other Inputs'!C76","v":0.67353660204454602},{"$f":"+'Other Inputs'!E76","v":152},{"$f":"+'Other Inputs'!D76","v":27000},{"$f":"+'Other Inputs'!F76","v":4.4000000000000003E-3},{"$f":"B51*C51*D51*E51","v":12162.454545079596},{"$f":"+F51*J39","v":11755.337009719358}]
[]
["X.  Trans (KR #20017)",{"$f":"+'Other Inputs'!C73","v":0.67353660204454602},{"$f":"+'Other Inputs'!E73","v":91},{"$f":"+'Other Inputs'!D73","v":56925},{"$f":"+'Other Inputs'!F73","v":4.4000000000000003E-3},{"$f":"B53*C53*D53*E53","v":15351.764856982867}]
[null,{"$f":"+'Other Inputs'!C74","v":0.67353660204454602},{"$f":"+'Other Inputs'!E74","v":61},{"$f":"+'Other Inputs'!D74","v":6000},{"$f":"+'Other Inputs'!F74","v":4.4000000000000003E-3},{"$f":"B54*C54*D54*E54","v":1084.6633439325369},{"$f":"(F53+F54)*J39","v":15886.246647144311}]
[]
["XII.  Other Trans",null,null,null,null,{"$f":"'Other Inputs'!$D$178","v":3792842.5483999993},{"$f":"F56*$J$39","v":3665883.577692993}]
[]
["Storage Commodity",null,null,null,null,{"$f":"+'Ut 1.4 p2'!J29","v":543499},{"$f":"+F58*J39","v":525306.29288396239}]
["Total ACA",null,null,{"$f":"+'Ut 1.4 p1'!F38","v":136482893.08279997},{"$f":"+'Ut 1.4 p1'!J38","v":1.2999999999999999E-3},{"$f":"+D59*E59","v":177427.76100763996},{"$f":"+F59*J39","v":171488.66766935171}]
[]
["XIV.  Storage Demand",null,12,{"$f":"'Other Inputs'!E163","v":184625},{"$f":"'Other Inputs'!E14","v":2.8737499999999998},{"$f":"C61*D61*E61","v":6366793.125}]
[null,null,12,{"$f":"+'Other Inputs'!E164","v":2500000},{"$f":"+'Other Inputs'!E15","v":0.09},{"$f":"C62*D62*E62","v":2700000}]
[null,null,12,{"$f":"'Other Inputs'!E165","v":111827},{"$f":"'Other Inputs'!E16","v":2.85338},{"$f":"C63*D63*E63","v":3829019.1031200001}]
[null,null,12,{"$f":"'Other Inputs'!E166","v":13419000},{"$f":"'Other Inputs'!E17","v":2.3779999999999996E-2},{"$f":"C64*D64*E64","v":3829245.8399999994},{"$f":"SUM(F61:F64)*J34","v":16212133.604046669}]
[]
["XV. Peak Hour Service",null,{"$f":"+'Other Inputs'!E20","v":3},{"$f":"+'Other Inputs'!D20","v":28752},{"$f":"+'Other Inputs'!F20","v":11.653333333333334},{"$f":"C66*D66*E66","v":1005169.92},{"$f":"F66*J34","v":974343.34586084157}]
[null,null,{"$f":"+'Other Inputs'!E23","v":3},{"$f":"+'Other Inputs'!D23","v":63666.666666666664},{"$f":"+'Other Inputs'!F23","v":7.3574764397905756},{"$f":"C67*D67*E67","v":1405278},{"$f":"F67*J34","v":1362180.9020952713}]
[]
[]
["Total Supplier Non-Gas Costs",null,null,null,null,null,{"$f":"G26+G32+G34+G35+G40+G49+G56+G64++G43+G45+G46+G51+G54+G66+G67+G58+G59+G37","v":86880200.292313501}]

{"sheet":"SDR#3","index":16,"n_rows":36,"n_cols":9,"rows_kept":36,"cut":false,"hidden":false,"merged":[[4,2,4,7],[5,2,5,7]]}
[null,null,null,null,null,null,null,null,{"$f":"'Control Panel'!E32","v":"Dominion Energy Utah"}]
[null,null,null,null,null,null,null,null,{"$f":"'Control Panel'!E33","v":"Docket No. 19-057-18"}]
[]
[]
[null,null,"Standard Data Request #3"]
[null,null,"Monthly Forecasted Sales"]
[]
[null,null,null,"Utah Sales",null,"Wyoming Sales",null,"System Total"]
[null,null,"Month","Dth",null,"Dth",null,"Dth"]
[]
[null,1,{"$f":"Calculations!D141","v":"Oct19"},{"$f":"Calculations!D20","v":6433656},null,{"$f":"Calculations!D39","v":252763},null,{"$f":"SUM(D11:F11)","v":6686419}]
[]
[null,{"$f":"B11+1","v":2},{"$f":"Calculations!E141","v":"Nov19"},{"$f":"Calculations!E20","v":11879095},null,{"$f":"Calculations!E39","v":427125},null,{"$f":"SUM(D13:F13)","v":12306220}]
[]
[null,{"$f":"B13+1","v":3},{"$f":"Calculations!F141","v":"Dec19"},{"$f":"Calculations!F20","v":18704846},null,{"$f":"Calculations!F39","v":592566},null,19297412]
[]
[null,{"$f":"B15+1","v":4},{"$f":"Calculations!G141","v":"Jan20"},{"$f":"Calculations!G20","v":20219662},null,{"$f":"Calculations!G39","v":634523},null,20854185]
[]
[null,{"$f":"B17+1","v":5},{"$f":"Calculations!H141","v":"Feb20"},{"$f":"Calculations!H20","v":17089244},null,{"$f":"Calculations!H39","v":564754},null,17653998]
[]
[null,{"$f":"B19+1","v":6},{"$f":"Calculations!I141","v":"Mar20"},{"$f":"Calculations!I20","v":13496025},null,{"$f":"Calculations!I39","v":481683},null,13977708]
[]
[null,{"$f":"B21+1","v":7},{"$f":"Calculations!J141","v":"Apr20"},{"$f":"Calculations!J20","v":8925238},null,{"$f":"Calculations!J39","v":356476},null,9281714]
[]
[null,{"$f":"B23+1","v":8},{"$f":"Calculations!K141","v":"May20"},{"$f":"Calculations!K20","v":5499889},null,{"$f":"Calculations!K39","v":236639},null,5736528]
[]
[null,{"$f":"B25+1","v":9},{"$f":"Calculations!L141","v":"Jun20"},{"$f":"Calculations!L20","v":3324903},null,{"$f":"Calculations!L39","v":125574},null,3450477]
[]
[null,{"$f":"B27+1","v":10},{"$f":"Calculations!M141","v":"Jul20"},{"$f":"Calculations!M20","v":2644229},null,{"$f":"Calculations!M39","v":76358},null,2720587]
[]
[null,{"$f":"B29+1","v":11},{"$f":"Calculations!N141","v":"Aug20"},{"$f":"Calculations!N20","v":2425135},null,{"$f":"Calculations!N39","v":71483},null,2496618]
[]
[null,{"$f":"B31+1","v":12},{"$f":"Calculations!O141","v":"Sep20"},{"$f":"Calculations!O20","v":2782550},null,{"$f":"Calculations!O39","v":108237},null,2890787]
[]
[]
[null,{"$f":"B33+1","v":13},"Total Sales (Dth)",{"$f":"SUM(D11:D33)","v":113424472},null,{"$f":"SUM(F11:F33)","v":3928181},null,{"$f":"SUM(H11:H33)","v":117352653}]

{"sheet":"SDR#4","index":17,"n_rows":23,"n_cols":8,"rows_kept":23,"cut":false,"hidden":false,"merged":[[4,2,4,6],[5,2,5,6]]}
[null,null,null,null,null,null,null,{"$f":"'Control Panel'!E32","v":"Dominion Energy Utah"}]
[null,null,null,null,null,null,null,{"$f":"'Control Panel'!E33","v":"Docket No. 19-057-18"}]
[]
[]
[null,null,"Standard Data Request #4"]
[null,null,"Supplier Non-Gas Costs Recovered at Current Rates"]
[]
[]
[null,null," (A)","(B)","(C)","(D)","(E)"]
[null,1,"Rate Schedule","Season","Sales Dth","SNG Rate","SNG Revenue"]
[]
[null,{"$f":"B10+1","v":2},"GS","winter",{"$f":"'Utah Summary-by class'!B8","v":79730574},{"$f":"'Utah Summary-by class'!J8","v":1.16499},{"$f":"E12*F12","v":92885321.404259995}]
[null,{"$f":"B12+1","v":3},null,"summer",{"$f":"'Utah Summary-by class'!B9","v":30437950},{"$f":"'Utah Summary-by class'!J9","v":0.54697999999999991},{"$f":"E13*F13","v":16648949.890999997}]
[]
[null,{"$f":"B13+1","v":4},"FS","winter",{"$f":"'Utah Summary-by class'!B13","v":1478780},{"$f":"'Utah Summary-by class'!J13","v":1.13466},{"$f":"E15*F15","v":1677912.5148}]
[null,{"$f":"B15+1","v":5},null,"summer",{"$f":"'Utah Summary-by class'!B14","v":1382336},{"$f":"'Utah Summary-by class'!J14","v":0.54697999999999991},{"$f":"E16*F16","v":756110.14527999982}]
[]
[null,{"$f":"B16+1","v":6},"NGV","annual",{"$f":"'Utah Summary-by class'!B18","v":263921},{"$f":"'Utah Summary-by class'!J18","v":0.84068000000000009},{"$f":"E18*F18","v":221873.10628000004}]
[]
[null,{"$f":"B18+1","v":7},"IS","annual",{"$f":"'Utah Summary-by class'!B21","v":130911},{"$f":"'Utah Summary-by class'!J21","v":0.17907000000000001},{"$f":"E20*F20","v":23442.232770000002}]
[]
[]
[null,{"$f":"B20+1","v":8},"Total Supplier Non-Gas Costs",null,{"$f":"SUM(E12:E20)","v":113424472},null,{"$f":"SUM(G12:G20)","v":112213609.29438999}]

{"sheet":"Wy SDR#1","index":18,"n_rows":2,"n_cols":1,"rows_kept":2,"cut":false,"hidden":true,"merged":[]}
["Wyoming Standard Data Request #1"]
["Global Insights Forecast"]

{"sheet":"Current Exh Updated Exh","index":19,"n_rows":30,"n_cols":5,"rows_kept":30,"cut":false,"hidden":false,"merged":[[7,1,7,4],[10,1,10,3]]}
[]
[]
[]
[]
[]
[]
[]
[null,"Current Exhibits to Proposed Exhibits "]
[]
[]
[]
[null,"Current Exhibit","Description of Exhibit","Proposed Exhibit","Comments"]
[null,1.1000000000000001,"Company Production with detailed well information","1.2 p1","Detail of well info in electronic model"]
[null,1.2,"Purchased Gas Costs","1.2 p4"]
[null,"1.3 p1","Transportation","1.4 p1"]
[null,null,"Gathering","1.2 p3"]
[null,"1.3 p2","Storage","1.4 p3"]
[null,null,"Working Gas Charges","1.2 p5"]
[null,"1.4 p1","Gas Related Costs and Revenue Credits","1.2 p3"]
[null,"1.4 p2","Cost of Storage Gas","1.2 p5"]
[null,"1.4 p3","Other Revenues","1.2 p2"]
[null,1.5,"Gas Cost Allocation","1.1 p2"]
[null,"1.6 p1","Commodity Change and New Rates","1.5 p1"]
[null,"1.6 p2","Supplier Non-Gas Change ","1.5 p2"]
[null,"1.6 p3","Supplier Non-Gas New Rates","1.5 p3","Detail of calculation updated"]
[null,1.7,"Effect on GS Typical Customer",1.6]
[null,1.8,"Legislative/Proposed Rate Schedules",1.7]
[null,1.9,"Dominion Energy Questar Pipeline, LLC Tariff Rates","-","Removed as an exhibit"]
[null,"1.10","Confidential Comparison of Natural Gas Price Forecast",1.3]
[null,1.1100000000000001,"Legislative/Proposed Combined Rate Schedules",1.8]

{"sheet":"Ut 1.1 p1","index":20,"n_rows":39,"n_cols":6,"rows_kept":39,"cut":false,"hidden":false,"merged":[[8,1,8,4],[11,1,11,3],[13,1,13,2]]}
[null,null,null,null,null,{"$f":"'Control Panel'!$E$32","v":"Dominion Energy Utah"}]
[null,null,null,null,null,{"$f":"'Control Panel'!$E$33","v":"Docket No. 19-057-18"}]
[null,null,null,null,null,"DEU Exhibit 1.1"]
[null,null,null,null,null,"Page 1 of 2"]
[]
[]
[]
[]
[null,"TABLE OF CONTENTS"]
[]
[]
[]
[]
[null,"Exhibit",null,"Description","Type"]
[]
[null,1.1000000000000001,"Page 2","Test-Year Gas Cost Allocation","Summary"]
[]
[null,1.2,"Page 1","Test-Year Royalties & Company Production","Commodity"]
[null,null,"Page 2","Test-Year Other Revenues","Commodity"]
[null,null,"Page 3","Summary of Wexpro Test-Year Gas Costs and Revenue Credits","Commodity"]
[null,null,"Page 4","Test-Year Purchased Gas Costs","Commodity"]
[null,null,"Page 5","Test-Year Storage Gas & Working Gas Charges","Commodity"]
[]
[null,1.3,null,"Confidential Comparison of Natural Gas Price Forecasts","Commodity"]
[]
[null,1.4,"Page 1","Test-Year Transportation Charges","SNG"]
[null,null,"Page 2","Test-Year Storage Charges","SNG"]
[]
[null,1.5,"Page 1","Test-Year Gas Cost Change","Commodity"]
[null,null,"Page 2","Test-Year Supplier Non-Gas Cost Change","SNG"]
[null,null,"Page 3","Test-Year Change in Supplier Non-Gas Costs by Rate Class","SNG"]
[]
[null,1.6,null,"Effect on GS Typical Customer","Summary"]
[]
[null,1.7,"Page1-8","Legislative Rate Schedules","Summary"]
[null,null,"Page 9-17","Proposed Rate Schedules","Summary"]
[]
[null,1.8,"Page1-8","Legislative Combined Rate Schedules","Summary"]
[null,null,"Page 9-17","Proposed Combined Rate Schedules","Summary"]

{"sheet":"Ut 1.1 p2","index":21,"n_rows":56,"n_cols":9,"rows_kept":56,"cut":false,"hidden":false,"merged":[[7,2,7,7],[10,2,10,3]]}
[null,null,null,null,null,null,null,null,{"$f":"'Control Panel'!$E$32","v":"Dominion Energy Utah"}]
[null,null,null,null,null,null,null,null,{"$f":"'Control Panel'!$E$33","v":"Docket No. 19-057-18"}]
[null,null,null,null,null,null,null,null,"DEU Exhibit 1.1"]
[null,null,null,null,null,null,null,null,"Page 2 of 2"]
[]
[]
[]
[null,null,"TEST-YEAR GAS COST ALLOCATION"]
[]
[]
[null,null,"                        (A)",null,"(B)","  (C)","  (D)","  (E)"]
[null,null,null,null,"Allocation"]
[null,null,null,null,"Factor  1/","  System","  Wyoming","  Utah"]
[]
[null,"COMMODITY"]
[1,null,"Dominion Energy Production (Exhibit 1.2, p 1)",null,2,{"$f":"'Ut 1.2 p3'!E15+'Ut 1.2 p3'!E28","v":223281987.82511812},{"$f":"CHOOSE($E16,G$53,G$56)*$F16","v":7473985.8008737164},215808002.02424443]
[{"$f":"A16+1","v":2},null,"Other Revenue's Credit  (Exhibit 1.2, p 2)",null,2,{"$f":"'Ut 1.2 p3'!E16+'Ut 1.2 p3'!E29+'Ut 1.2 p3'!E47","v":-15181813.623752635},-508185.45893773914,-14673628.164814897]
[{"$f":"A17+1","v":3},null,"Gathering (Exhibit 1.2, p 3, ln 4)","- Demand",1,{"$f":"'Ut 1.2 p3'!E19","v":12340512},378459.10478814918,11962052.895211851]
[{"$f":"A18+1","v":4},null,"Gathering (Exhibit 1.2, p 3, lns 5, 6, 12)","- Commodity",2,{"$f":"'Ut 1.2 p3'!E21+'Ut 1.2 p3'!E20+'Ut 1.2 p3'!E32","v":12718586.825906975},425733.12012279849,12292853.705784177]
[{"$f":"A19+1","v":5},null,"Net Cost of Dominion Energy Production",null,null,{"$f":"SUM(F16:F19)","v":233159273.02727246},{"$f":"SUM(G16:G19)","v":7769992.5668469248},{"$f":"SUM(H16:H19)","v":225389280.46042556}]
[]
[{"$f":"A20+1","v":6},null,"Dominion Energy Contract Gas (Exhibit 1.2, p 4)",null,2,{"$f":"'Ut 1.2 p4'!E24","v":130510508},{"$f":"CHOOSE($E22,G$53,G$56)*$F22","v":4368617.8771429053},{"$f":"CHOOSE($E22,H$53,H$56)*$F22","v":126141890.12285709}]
[]
[{"$f":"A22+1","v":7},null,"Injection / Withdrawal Adjustment (Exhibit 1.2, p 5, ln 3)",null,2,{"$f":"'Ut 1.2 p5'!E21","v":2700390.8094136342},{"$f":"CHOOSE($E24,G$53,G$56)*$F24","v":90391.001813254785},{"$f":"CHOOSE($E24,H$53,H$56)*$F24","v":2609999.8076003795}]
[]
[{"$f":"A24+1","v":8},null,"Working Gas Costs (Exhibit 1.2, p 5, ln 17)",null,2,{"$f":"'Ut 1.2 p5'!I43","v":3119493.933348123},{"$f":"CHOOSE($E26,G$53,G$56)*$F26","v":104419.76798422582},{"$f":"CHOOSE($E26,H$53,H$56)*$F26","v":3015074.1653638971}]
[]
[]
[{"$f":"A26+1","v":9},null,"TOTAL COMMODITY",null,null,{"$f":"SUM(F20:F27)","v":369489665.77003419},{"$f":"SUM(G20:G27)","v":12333421.213787312},357156244.55624694]
[]
[null,"SNG"]
[{"$f":"A29+1","v":10},null,"Transportation (Exhibit 1.4, p 1, ln 14)","- Demand",1,{"$f":"'Ut 1.4 p1'!M33","v":65594498},{"$f":"CHOOSE($E32,G$53,G$56)*$F32","v":2011653.5677051358},{"$f":"CHOOSE($E32,H$53,H$56)*$F32","v":63582844.432294868}]
[{"$f":"A32+1","v":11},null,"Transportation (Exhibit 1.4, p 1, ln 23)","- Commodity",2,{"$f":"'Ut 1.4 p1'!M50","v":576815},{"$f":"CHOOSE($E33,G$53,G$56)*$F33","v":19307.903703847242},{"$f":"CHOOSE($E33,H$53,H$56)*$F33","v":557507.0962961528}]
[]
[{"$f":"A33+1","v":12},null,"Other Transportation (Exhibit 1.4, p 1, ln 24)",null,2,{"$f":"'Ut 1.4 p1'!M54","v":3792843},{"$f":"CHOOSE($E35,G$53,G$56)*$F35","v":126958.98582355015},{"$f":"CHOOSE($E35,H$53,H$56)*$F35","v":3665884.0141764497}]
[]
[{"$f":"A35+1","v":13},null,"Peak Hour Service (Exhibit 1.4, p 1, ln 27)",null,1,{"$f":"'Ut 1.4 p1'!L60+'Ut 1.4 p1'!L61","v":2410448},{"$f":"CHOOSE($E37,G$53,G$56)*$F37","v":73923.674497329164},{"$f":"CHOOSE($E37,H$53,H$56)*$F37","v":2336524.3255026708}]
[]
[{"$f":"A37+1","v":14},null,"Storage (Exhibit 1.4, p 2, ln 5)","- Demand",1,{"$f":"'Ut 1.4 p2'!J20","v":16725058},{"$f":"CHOOSE($E39,G$53,G$56)*$F39","v":512924.46198422502},{"$f":"CHOOSE($E39,H$53,H$56)*$F39","v":16212133.538015775}]
[{"$f":"A39+1","v":15},null,"Storage (Exhibit 1.4, p 2, ln 12)","- Commodity",2,{"$f":"'Ut 1.4 p2'!J29","v":543499},{"$f":"CHOOSE($E40,G$53,G$56)*$F40","v":18192.707116037676},{"$f":"CHOOSE($E40,H$53,H$56)*$F40","v":525306.29288396239}]
[]
[]
[{"$f":"A40+1","v":16},null,"TOTAL SNG",null,null,{"$f":"SUM(F32:F40)","v":89643161},{"$f":"SUM(G32:G40)","v":2762961.3008301249},86880199.699169874]
[]
[]
[{"$f":"A43+1","v":17},null,"TOTAL GAS  COST",null,null,{"$f":"F29+F43","v":459132826.77003419},{"$f":"G29+G43","v":15096382.514617436},{"$f":"H29+H43","v":444036444.25541681}]
[]
[]
[]
["1/",null,"Allocation Factors",null,null,"       Total ","     Wyoming","       Utah"]
[]
[null,null,"#1  Peak Day Demand",null," Dth-",{"$f":"SUM(G52:H52)","v":1220033},{"$f":"'Other Inputs'!$E$142","v":37416},{"$f":"'Other Inputs'!$E$141","v":1182617}]
[null,null,null,null," Percent-",{"$f":"G53+H53","v":1},{"$f":"G52/F52","v":3.0668022914134289E-2},{"$f":"H52/F52","v":0.96933197708586571}]
[]
[null,null,"#2  Commodity Sales - All",null," Dth-",{"$f":"G55+H55","v":117352653},{"$f":"'Ut 1.5 p1'!H21","v":3928181},{"$f":"'Ut 1.5 p1'!H20","v":113424472}]
[null,null,null,null," Percent-",{"$f":"G56+H56","v":1},{"$f":"G55/F55","v":3.3473303752238136E-2},{"$f":"H55/F55","v":0.96652669624776189}]

{"sheet":"Ut 1.2 p1","index":22,"n_rows":51,"n_cols":8,"rows_kept":51,"cut":false,"hidden":false,"merged":[[7,2,7,6]]}
[null,null,null,null,null,null,null,"Dominion Energy Utah"]
[null,null,null,null,null,null,null,{"$f":"'Control Panel'!$E$33","v":"Docket No. 19-057-18"}]
[null,null,null,null,null,null,null,"                     DEU Exhibit 1.2"]
[null,null,null,null,null,null,null,"Page 1 of 5"]
[]
[]
[]
[null,null,"TEST-YEAR ROYALTIES & COMPANY PRODUCTION"]
[]
[null,"COMMODITY"]
[null,null,"(A)",null,"(B)",null,"(C)      "]
[null,null,null,null,"Base Year",null,"Test-Year"]
[null,null,null,null,"Dth    ",null,"Royalty $"]
[]
[null,"WEXPRO I"]
[{"$f":"A15+1","v":1},null,"Royalties Based on Historical Production",null,{"$f":"+'Royalty Detail'!F1427","v":55805228.905000009},null,{"$f":"+'Royalty Detail'!I1427","v":17534463.404037833}]
[]
[{"$f":"A16+1","v":2},null,"Test-Year Adjustment for IRP Production Forecast",null,{"$f":"+'Royalty Detail'!F1429","v":-5747470.9050000086},null,{"$f":"G16/E16*E18","v":-1805902.7841469052}]
[]
[]
[{"$f":"A18+1","v":3},null,"Total Wexpro I Test-Year Royalties",null,null,null,{"$f":"G16+G18","v":15728560.619890928}]
[]
[{"$f":"A21+1","v":4},null,"Wexpro I Operator Service Fee",null,null,null,{"$f":"'Monthly Inputs'!S107","v":169504821.75115463}]
[]
[]
[{"$f":"A23+1","v":5},null,"Total Wexpro I Company Production (IRP Forecast)",null,{"$f":"+'Monthly Inputs'!S7","v":50057758},null,{"$f":"G21+G23","v":185233382.37104556}]
[]
[]
[]
[null,"WEXPRO II"]
[{"$f":"A26+1","v":6},null,"Royalties Based on Historical Production",null,{"$f":"+'Royalty Detail'!F1682","v":16457522.488000004},null,{"$f":"+'Royalty Detail'!I1682","v":5228882.2337412648}]
[]
[{"$f":"A31+1","v":7},null,"Test-Year Adjustment for IRP Production Forecast",null,{"$f":"+'Royalty Detail'!F1684","v":-4278535.4880000036},null,{"$f":"G31/E31*E33","v":-1359375.8243956366}]
[]
[]
[{"$f":"A33+1","v":8},null,"Total Wexpro II Test-Year Royalties",null,null,null,{"$f":"G31+G33","v":3869506.4093456282}]
[]
[{"$f":"A36+1","v":9},null,"Wexpro II Operator Service Fee",null,null,null,{"$f":"'Monthly Inputs'!S109","v":34179099.044726923}]
[]
[]
[{"$f":"A38+1","v":10},null,"Total Wexpro II Company Production (IRP Forecast)",null,{"$f":"'Monthly Inputs'!S13","v":12178987},null,{"$f":"G36+G38","v":38048605.45407255}]
[]
[]
[]
[null,"TOTAL WEXPRO"]
[{"$f":"A41+1","v":11},null,"Total Wexpro Test-Year Royalties",null,null,null,{"$f":"G36+G21","v":19598067.029236555}]
[]
[{"$f":"A46+1","v":12},null,"Total Wexpro Operator Service Fee",null,null,null,{"$f":"G38+G23","v":203683920.79588157}]
[]
[]
[{"$f":"A48+1","v":13},null,"Total Wexpro Company Production",null,{"$f":"E41+E26","v":62236745},null,{"$f":"G46+G48","v":223281987.82511812}]

{"sheet":"Ut 1.2 p2","index":23,"n_rows":53,"n_cols":11,"rows_kept":53,"cut":false,"hidden":false,"merged":[[7,3,7,8],[11,6,11,7],[12,6,12,7],[10,6,10,7],[10,2,10,3],[11,2,11,3],[12,2,12,3]]}
[null,null,null,null,null,null,null,null,null,null,{"$f":"'Control Panel'!$E$32","v":"Dominion Energy Utah"}]
[null,null,null,null,null,null,null,null,null,null,{"$f":"'Control Panel'!$E$33","v":"Docket No. 19-057-18"}]
[null,null,null,null,null,null,null,null,null,null,"DEU Exhibit 1.2"]
[null,null,null,null,null,null,null,null,null,null,"Page 2 of 5"]
[]
[]
[]
[null,null,null," TEST-YEAR OTHER REVENUES  1/"]
[]
[null,"COMMODITY"]
[null,null,"(A)",null,"          (B)","(C)","(D)"]
[null,null,"Account",null,null,null,{"$f":"Expenses!S8","v":"12 Months Ending"}]
[null,null,"Number",null,"Account Name",null,{"$f":"'Control Panel'!E7","v":"2020-09-30"}]
[null,null,"WEXPRO I"]
[null,1,null,"483","Sales for Resale",null,null,{"$f":"'Other Inputs'!F202","v":2269440.7199999997}]
[]
[null,{"$f":"B15+1","v":2},null,"490","Plant By-Product",null,null,{"$f":"'Other Inputs'!F203","v":3053672.9999999995}]
[]
[null,{"$f":"B17+1","v":3},null,"492","Gasoline and Oil Sales",{"$f":"'Other Inputs'!F204","v":542819.13233315689}]
[null,{"$f":"B19+1","v":4},null,"758-1","Gasoline and Oil Cost",{"$f":"'Other Inputs'!F207","v":-89510.874921737588}]
[null,{"$f":"B20+1","v":5},null,null,"Net Gasoline and Oil Sales",null,null,{"$f":"F19+F20","v":453308.2574114193}]
[]
[null,{"$f":"B21+1","v":6},null,"495-1","Overriding Royalty Revenue",null,null,{"$f":"'Other Inputs'!F205","v":7921111.0185845168}]
[]
[null,{"$f":"B23+1","v":7},null,"495-2","Oil Revenue Received from Wexpro",null,null,{"$f":"'Other Inputs'!F206","v":0}]
[]
[null,null,null,null,null,null,null," "]
[null,{"$f":"B25+1","v":8},null,null,"Total Wexpro I",null,null,{"$f":"SUM(H15:H25)","v":13697532.995995935}]
[]
[null,null,"WEXPRO II"]
[null,{"$f":"B28+1","v":9},null,"483","Sales for Resale",null,null,{"$f":"'Other Inputs'!E223","v":0}]
[]
[null,{"$f":"B31+1","v":10},null,"490","Plant By-Product",null,null,{"$f":"'Other Inputs'!E224","v":480000}]
[]
[null,{"$f":"B33+1","v":11},null,"492","Gasoline and Oil Sales",{"$f":"'Other Inputs'!E225","v":1457997.7251352277}]
[null,{"$f":"B35+1","v":12},null,"758-1","Gasoline and Oil Cost",{"$f":"'Other Inputs'!E228","v":-237507.82942452858}]
[null,{"$f":"B36+1","v":13},null,null,"Net Gasoline and Oil Sales",null,null,{"$f":"F35+F36","v":1220489.895710699}]
[]
[null,{"$f":"B37+1","v":14},null,"495-1","Overriding Royalty Revenue",null,null,{"$f":"'Other Inputs'!E226","v":0}]
[]
[null,{"$f":"B39+1","v":15},null,"495-2","Oil Revenue Received from Wexpro",null,null,{"$f":"'Other Inputs'!E227","v":-216209.26795399844}]
[]
[null,null,null,null,null,null,null," "]
[null,{"$f":"B41+1","v":16},null,null,"Total Wexpro II",null,null,{"$f":"SUM(H31:H41)","v":1484280.6277567006}]
[]
[null,17,null,null,"Sales of Cost-of-Service Gas",null,null,{"$f":"'Other Inputs'!E234","v":0}]
[]
[]
[null,18,null,null,"Grand Total (Line 8 + Line 16 + Line 17)",null,null,{"$f":"H28+H44+H46","v":15181813.623752635}]
[]
[]
[]
[null,"1/",null,"Forecasted 12-month test year."]

{"sheet":"Ut 1.2 p3","index":24,"n_rows":59,"n_cols":7,"rows_kept":59,"cut":false,"hidden":false,"merged":[[7,1,7,6],[10,1,10,3],[11,1,11,3]]}
[null,null,null,null,null,null,{"$f":"'Control Panel'!$E$32","v":"Dominion Energy Utah"}]
[null,null,null,null,null,null,{"$f":"'Control Panel'!$E$33","v":"Docket No. 19-057-18"}]
[null,null,null,null,null,null,"DEU Exhibit 1.2"]
[null,null,null,null,null,null,"Page 3 of 5"]
[]
[]
[]
[null,"SUMMARY OF WEXPRO TEST-YEAR GAS COSTS AND REVENUES CREDITS"]
[]
[null,"COMMODITY"]
[null,"(A)",null,null,"(B)","(C)","(D)"]
[null,"Component",null,null,"Costs","Dth 1/","$ per Dth"]
[]
[null,"WEXPRO I"]
[1,null,"Dominion Energy Production  2/",null,{"$f":"'Other Inputs'!D195","v":185233382.37104556}]
[{"$f":"A15+1","v":2},null,"Wexpro I Revenue Sharing Credits  3/",null,{"$f":"-'Ut 1.2 p2'!H28","v":-13697532.995995935}]
[{"$f":"A16+1","v":3},null,null,"Net Dominion Energy Production Costs",{"$f":"E15+E16","v":171535849.37504962},{"$f":"F25","v":48985470.765882},{"$f":"E17/F25","v":3.5017699471518196}]
[]
[{"$f":"A17+1","v":4},null,"Gathering Demand",null,{"$f":"'Other Inputs'!E184","v":12340512}]
[{"$f":"A19+1","v":5},null,"Gathering Commodity",null,{"$f":"'Other Inputs'!D184","v":8260977.6868611174}]
[{"$f":"A20+1","v":6},null,"Gathering Other Charges",null,{"$f":"ROUND('Other Inputs'!D176,0)","v":1907905}]
[{"$f":"A21+1","v":7},null,null,"Gathering",{"$f":"SUM(E19:E21)","v":22509394.686861116}]
[]
[]
[{"$f":"A22+1","v":8},"Total Wexpro I Cost of Production",null,null,{"$f":"E17+E22","v":194045244.06191075},{"$f":"'Monthly Inputs'!S7*(1-'Other Inputs'!E267)","v":48985470.765882},{"$f":"E25/F25","v":3.9612816010142695}]
[]
[null,"WEXPRO II"]
[{"$f":"A25+1","v":9},null,"Wexpro II Production  4/",null,{"$f":"'Other Inputs'!D216","v":38048605.45407255}]
[{"$f":"A28+1","v":10},null,"Wexpro II Revenue Sharing Credits  5/",null,{"$f":"-'Ut 1.2 p2'!H44","v":-1484280.6277567006}]
[{"$f":"A29+1","v":11},null,null,"Net Cost of Wexpro II Production",{"$f":"E28+E29","v":36564324.82631585},{"$f":"F35","v":11918100.919473},{"$f":"E30/F35","v":3.067965699684029}]
[]
[{"$f":"A30+1","v":12},null,null,"Gathering",{"$f":"'Other Inputs'!D187","v":2549704.1390458588}]
[]
[]
[{"$f":"A32+1","v":13},"Total Wexpro II Cost of Production",null,null,{"$f":"SUM(E30:E32)","v":39114028.965361707},{"$f":"'Monthly Inputs'!S13*(1-'Other Inputs'!E267)","v":11918100.919473},{"$f":"E35/F35","v":3.2819011375758067}]
[]
[null,"TOTAL WEXPRO"]
[{"$f":"A35+1","v":14},null,"Total Wexpro Production",null,{"$f":"E15+E28","v":223281987.82511812}]
[{"$f":"A38+1","v":15},null,"Total Wexpro Revenue Sharing Credits",null,{"$f":"E16+E29","v":-15181813.623752635}]
[{"$f":"A39+1","v":16},null,null,"Net Cost of Total Wexpro Production",{"$f":"E38+E39","v":208100174.2013655},{"$f":"F25+F35","v":60903571.685355},{"$f":"E40/F45","v":3.4168796417469505}]
[]
[{"$f":"A40+1","v":17},null,null,"Total Wexpro Gathering ",{"$f":"E22+E32","v":25059098.825906977}]
[]
[]
[{"$f":"A42+1","v":18},"Total Wexpro Cost of Production",null,null,{"$f":"SUM(E40:E42)","v":233159273.02727246},{"$f":"F25+F35","v":60903571.685355},{"$f":"E45/F45","v":3.8283349658348267}]
[]
[{"$f":"A45+1","v":19},"Sales of Cost-of-Service Gas 6/",null,null,{"$f":"-'Other Inputs'!E234","v":0},{"$f":"'Other Inputs'!F234","v":0},{"$f":"'Other Inputs'!G234","v":0}]
[]
[]
[{"$f":"A47+1","v":20},"Total Cost-of-Service Production",null,null,{"$f":"E25+E35+E47","v":233159273.02727246},{"$f":"F25+F35","v":60903571.685355},{"$f":"E50/F50","v":3.8283349658348267}]
[]
[]
[]
["1/","Estimated into-pipe volumes used for Wexpro dths."]
["2/","Exhibit 1.2, Page 1, Line 5."]
["3/","Exhibit 1.2, Page 2, Line 8."]
["4/","Exhibit 1.2, Page 1, Line 10."]
["5/","Exhibit 1.2, Page 2, Line 16."]
["6/","Exhibit 1.2, Page 2, Line 17."]

{"sheet":"Ut 1.2 p4","index":25,"n_rows":24,"n_cols":8,"rows_kept":24,"cut":false,"hidden":false,"merged":[[7,0,7,7]]}
[null,null,null,null,null,null,null,{"$f":"'Control Panel'!$E$32","v":"Dominion Energy Utah"}]
[null,null,null,null,null,null,null,{"$f":"'Control Panel'!$E$33","v":"Docket No. 19-057-18"}]
[null,null,null,null,null,null,null,"DEU Exhibit 1.2"]
[null,null,null,null,null,null,null,"Page 4 of 5"]
[]
[]
[]
["     TEST-YEAR PURCHASED GAS COSTS"]
[]
[null,"COMMODITY"]
[null,null,null,"     (A)","(B)","(C)","(D)"]
[null,null,null,null,null,null,"Cost"]
[null," ","    Component",null,"Total Cost","Dth","per Dth"]
[null," "]
[null,1,"Current Contracts",null,{"$f":"ROUND(Calculations!$P$186+Calculations!$P$189-E16,0)","v":51700417}]
[null,{"$f":"B15+1","v":2},"Stabilization Costs",null,{"$f":"'Monthly Inputs'!S94","v":0}]
[null,{"$f":"B16+1","v":3},null,"Total Current Contracts",{"$f":"E15+E16","v":51700417},{"$f":"Calculations!$P$185+Calculations!$P$188","v":22967000},{"$f":"E17/F17","v":2.2510740192450038}]
[]
[null,{"$f":"B17+1","v":4},"Forecast Spot",null,{"$f":"ROUND(Calculations!P183,0)","v":74966992},{"$f":"Calculations!$P$182","v":37043937},{"$f":"E19/F19","v":2.0237317647959503}]
[]
[null,{"$f":"B19+1","v":5},"Future Contracts",null,{"$f":"ROUND(Calculations!P192,0)","v":3843099},{"$f":"Calculations!P191","v":1959677.0000000009},{"$f":"E21/F21","v":1.9610879752122408}]
[]
[]
[null,{"$f":"B21+1","v":6},"Total Gas Purchased",null,{"$f":"E17+E19+E21","v":130510508},{"$f":"F17+F19+F21","v":61970614},{"$f":"E24/F24","v":2.1060063726333258}]

{"sheet":"Ut 1.2 p5","index":26,"n_rows":49,"n_cols":11,"rows_kept":49,"cut":false,"hidden":false,"merged":[[10,2,10,3],[7,1,7,9]]}
[null,null,null,null,null,null,null,null,null,null,{"$f":"'Control Panel'!$E$32","v":"Dominion Energy Utah"}]
[null,null,null,null,null,null,null,null,null,null,{"$f":"'Control Panel'!$E$33","v":"Docket No. 19-057-18"}]
[null,null,null,null,null,null,null,null,null,null,"DEU Exhibit 1.2"]
[null,null,null,null,null,null,null,null,null,null,"Page 5 of 5"]
[]
[]
[]
[null,"TEST-YEAR STORAGE GAS & WORKING GAS CHARGES"]
[]
[null,"COMMODITY"]
[null,null,"             (A)",null,"  (B)",null,"   (C)",null,"    (D)"]
[null,null,null,null,null,null,null,null,"   Average"]
[null,null,null,null,"   Total Costs",null,"  Dth",null,"   Rate"]
[]
[null,"STORAGE GAS  1/"]
[]
[null,1,"    Withdrawals",null,{"$f":"G17*I17","v":61805206.428063117},null,{"$f":"'Monthly Inputs'!S37","v":16042662},null,{"$f":"'Ut Storage'!L27","v":3.852553050613615}]
[null,2,"    Injections",null,{"$f":"G18*I18","v":-59104815.618649483},null,{"$f":"-'Monthly Inputs'!S29","v":-18154302},null,{"$f":"'Ut Storage'!K27","v":3.2556919907275685}]
[]
[]
[null,{"$f":"B18+1","v":3},"Storage Adjustment",null,{"$f":"E17+E18","v":2700390.8094136342}]
[]
[]
[null,"WORKING GAS CHARGES"]
[]
[null,null,null,"Month","Amount",null,"Pre-Tax Return %",null,"Total"]
[]
[null,{"$f":"B21+1","v":4},null,{"$f":"+'Rate Base'!H8","v":"2018-07-17"},{"$f":"+'Rate Base'!H206","v":39219511.989999995}]
[null,{"$f":"B28+1","v":5},null,{"$f":"+'Rate Base'!I8","v":"2018-08-16"},{"$f":"+'Rate Base'!I206","v":43502522.789999984}]
[null,6,null,{"$f":"+'Rate Base'!J8","v":"2018-09-01"},{"$f":"+'Rate Base'!J206","v":62143023.659999982}]
[null,7,null,{"$f":"+'Rate Base'!K8","v":"2018-10-01"},{"$f":"+'Rate Base'!K206","v":62647436.719999984}]
[null,8,null,{"$f":"+'Rate Base'!L8","v":"2018-11-01"},{"$f":"+'Rate Base'!L206","v":52783329.589999981}]
[null,9,null,{"$f":"+'Rate Base'!M8","v":"2018-12-01"},{"$f":"+'Rate Base'!M206","v":44167774.479999982}]
[null,10,null,{"$f":"+'Rate Base'!N8","v":"2019-01-01"},{"$f":"+'Rate Base'!N206","v":33177810.05999998}]
[null,11,null,{"$f":"+'Rate Base'!O8","v":"2019-02-01"},{"$f":"+'Rate Base'!O206","v":24117118.759999979}]
[null,12,null,{"$f":"+'Rate Base'!P8","v":"2019-03-01"},{"$f":"+'Rate Base'!P206","v":8155444.2399999797}]
[null,13,null,{"$f":"+'Rate Base'!Q8","v":"2019-04-01"},{"$f":"+'Rate Base'!Q206","v":6352626.4299999792}]
[null,14,null,{"$f":"+'Rate Base'!R8","v":"2019-05-01"},{"$f":"+'Rate Base'!R206","v":8741282.3899999782}]
[null,15,null,{"$f":"+'Rate Base'!S8","v":"2019-06-01"},{"$f":"+'Rate Base'!S206","v":19062047.869999975}]
[null,16,null,{"$f":"+'Rate Base'!T8","v":"2019-07-01"},{"$f":"+'Rate Base'!T206","v":33521823.379999973}]
[]
[]
[null,{"$f":"B40+1","v":17},"12-Month Average   2/",null,{"$f":"(SUM(E29:E39)+E28/2+E40/2)/12","v":33435090.389583316},"x ",{"$f":"'Other Inputs'!E263","v":9.3299999999999994E-2},"  =",{"$f":"E43*G43","v":3119493.933348123}]
[]
[]
[]
[]
[null,"1/","Dominion Energy planned volumes."]
[null,"2/","(1/2 of Line 4 + sum of Lines 5-15 + 1/2 of Line 16) / 12"]

{"sheet":"Ut 1.3 Redacted","index":27,"n_rows":29,"n_cols":18,"rows_kept":29,"cut":false,"hidden":false,"merged":[[0,8,28,8]]}
[null,null,null,null,null,null,null,null,"REDACTED"]
[]
[]
[]
[]
[]
[]
[]
[]
[]
[]
[]
[]
[]
[]
[]
[]
[]
[]
[]
[]
[]
[]
[]
[]
[]
[]
[]
[null,null,null,null,null,null,null,null,null,null,null,null,null,null,null,"DEU Exhibit 1.3",{"$f":"CONCATENATE(\"Docket No. \",'Control Panel'!E5)","v":"Docket No. 19-057-18"},"Dominion Energy Utah"]

{"sheet":"Ut 1.4 p1","index":28,"n_rows":65,"n_cols":14,"rows_kept":65,"cut":false,"hidden":false,"merged":[[10,1,10,2],[7,1,7,12]]}
[null,null,null,null,null,null,null,null,null,null,null,null,null,{"$f":"'Control Panel'!$E$32","v":"Dominion Energy Utah"}]
[null,null,null,null,null,null,null,null,null,null,null,null,null,{"$f":"'Control Panel'!$E$33","v":"Docket No. 19-057-18"}]
[null,null,null,null,null,null,null,null,null,null,null,null,null,"DEU Exhibit 1.4"]
[null,null,null,null,null,null,null,null,null,null,null,null,null,"Page 1 of 2"]
[]
[]
[]
[null," TEST-YEAR TRANSPORTATION CHARGES"]
[]
[null,"SNG"]
[null,"(A)",null,"(B)",null,"(C)",null,"(D)",null,"(E)",null,"(F)","(G)"]
[null,null,null,"Fctr",null,"Dth",null,"Months/Days",null,"Rate",null,null,"Total Costs"]
[]
[null,"TRANSPORTATION DEMAND"]
[]
[null,"QPC Demand"]
[1,"T-1 Transportation - Yearly",null,null,null,{"$f":"'Other Inputs'!D28+'Other Inputs'!D29+'Other Inputs'!D30","v":840902}," x",{"$f":"'Other Inputs'!E28","v":12},"x",{"$f":"'Other Inputs'!F28","v":5.2880399999999996},"=",{"$f":"ROUND(F17*H17*J17,0)","v":53360681}]
[{"$f":"A17+1","v":2},"T-1 Transportation - Yearly (Begins Nov 2019)",null,null,null,{"$f":"'Other Inputs'!D32","v":100000}," x",{"$f":"'Other Inputs'!E32","v":11},"x",{"$f":"'Other Inputs'!F32","v":5.2880399999999996},"=",{"$f":"ROUND(F18*H18*J18,0)","v":5816844}]
[{"$f":"A18+1","v":3},"T-1 Transportation Nov-Mar",null,null,null,{"$f":"'Other Inputs'!D31","v":75000}," x",{"$f":"'Other Inputs'!E31","v":5},"x",{"$f":"'Other Inputs'!F31","v":6.8088699999999998},"=",{"$f":"ROUND(F19*H19*J19,0)","v":2553326}]
[{"$f":"A19+1","v":4},"No-Notice Transportation",null,null,null,{"$f":"'Other Inputs'!D35","v":203542}," x",{"$f":"'Other Inputs'!E35","v":12},"x",{"$f":"'Other Inputs'!F35","v":0.86753000000000002},"=",{"$f":"ROUND(F20*H20*J20,0)","v":2118945}]
[{"$f":"A20+1","v":5},"Capacity Release Credits",null,null,null,null,null,null,null,null,null,{"$f":"-ROUND('Other Inputs'!E273,0)","v":-3471364}]
[{"$f":"A21+1","v":6},null,"Total",null,null,null,null,null,null,null,null,{"$f":"SUM(L17:L21)","v":60378432}]
[]
[null,"Kern River Demand"]
[{"$f":"A22+1","v":7},"January - December",null,null,null,{"$f":"'Other Inputs'!D57","v":1885}," x",{"$f":"'Other Inputs'!E57","v":12},"x",{"$f":"'Other Inputs'!F57","v":15.832549999999999},"=",{"$f":"ROUND(F25*H25*J25,0)","v":358132}]
[{"$f":"A25+1","v":8},"October - April",null,null,null,{"$f":"'Other Inputs'!D55","v":33000}," x",{"$f":"'Other Inputs'!E55","v":12},"x",{"$f":"'Other Inputs'!F55","v":3.1879000000000004},"=",1262408]
[9,"November - March",null,null,null,{"$f":"'Other Inputs'!D56","v":50000}," x",{"$f":"'Other Inputs'!E56","v":5},"x",{"$f":"J26","v":3.1879000000000004},"=",796975]
[10,"December - February",null,null,null,{"$f":"'Other Inputs'!D61","v":56925}," x",{"$f":"'Other Inputs'!E61","v":3},"x",{"$f":"'Other Inputs'!F61","v":8.7966666666666651},"=",1502251]
[{"$f":"A28+1","v":11},"November & March",null,null,null,{"$f":"'Other Inputs'!D63","v":6000}," x",{"$f":"'Other Inputs'!E63","v":2},"x",{"$f":"'Other Inputs'!F63","v":8.8449999999999989},"=",106140]
[12,"November - March",null,null,null,{"$f":"'Other Inputs'!D65","v":27000}," x",{"$f":"'Other Inputs'!E65","v":5},"x",{"$f":"'Other Inputs'!F65","v":8.8159999999999989},"=",1190160]
[{"$f":"A30+1","v":13},null,"Total",null,null,null,null,null,null,null,null,{"$f":"SUM(L25:L30)","v":5216066}]
[]
[{"$f":"A31+1","v":14},"Total Transportation Demand (SNG)",null,null,null,null,null,null,null,null,null,null,{"$f":"L22+L31","v":65594498}]
[]
[]
[null,"TRANSPORTATION COMMODITY"]
[]
[{"$f":"A33+1","v":15},"Total ACA",null,null,null,{"$f":"Calculations!$P$173","v":136482893.08279997},null,null,"x",{"$f":"'Other Inputs'!F41","v":1.2999999999999999E-3},"=",{"$f":"ROUND(F38*J38,0)","v":177428}]
[]
[{"$f":"A38+1","v":16},"QPC Commodity (SNG)",null,null,null,{"$f":"'Ut 1.4 p1'!F38-(D43*F43*H43)-(D44*F44*H44)-(D45*F45*H45)-(D46*F46*H46)-(D47*F47*H47)","v":116264614.1120156},null,null,"x",{"$f":"'Other Inputs'!F40","v":2.6700000000000001E-3},"=",{"$f":"ROUND(F40*J40,0)","v":310427}]
[]
[null,"Kern River Commodity"]
[{"$f":"A40+1","v":17},"January - December",null,{"$f":"'Other Inputs'!C69","v":0.67353660204454602},"x",{"$f":"'Other Inputs'!D69","v":34885}," x",{"$f":"'Other Inputs'!E69","v":366},"x",{"$f":"'Other Inputs'!F69","v":4.4000000000000003E-3},"=",{"$f":"ROUND(D43*F43*H43*J43,0)","v":37838}]
[{"$f":"A43+1","v":18},"November - March",null,{"$f":"'Other Inputs'!C70","v":0.67353660204454602},"x",{"$f":"'Other Inputs'!D70","v":50000}," x",{"$f":"'Other Inputs'!E70","v":152},"x",{"$f":"'Other Inputs'!F70","v":4.4000000000000003E-3},"=",22523]
[19,"November & March",null,{"$f":"'Other Inputs'!C74","v":0.67353660204454602},"x",{"$f":"'Other Inputs'!D74","v":6000}," x",{"$f":"'Other Inputs'!E74","v":61},"x",{"$f":"'Other Inputs'!F74","v":4.4000000000000003E-3},"=",1085]
[20,"December - February",null,{"$f":"'Other Inputs'!C73","v":0.67353660204454602},"x",{"$f":"'Other Inputs'!D73","v":56925}," x",{"$f":"'Other Inputs'!E73","v":91},"x",{"$f":"'Other Inputs'!F73","v":4.4000000000000003E-3},"=",15352]
[21,"November - March",null,{"$f":"'Other Inputs'!C74","v":0.67353660204454602},"x",{"$f":"'Other Inputs'!D76","v":27000}," x",{"$f":"'Other Inputs'!E76","v":152},"x",{"$f":"'Other Inputs'!F76","v":4.4000000000000003E-3},"=",12162]
[{"$f":"A47+1","v":22},null,"Total (SNG)",null,null,null,null,null,null,null,null,{"$f":"SUM(L43:L47)","v":88960}]
[]
[{"$f":"A48+1","v":23},"Total Transportation Commodity",null,null,null,null,null,null,null,null,null,null,{"$f":"L48+L40+L38","v":576815}]
[]
[]
[null,"OTHER CHARGES"]
[{"$f":"A50+1","v":24},"Other Transportation Charges",null,null,null,null,null,null,null,null,null,null,{"$f":"ROUND('Other Inputs'!$D$178,0)","v":3792843}]
[]
[]
[]
[]
[null,"PEAK HOUR SERVICE"]
[{"$f":"A54+1","v":25},"Mid November - Mid February",null,null,null,{"$f":"'Other Inputs'!D20","v":28752},"x",{"$f":"'Other Inputs'!E20","v":3},"x ",{"$f":"'Other Inputs'!F20","v":11.653333333333334},"=",{"$f":"ROUND(F60*H60*J60,0)","v":1005170}]
[{"$f":"A60+1","v":26},"Mid November - Mid February",null,null,null,{"$f":"'Other Inputs'!D23","v":63666.666666666664},"x",{"$f":"'Other Inputs'!E23","v":3},"x ",{"$f":"'Other Inputs'!F23","v":7.3574764397905756},"=",{"$f":"ROUND(F61*H61*J61,0)","v":1405278}]
[{"$f":"A61+1","v":27},null,"Total Peak Hour Service",null,null,null,null,null,null,null,null,null,{"$f":"SUM(L60:L61)","v":2410448}]
[]
[]
[{"$f":"A62+1","v":28},"TOTAL TRANSPORTATION AND OTHER CHARGES",null,null,null,null,null,null,null,null,null,null,{"$f":"SUM(M13:M63)","v":72374604}]

{"sheet":"Ut 1.4 p2","index":29,"n_rows":39,"n_cols":12,"rows_kept":39,"cut":false,"hidden":false,"merged":[[6,1,6,10],[9,1,9,2],[13,1,13,2]]}
[null,null,null,null,null,null,null,null,null,null,null,{"$f":"'Control Panel'!$E$32","v":"Dominion Energy Utah"}]
[null,null,null,null,null,null,null,null,null,null,null,{"$f":"'Control Panel'!$E$33","v":"Docket No. 19-057-18"}]
[null,null,null,null,null,null,null,null,null,null,null,"DEU Exhibit 1.4"]
[null,null,null,null,null,null,null,null,null,null,null,"Page 2 of 2"]
[]
[]
[null,"TEST-YEAR STORAGE CHARGES"]
[]
[null,"SNG"]
[null,"(A)",null,"(B)",null,"(C)",null,"(D)",null,"(E)","(F)"]
[]
[null,"STORAGE CHARGES"]
[]
[null,"Component",null,"Dth",null,"Months",null,"Rate",null,null,"Total Costs"]
[null,"Storage Demand"]
[1,"Aquifer Peaking Demand",null,{"$f":"'Other Inputs'!E163","v":184625},"x",12,"x ",{"$f":"'Other Inputs'!E14","v":2.8737499999999998},"=",{"$f":"ROUND(D16*F16*H16,0)","v":6366793}]
[{"$f":"A16+1","v":2},"Spire Demand",null,{"$f":"'Other Inputs'!E164","v":2500000},"x",12,"x ",{"$f":"'Other Inputs'!E15","v":0.09},"=",{"$f":"ROUND(D17*F17*H17,0)","v":2700000}]
[{"$f":"A17+1","v":3},"Clay Basin Demand",null,{"$f":"'Other Inputs'!E165","v":111827},"x",12,"x ",{"$f":"'Other Inputs'!E16","v":2.85338},"=",{"$f":"ROUND(D18*F18*H18,0)","v":3829019}]
[{"$f":"A18+1","v":4},"Clay Basin Capacity",null,{"$f":"'Other Inputs'!E166","v":13419000},"x",12,"x ",{"$f":"'Other Inputs'!E17","v":2.3779999999999996E-2},"=",{"$f":"ROUND(D19*F19*H19,0)","v":3829246}]
[{"$f":"A19+1","v":5},null,"Total Demand Charges  (SNG)",null,null,null,null,null,null,{"$f":"SUM(J16:J19)","v":16725058}]
[]
[null,"Storage Commodity  1/"]
[{"$f":"A20+1","v":6},"Aquifer Peaking Injections",null,{"$f":"(+'Monthly Inputs'!S24+'Monthly Inputs'!S26+'Monthly Inputs'!S27)","v":1156592},null,"x ",null,{"$f":"'Other Inputs'!E6","v":3.8719999999999997E-2},"=",{"$f":"ROUND(D23*H23,0)","v":44783}]
[{"$f":"A23+1","v":7},"Aquifer Peaking Withdrawals",null,{"$f":"(+'Monthly Inputs'!S32+'Monthly Inputs'!S34+'Monthly Inputs'!S35)","v":1909592},null,"x ",null,{"$f":"'Other Inputs'!E7","v":3.8719999999999997E-2},"=",73939]
[8,"Spire Injections",null,{"$f":"'Monthly Inputs'!S28","v":2316623},null,"x ",null,{"$f":"'Other Inputs'!E8","v":1.4999999999999999E-2},"=",34749]
[9,"Spire Withdrawals",null,{"$f":"'Monthly Inputs'!S36","v":2008600},null,"x ",null,{"$f":"'Other Inputs'!E9","v":0.01},"=",20086]
[10,"Clay Basin Injections",null,{"$f":"'Monthly Inputs'!S25","v":14681087},null,"x ",null,{"$f":"'Other Inputs'!E10","v":1.0489999999999999E-2},"=",154005]
[11,"Clay Basin Withdrawals",null,{"$f":"'Monthly Inputs'!S33","v":12124470},null,"x ",null,{"$f":"'Other Inputs'!E11","v":1.7809999999999999E-2},"=",215937]
[12,null,"Total Commodity Charges",null,null,null,null,null,null,{"$f":"SUM(J23:J28)","v":543499}]
[]
[{"$f":"A29+1","v":13},"Total Storage Charges",null,null,null,null,null,null,null,null,{"$f":"J20+J29","v":17268557}]
[]
[]
[]
[]
[]
[]
[]
["1/","Dominion Energy planned volumes."]

{"sheet":"Ut 1.5 p1","index":30,"n_rows":43,"n_cols":10,"rows_kept":43,"cut":false,"hidden":false,"merged":[[7,1,7,9]]}
[null,null,null,null,null,null,null,null,null,{"$f":"'Control Panel'!$E$32","v":"Dominion Energy Utah"}]
[null,null,null,null,null,null,null,null,null,{"$f":"'Control Panel'!$E$33","v":"Docket No. 19-057-18"}]
[null,null,null,null,null,null,null,null,null,"DEU Exhibit 1.5"]
[null,null,null,null,null,null,null,null,null,"Page 1 of 3"]
[]
[]
[]
[null,"TEST-YEAR GAS COST CHANGE"]
[]
[null,"COMMODITY"]
[null,"(A)","(B)","(C)",null,"(D)",null,"(E)        ",null,"(F)"]
[null,null,null,null,null,"Average Rate",null,"x         Dth       ","=","Total"]
[1,"Commodity Portion of Test-Year Gas Cost  1/",null,null,null,null,null,null,null,{"$f":"'Ut 1.1 p2'!H29","v":357156244.55624694}]
[{"$f":"A13+1","v":2},"191 Account Balance for Commodity Costs  2/",null,null,null,null,null,null,null,{"$f":"D42","v":49754027}]
[{"$f":"A14+1","v":3},"     Total",null,null,null,null,null,null,null,{"$f":"J13+J14","v":406910271.55624694}]
[]
[null,null,null,null,null,null,null,"Total       "]
[null,"Test-Year Sales:",null,"Firm",null,"+     Interruptible",null,"=    Sales Dth   "]
[]
[{"$f":"A15+1","v":4},"Utah",null,{"$f":"Calculations!P13","v":113293561},null,{"$f":"Calculations!P17","v":130911},null,{"$f":"D20+F20","v":113424472}]
[{"$f":"A20+1","v":5},"Wyoming",null,{"$f":"Calculations!P32","v":3793583},null,{"$f":"Calculations!P36","v":134598},null,{"$f":"D21+F21","v":3928181}]
[{"$f":"A21+1","v":6},"Total Dth",null,null,null,null,null,{"$f":"SUM(H20:H21)","v":117352653}]
[]
[]
[]
[null,null,null,null,null,"Current Case",null,"Prior Case"]
[null,"COMMODITY RATES",null,null,null,{"$f":"'Control Panel'!E5","v":"19-057-18"},null,{"$f":"'Control Panel'!E9","v":"19-057-04"},null,"Difference"]
[]
[{"$f":"A22+1","v":7},"Gas Cost (line 1/Total Sales Dth, line 4)",null,null,null,{"$f":"ROUND((J13)/H20,5)","v":3.1488499999999999},null,{"$f":"'Other Inputs'!F115","v":3.2163499999999998},null,{"$f":"F29-H29","v":-6.7499999999999893E-2}]
[{"$f":"A29+1","v":8},"191 Account Amortization (Commodity Portion)",null,null,null,{"$f":"D42/H20","v":0.43865337102913732},null,{"$f":"'Other Inputs'!F116","v":6.9220000000000004E-2},null,{"$f":"F30-H30","v":0.36943337102913731}]
[{"$f":"A30+1","v":9},"Total Sales Unit Commodity Cost (Lines 7 + 8)",null,null,null,{"$f":"F29+F30","v":3.5875033710291371},null,{"$f":"H29+H30","v":3.2855699999999999},null,{"$f":"J29+J30","v":0.30193337102913742}]
[]
[]
[]
[]
[]
[]
["1/","Exhibit 1.1, page 2, line 9, column E."]
[]
["2/","191 Account (July 2019) actual",null,{"$f":"'Other Inputs'!E133","v":53500538}]
[null,"Less: Supplier Non-Gas balance actual",null,{"$f":"'Other Inputs'!E134","v":3746511}]
[null,"191 Account Commodity Portion",null,{"$f":"(D40-D41)","v":49754027},null,{"$f":"H20","v":113424472},null,{"$f":"D42/F42","v":0.43865337102913732}]
[null,"See Application, paragraph 15."]

{"sheet":"Ut 1.5 p2","index":31,"n_rows":48,"n_cols":7,"rows_kept":48,"cut":false,"hidden":false,"merged":[[7,2,7,5]]}
[null,null,null,null,null,null,{"$f":"'Control Panel'!$E$32","v":"Dominion Energy Utah"}]
[null,null,null,null,null,null,{"$f":"'Control Panel'!$E$33","v":"Docket No. 19-057-18"}]
[null,null,null,null,null,null,"DEU Exhibit 1.5"]
[null,null,null,null,null,null,"Page 2 of 3"]
[]
[]
[]
[null,null,"TEST-YEAR SUPPLIER NON-GAS COST CHANGE"]
[null,null," ",null," "]
[null,"SNG"]
[null,null,"(A)","(B)","(C)","(D)"]
[null,null,null,"Dth","Average Rate","Total"]
[]
[]
[null,1,"Supplier Non-Gas (SNG) Costs  1/",null,null,{"$f":"'Ut 1.1 p2'!H43","v":86880199.699169874}]
[null,{"$f":"B15+1","v":2},"191 Account Balance for SNG Costs 2/",null,null,{"$f":"E45","v":2440017}]
[null,{"$f":"1+B16","v":3},"SNG Total Costs Recovered for Test-Year  3/",null,null,{"$f":"SUM(F15:F16)","v":89320216.699169874}]
[null,null,null,null,null," "]
[]
[null,4,"Supplier Non-Gas Base Cost at Current Rates",null,null,{"$f":"F22-F16","v":109773533.40005}]
[null,5,"Amortization 2/",null,null,{"$f":"'Other Inputs'!F137","v":2440017}]
[null,6,"SNG Total Costs Recovered at Current Rates  3/",null,null,{"$f":"'Other Inputs'!E240-(D30*('Other Inputs'!G92-'Other Inputs'!F241))","v":112213550.40005}]
[]
[]
[null,{"$f":"1+B22","v":7},"SNG Costs Adjustment to Current Rates  (Line 3 - Line 6)",null,null,{"$f":"F17-F22","v":-22893333.700880125}]
[]
[]
[]
[null,null,"Adjustment for SNG contributions from:"]
[null,8,"IS SNG current rate",{"$f":"'RevRun Fcst'!T102+'RevRun Fcst'!T93","v":130911},0.17863999999999999,{"$f":"D30*E30","v":23385.941039999998}]
[null,9,"IS SNG new rate",{"$f":"'RevRun Fcst'!T102+'RevRun Fcst'!T93","v":130911},0.17862,{"$f":"D31*E31","v":23383.322820000001}]
[]
[]
[]
[null,10,"Percent Change to Current Base Rates",null,null,{"$f":"(((+F17-F31)-(F22-F30))/(F22-F30))*100","v":-20.405827189088818},"%"]
[null,null,"((ln 1-ln 9)-(ln 4-ln 8))/(ln 4-8)"]
[]
[null,{"$f":"B35+1","v":11},"Percent Change to Amortization",null,null,{"$f":"(F16-F21)/F16","v":0},"%"]
[null,null,"(ln 2-ln 5)/ln 2"]
[]
[]
[]
[null,"1/","Exhibit 1.1, page 2, line 16, column E."]
[]
[null,"2/","Spring pass-through SNG amortization from Docket No. 19-057-04",null,{"$f":"'Other Inputs'!F137","v":2440017}]
[null,null,"Amortization will be adjusted in the 2020 spring pass-through."]
[]
[null,"3/",{"$f":"\"Output of Revrun.Exe computer program dated \"&'RevRun Fcst'!D4","v":"Output of Revrun.Exe computer program dated 08/06/19"}]

{"sheet":"Ut 1.5 p3","index":32,"n_rows":61,"n_cols":13,"rows_kept":61,"cut":false,"hidden":false,"merged":[[6,0,6,11],[7,0,7,11]]}
[null,null,null,null,null,null,null,null,null,null,null,null,{"$f":"'Control Panel'!$E$32","v":"Dominion Energy Utah"}]
[null,null,null,null,null,null,null,null,null,null,null,null,{"$f":"'Control Panel'!$E$33","v":"Docket No. 19-057-18"}]
[null,null,null,null,null,null,null,null,null,null,null,null,"DEU Exhibit 1.5"]
[null,null,null,null,null,null,null,null,null,null,null,null,"Page 3 of 3"]
[]
[]
["TEST-YEAR CHANGE IN SUPPLIER NON-GAS COSTS"]
["BY RATE CLASS"]
[]
[null,"SNG"]
[null,null,"      (A)","(B)","(C)",null,null,null,"(D)",null,null,"(E)"]
[]
[null,"Calculation of Rate Change"]
[null,null,"Rate Class","Season","Current Total  1/",null,null,null,"Percent Change 2/",null,null,"Proposed Total"]
[null,null,null,null,null,null,null,null,null,null,null," "]
[null,1,"GS","Winter",{"$f":"'Other Inputs'!G84","v":1.16499},"x","(1","+",{"$f":"'Ut 1.5 p2'!$F$35/100","v":-0.20405827189088818},")","=",{"$f":"ROUND(E16*(1+I16),5)","v":0.92725999999999997}]
[null,2,null,"Summer",{"$f":"'Other Inputs'!G85","v":0.54697999999999991},"x","(1","+",{"$f":"'Ut 1.5 p2'!$F$35/100","v":-0.20405827189088818},")","=",{"$f":"ROUND(E17*(1+I17),5)","v":0.43536000000000002}]
[null," "]
[null,{"$f":"B17+1","v":3},"FS","Winter",{"$f":"'Other Inputs'!G87","v":1.13466},"x","(1","+",{"$f":"'Ut 1.5 p2'!$F$35/100","v":-0.20405827189088818},")","=",{"$f":"ROUND(E19*(1+I19),5)","v":0.90312000000000003}]
[null,{"$f":"B19+1","v":4},null,"Summer",{"$f":"'Other Inputs'!G88","v":0.54697999999999991},"x","(1","+",{"$f":"'Ut 1.5 p2'!$F$35/100","v":-0.20405827189088818},")","=",{"$f":"ROUND(E20*(1+I20),5)","v":0.43536000000000002}]
[]
[null,{"$f":"B20+1","v":5},"NGV",null,{"$f":"'Other Inputs'!G90","v":0.84068000000000009},"x","(1","+",{"$f":"'Ut 1.5 p2'!$F$35/100","v":-0.20405827189088818},")","=",{"$f":"ROUND(E22*(1+I22),5)","v":0.66913}]
[]
[]
[null,"Calculation of Amortization"]
[null,null,"Rate Class","Season","Current Amortization 1/",null,null,null,"Percent Change 3/",null,null,"Proposed Amortization"]
[null,null,null,null,null,null,null,null,null,null,null," "]
[null,{"$f":"B22+1","v":6},"GS","Winter",{"$f":"'Other Inputs'!F84","v":2.5899999999999999E-2},"x","(1","+",{"$f":"'Ut 1.5 p2'!$F$38/100","v":0},")","=",{"$f":"ROUND(E28*ROUND(1+I28,7),5)","v":2.5899999999999999E-2}]
[null,{"$f":"B28+1","v":7},null,"Summer",{"$f":"'Other Inputs'!F85","v":1.2160000000000001E-2},"x","(1","+",{"$f":"'Ut 1.5 p2'!$F$38/100","v":0},")","=",{"$f":"ROUND(E29*ROUND(1+I29,7),5)","v":1.2160000000000001E-2}]
[]
[null,{"$f":"B29+1","v":8},"FS","Winter",{"$f":"'Other Inputs'!F87","v":2.5229999999999999E-2},"x","(1","+",{"$f":"'Ut 1.5 p2'!$F$38/100","v":0},")","=",{"$f":"ROUND(E31*ROUND(1+I31,7),5)","v":2.5229999999999999E-2}]
[null,{"$f":"B31+1","v":9},null,"Summer",{"$f":"'Other Inputs'!F88","v":1.2160000000000001E-2},"x","(1","+",{"$f":"'Ut 1.5 p2'!$F$38/100","v":0},")","=",{"$f":"ROUND(E32*ROUND(1+I32,7),5)","v":1.2160000000000001E-2}]
[]
[null,{"$f":"B32+1","v":10},"NGV",null,{"$f":"'Other Inputs'!F90","v":1.8700000000000001E-2},"x","(1","+",{"$f":"'Ut 1.5 p2'!$F$38/100","v":0},")","=",{"$f":"ROUND(E34*ROUND(1+I34,7),5)","v":1.8700000000000001E-2}]
[]
[]
[null,"Calculation of Proposed Base"]
[null,null,"Rate Class","Season","Proposed Total",null,null,null,{"$f":"L26","v":"Proposed Amortization"},null,null,"Proposed Base"]
[]
[null,{"$f":"B34+1","v":11},"GS","Winter",{"$f":"L16","v":0.92725999999999997},null,"-",null,{"$f":"L28","v":2.5899999999999999E-2},null,"=",{"$f":"E40-I40","v":0.90135999999999994}]
[null,{"$f":"B40+1","v":12},null,"Summer",{"$f":"L17","v":0.43536000000000002},null,"-",null,{"$f":"L29","v":1.2160000000000001E-2},null,"=",{"$f":"E41-I41","v":0.42320000000000002}]
[]
[null,{"$f":"B41+1","v":13},"FS","Winter",{"$f":"L19","v":0.90312000000000003},null,"-",null,{"$f":"L31","v":2.5229999999999999E-2},null,"=",{"$f":"E43-I43","v":0.87789000000000006}]
[null,{"$f":"B43+1","v":14},null,"Summer",{"$f":"L20","v":0.43536000000000002},null,"-",null,{"$f":"L32","v":1.2160000000000001E-2},null,"=",0.42320000000000002]
[]
[null,{"$f":"B44+1","v":15},"NGV",null,{"$f":"L22","v":0.66913},null,"-",null,{"$f":"L34","v":1.8700000000000001E-2},null,"=",{"$f":"E46-I46","v":0.65042999999999995}]
[]
[null,{"$f":"B46+1","v":16},"IS  4/",null,{"$f":"(('Other Inputs'!$F$44+'Other Inputs'!$F$45)/(1-'Other Inputs'!$E$265))/(1-'Other Inputs'!$E$276)","v":0.17907148584671118}]
[]
[]
[null,"1/","Current Dominon Energy Utah Tariff  (excluding bad debt surcharge)."]
[]
[null,"2/","Exhibit 1.5, page 2, line 10"]
[]
[null,"3/","Exhibit 1.5, page 2, line 11"]
[]
[null,"4/",{"$f":"\"Calculated by adding QPC T-2 and ACA rates, then adjusting for distr. loss of \"&TEXT('Other Inputs'!E265,\"0.000%\")","v":"Calculated by adding QPC T-2 and ACA rates, then adjusting for distr. loss of 0.450%"}]
[null,null,{"$f":"\"=  (\"&TEXT('Other Inputs'!$F$44,\"$0.00000\")&\" + \"&TEXT('Other Inputs'!$F$45,\"$0.00000\")&\")  /  ( 1 -  \"&TEXT('Other Inputs'!$E$265,\"0.00000\")&\" )  =  \"&TEXT(('Other Inputs'!F44+'Other Inputs'!F45)/(1-('Other Inputs'!$E$265)),(\"$0.00000\"))","v":"=  ($0.17652 + $0.00130)  /  ( 1 -  0.00450 )  =  $0.17862"}]
[null,null,{"$f":"\"IS Tariff rate has an adjustment for bad debt of  \"&TEXT('Other Inputs'!$E$276,\"0.00%\")","v":"IS Tariff rate has an adjustment for bad debt of  0.25%"}]
[null,null,{"$f":"\" = \"&TEXT((('Other Inputs'!$F$44+'Other Inputs'!$F$45)/(1-'Other Inputs'!$E$265)),\"$0.00000\")&\"  /  ( 1 -  \"&TEXT('Other Inputs'!$E$276,\"0.00000\")&\" )  =  \"&TEXT((('Other Inputs'!$F$44+'Other Inputs'!$F$45)/(1-'Other Inputs'!$E$265))/(1-('Other Inputs'!$E$276)),(\"$0.00000\"))","v":" = $0.17862  /  ( 1 -  0.00250 )  =  $0.17907"}]
[null,null,null,null,null,null,null,null,null,null,null,{"$f":"(#REF!/(1-('Other Inputs'!$E$276)))","v":{"$error":"#REF!"}}]

{"sheet":"Ut 1.6","index":33,"n_rows":32,"n_cols":12,"rows_kept":32,"cut":false,"hidden":false,"merged":[[6,2,6,9],[7,2,7,9],[10,5,10,6],[11,5,11,6],[12,5,12,6],[13,5,13,6],[10,7,10,8],[11,7,11,8],[12,7,12,8],[13,7,13,8]]}
[null,null," ",null,null,null,null,null,null,null,null,{"$f":"'Control Panel'!$E$32","v":"Dominion Energy Utah"}]
[null,null,null,null,null,null,null,null,null,null,null,{"$f":"'Control Panel'!$E$33","v":"Docket No. 19-057-18"}]
[null,null,null,null,null,null,null,null,null,null,null,"DEU Exhibit 1.6"]
[]
[]
[]
[null,null,"EFFECT ON GS TYPICAL CUSTOMER"]
[null,null,"80 DTHS -  ANNUAL CONSUMPTION"]
[]
[]
[null,null,"(A)","(B)","(C)  ","   (D)",null,"  (E)",null,"(F)    "]
[null,null,null,null,null,"     Billed at Current",null,"   Billed at"]
[null,null,"Rate",null,"Usage","     Rates Effective",null,"  Proposed Rates"]
[null,null,"Schedule","Month","In Dth",{"$f":"'Other Inputs'!J96","v":"2019-08-01"},null,{"$f":"'Control Panel'!E5","v":"19-057-18"},null,"   Change"]
[]
[null,1,"GS","Jan",{"$f":"'Monthly Inputs'!G116","v":14.9},{"$f":"ROUND((+E16*'Other Inputs'!$G$98)+'Other Inputs'!$G$100,2)","v":113.62},null,{"$f":"ROUND((+E16*'Ut 1.7 Source'!$F$10)+'Ut 1.7 Source'!$C$12,2)","v":114.58},null,{"$f":"H16-F16","v":0.95999999999999375}]
[null,{"$f":"B16+1","v":2},null,"Feb",{"$f":"'Monthly Inputs'!G117","v":12.5},{"$f":"ROUND((+E17*'Other Inputs'!$G$98)+'Other Inputs'!$G$100,2)","v":96.41},null,{"$f":"ROUND((+E17*'Ut 1.7 Source'!$F$10)+'Ut 1.7 Source'!$C$12,2)","v":97.21},null,0.79999999999999716]
[null,{"$f":"B17+1","v":3},null,"Mar",{"$f":"'Monthly Inputs'!G118","v":10.1},{"$f":"ROUND((+E18*'Other Inputs'!$G$98)+'Other Inputs'!$G$100,2)","v":79.2},null,{"$f":"ROUND((+E18*'Ut 1.7 Source'!$F$10)+'Ut 1.7 Source'!$C$12,2)","v":79.84},null,0.64000000000000057]
[null,4,null,"Apr",{"$f":"'Monthly Inputs'!G119","v":8.3000000000000007},{"$f":"ROUND((+E19*'Other Inputs'!$G$96)+'Other Inputs'!$G$100,2)","v":55.74},null,{"$f":"ROUND((+E19*'Ut 1.7 Source'!$C$10)+'Ut 1.7 Source'!$C$12,2)","v":57.32},null,1.5799999999999983]
[null,5,null,"May",{"$f":"'Monthly Inputs'!G120","v":4.4000000000000004},{"$f":"ROUND((+E20*'Other Inputs'!$G$96)+'Other Inputs'!$G$100,2)","v":32.72},null,{"$f":"ROUND((+E20*'Ut 1.7 Source'!$C$10)+'Ut 1.7 Source'!$C$12,2)","v":33.56},null,0.84000000000000341]
[null,6,null,"Jun",{"$f":"'Monthly Inputs'!G121","v":3.1},{"$f":"ROUND((+E21*'Other Inputs'!$G$96)+'Other Inputs'!$G$100,2)","v":25.05},null,{"$f":"ROUND((+E21*'Ut 1.7 Source'!$C$10)+'Ut 1.7 Source'!$C$12,2)","v":25.64},null,0.58999999999999986]
[null,7,null,"Jul",{"$f":"'Monthly Inputs'!G122","v":2},{"$f":"ROUND((+E22*'Other Inputs'!$G$96)+'Other Inputs'!$G$100,2)","v":18.559999999999999},null,{"$f":"ROUND((+E22*'Ut 1.7 Source'!$C$10)+'Ut 1.7 Source'!$C$12,2)","v":18.940000000000001},null,0.38000000000000256]
[null,8,null,"Aug",{"$f":"'Monthly Inputs'!G123","v":1.8},{"$f":"ROUND((+E23*'Other Inputs'!$G$96)+'Other Inputs'!$G$100,2)","v":17.38},null,{"$f":"ROUND((+E23*'Ut 1.7 Source'!$C$10)+'Ut 1.7 Source'!$C$12,2)","v":17.72},null,0.33999999999999986]
[null,9,null,"Sep",{"$f":"'Monthly Inputs'!G124","v":2},{"$f":"ROUND((+E24*'Other Inputs'!$G$96)+'Other Inputs'!$G$100,2)","v":18.559999999999999},null,{"$f":"ROUND((+E24*'Ut 1.7 Source'!$C$10)+'Ut 1.7 Source'!$C$12,2)","v":18.940000000000001},null,0.38000000000000256]
[null,10,null,"Oct",{"$f":"'Monthly Inputs'!G125","v":3.1},{"$f":"ROUND((+E25*'Other Inputs'!$G$96)+'Other Inputs'!$G$100,2)","v":25.05},null,{"$f":"ROUND((+E25*'Ut 1.7 Source'!$C$10)+'Ut 1.7 Source'!$C$12,2)","v":25.64},null,0.58999999999999986]
[null,11,null,"Nov",{"$f":"'Monthly Inputs'!G126","v":6.3},{"$f":"ROUND((+E26*'Other Inputs'!$G$98)+'Other Inputs'!$G$100,2)","v":51.94},null,{"$f":"ROUND((+E26*'Ut 1.7 Source'!$F$10)+'Ut 1.7 Source'!$C$12,2)","v":52.34},null,0.40000000000000568]
[null,12,null,"Dec",{"$f":"'Monthly Inputs'!G127","v":11.5},{"$f":"ROUND((+E27*'Other Inputs'!$G$98)+'Other Inputs'!$G$100,2)","v":89.24},null,{"$f":"ROUND((+E27*'Ut 1.7 Source'!$F$10)+'Ut 1.7 Source'!$C$12,2)","v":89.98},null,0.74000000000000909]
[]
[null,null,null,null,null,null,null,null,null," "]
[null,{"$f":"B27+1","v":13},null,"Total",{"$f":"SUM(E16:E27)","v":80},{"$f":"SUM(F16:F27)","v":623.47},null,{"$f":"SUM(H16:H27)","v":631.70999999999992},null,{"$f":"H30-F30","v":8.2399999999998954}]
[]
[null,{"$f":"B30+1","v":14}," ",null,null,null,null,"Percent Change:",null,{"$f":"ROUND(J30/F30,4)*100","v":1.32},"%"]

{"sheet":"Ut 1.7 Tot","index":34,"n_rows":33,"n_cols":12,"rows_kept":33,"cut":false,"hidden":true,"merged":[[4,0,4,12],[6,2,6,9],[8,2,8,9],[11,5,11,6],[11,7,11,8],[14,5,14,6],[14,7,14,8],[7,1,7,9],[12,5,12,6],[12,7,12,8],[13,5,13,6],[13,7,13,8]]}
[null,null," ",null,null,null,null,null,null,null,null,{"$f":"'Control Panel'!$E$32","v":"Dominion Energy Utah"}]
[null,null,null,null,null,null,null,null,null,null,null,"Docket Nos. 08-057-15, 08-057-16 & 08-057-17"]
[null,null,null,null,null,null,null,null,null,null,null,"Hearing Exhibit 2"]
[]
["NOT USED"]
[]
[null,null,"EFFECT ON GS-1 TYPICAL CUSTOMER"]
[null,"OF PROPOSED COMMODITY AND SNG RATES AND CET AND DSM AMORTIZATIONS"]
[null,null,"80 DTHS -  ANNUAL CONSUMPTION"]
[]
[]
[null,null,"(A)","(B)","(C)  ","   (D)",null,"  (E)",null,"(F)    "]
[null,null,null,null,null,"     Billed at Current",null,"   Billed at"]
[null,null,"Rate",null,"Usage","     Rates Effective",null,"  Proposed"]
[null,null,"Schedule","Month","In Dth",{"$f":"'Other Inputs'!J96","v":"2019-08-01"},null,"   Rates",null,"   Change"]
[]
[null,1,"GS","Jan",{"$f":"'Monthly Inputs'!G116","v":14.9},{"$f":"ROUND((+E17*'Other Inputs'!$G$98)+'Other Inputs'!$G$100,2)","v":113.62},null,{"$f":"'CET & DSM'!D107","v":{"$error":"#REF!"}},null,{"$f":"H17-F17","v":{"$error":"#REF!"}}]
[null,{"$f":"B17+1","v":2},null,"Feb",{"$f":"'Monthly Inputs'!G117","v":12.5},{"$f":"ROUND((+E18*'Other Inputs'!$G$98)+'Other Inputs'!$G$100,2)","v":96.41},null,{"$f":"'CET & DSM'!D108","v":{"$error":"#REF!"}},null,{"$error":"#REF!"}]
[null,3,null,"Mar",{"$f":"'Monthly Inputs'!G118","v":10.1},{"$f":"ROUND((+E19*'Other Inputs'!$G$98)+'Other Inputs'!$G$100,2)","v":79.2},null,{"$f":"'CET & DSM'!D109","v":{"$error":"#REF!"}},null,{"$error":"#REF!"}]
[null,4,null,"Apr",{"$f":"'Monthly Inputs'!G119","v":8.3000000000000007},{"$f":"ROUND((+E20*'Other Inputs'!$G$96)+'Other Inputs'!$G$100,2)","v":55.74},null,{"$f":"'CET & DSM'!D110","v":{"$error":"#REF!"}},null,{"$error":"#REF!"}]
[null,5,null,"May",{"$f":"'Monthly Inputs'!G120","v":4.4000000000000004},{"$f":"ROUND((+E21*'Other Inputs'!$G$96)+'Other Inputs'!$G$100,2)","v":32.72},null,{"$f":"'CET & DSM'!D111","v":{"$error":"#REF!"}},null,{"$error":"#REF!"}]
[null,6,null,"Jun",{"$f":"'Monthly Inputs'!G121","v":3.1},{"$f":"ROUND((+E22*'Other Inputs'!$G$96)+'Other Inputs'!$G$100,2)","v":25.05},null,{"$f":"'CET & DSM'!D112","v":{"$error":"#REF!"}},null,{"$error":"#REF!"}]
[null,7,null,"Jul",{"$f":"'Monthly Inputs'!G122","v":2},{"$f":"ROUND((+E23*'Other Inputs'!$G$96)+'Other Inputs'!$G$100,2)","v":18.559999999999999},null,{"$f":"'CET & DSM'!D113","v":{"$error":"#REF!"}},null,{"$error":"#REF!"}]
[null,8,null,"Aug",{"$f":"'Monthly Inputs'!G123","v":1.8},{"$f":"ROUND((+E24*'Other Inputs'!$G$96)+'Other Inputs'!$G$100,2)","v":17.38},null,{"$f":"'CET & DSM'!D114","v":{"$error":"#REF!"}},null,{"$error":"#REF!"}]
[null,9,null,"Sep",{"$f":"'Monthly Inputs'!G124","v":2},{"$f":"ROUND((+E25*'Other Inputs'!$G$96)+'Other Inputs'!$G$100,2)","v":18.559999999999999},null,{"$f":"'CET & DSM'!D115","v":{"$error":"#REF!"}},null,{"$error":"#REF!"}]
[null,10,null,"Oct",{"$f":"'Monthly Inputs'!G125","v":3.1},{"$f":"ROUND((+E26*'Other Inputs'!$G$96)+'Other Inputs'!$G$100,2)","v":25.05},null,{"$f":"'CET & DSM'!D116","v":{"$error":"#REF!"}},null,{"$error":"#REF!"}]
[null,11,null,"Nov",{"$f":"'Monthly Inputs'!G126","v":6.3},{"$f":"ROUND((+E27*'Other Inputs'!$G$98)+'Other Inputs'!$G$100,2)","v":51.94},null,{"$f":"'CET & DSM'!D117","v":{"$error":"#REF!"}},null,{"$error":"#REF!"}]
[null,12,null,"Dec",{"$f":"'Monthly Inputs'!G127","v":11.5},{"$f":"ROUND((+E28*'Other Inputs'!$G$98)+'Other Inputs'!$G$100,2)","v":89.24},null,{"$f":"'CET & DSM'!D118","v":{"$error":"#REF!"}},null,{"$error":"#REF!"}]
[]
[null,null,null,null,null,null,null,null,null," "]
[null,{"$f":"B28+1","v":13},null,"Total",{"$f":"SUM(E17:E28)","v":80},{"$f":"SUM(F17:F28)","v":623.47},null,{"$f":"SUM(H17:H28)","v":{"$error":"#REF!"}},null,{"$f":"H31-F31","v":{"$error":"#REF!"}}]
[]
[null,null," ",null,null,null,null,"Percent Change:",null,{"$f":"ROUND(J31/F31,4)*100","v":{"$error":"#REF!"}},"%"]

{"sheet":"Ut 1.7 p1","index":35,"n_rows":40,"n_cols":6,"rows_kept":40,"cut":false,"hidden":false,"merged":[[39,0,39,4],[14,0,14,4],[15,0,15,4],[16,0,16,4],[17,0,17,4],[28,0,28,4],[30,0,30,4],[31,0,31,4],[32,0,32,4],[33,0,33,4],[34,0,34,4],[38,0,38,4],[36,0,36,4]]}
[null,null,null,null,null,{"$f":"'Control Panel'!E32","v":"Dominion Energy Utah"}]
[null,null,null,null,null,{"$f":"'Control Panel'!E33","v":"Docket No. 19-057-18"}]
[null,null,null,null,null," DEU Exhibit 1.7"]
[null,null,null,null,null,"Page 1 of 29"]
[]
[]
[]
[]
[]
[]
[]
[]
[]
[]
["DOMINION ENERGY UTAH"]
["333 South State Street"]
["P.O. Box 45433"]
["Salt Lake City, Utah  84145-0433"]
[]
[]
[]
[]
[]
[]
[]
[]
[]
[]
["LEGISLATIVE/PROPOSED RATE SCHEDULES"]
[]
["P.S.C. Utah No. 500"]
["Affecting All Firm Sales Rate Schedules"]
["and Classes of Service In"]
["Dominion Energy"]
["Utah Service Area"]
[]
["Tariff Section 2.06, pages 2-9 through 2-14"]
[]
["Date Issued: September 30, 2019"]
["To Become Effective October 1, 2019"]

{"sheet":"LEG - PR","index":36,"n_rows":7,"n_cols":1,"rows_kept":7,"cut":false,"hidden":false,"merged":[[6,0,6,11],[1,0,1,11],[2,0,2,11],[5,0,5,11]]}
[]
["LEGISLATIVE TARIFF"]
["SHEETS"]
[]
[]
["PROPOSED TARIFF"]
["SHEETS"]

{"sheet":"Ut 1.7 Source","index":37,"n_rows":69,"n_cols":9,"rows_kept":69,"cut":false,"hidden":false,"merged":[[0,0,0,7],[3,2,3,4],[2,2,2,7],[3,5,3,7]]}
["SUMMARY OF PROPOSED RATES"]
[]
["UTAH RATE CLASSES",null,"Rates per Dth Used Each Month"]
[null,null,"All Season Rates or Summer Rates:  Apr. 1 - Oct. 31",null,null,"Winter Rates:  Nov. 1 - Mar. 31"]
["UT GS",null,"First 45 Dth","All Over 45 Dth",null,"First 45 Dth","All Over 45 Dth"]
[null,"Distribution Non-Gas Cost",2.0703200000000002,0.93349000000000004,null,2.7222400000000002,1.58541]
[null,"Supplier Non-Gas Cost",{"$f":"+'Ut 1.5 p3'!L17","v":0.43536000000000002},{"$f":"C7","v":0.43536000000000002},null,{"$f":"+'Ut 1.5 p3'!L16","v":0.92725999999999997},{"$f":"F7","v":0.92725999999999997},null," "]
[null,"Commodity Cost",{"$f":"('Ut 1.5 p1'!$F$31)","v":3.5875033710291371},{"$f":"C8","v":3.5875033710291371},null,{"$f":"D8","v":3.5875033710291371},{"$f":"F8","v":3.5875033710291371}]
[]
[null,"Total Rate",{"$f":"SUM(C6:C9)","v":6.0931833710291379},{"$f":"SUM(D6:D9)","v":4.9563533710291372},null,{"$f":"SUM(F6:F9)","v":7.2370033710291377},{"$f":"SUM(G6:G9)","v":6.100173371029137}]
[]
[null,"BSF Category 1",6.75]
[null,"BSF Category 2",18.25]
[null,"BSF Category 3",63.5]
[null,"BSF Category 4",420.25]
[]
[]
["UT FS",null,"First 200 Dth","Next 1,800 Dth","All Over 2,000 Dth","First 200 Dth","Next 1,800 Dth","All Over 2,000 Dth"]
[null,"Distribution Non-Gas Cost",0.94110000000000005,0.48792999999999997,1.091E-2,1.41228,0.95911000000000002,0.48208000000000001]
[null,"Supplier Non-Gas Cost",{"$f":"+'Ut 1.5 p3'!L20","v":0.43536000000000002},{"$f":"C20","v":0.43536000000000002},{"$f":"D20","v":0.43536000000000002},{"$f":"+'Ut 1.5 p3'!L19","v":0.90312000000000003},{"$f":"F20","v":0.90312000000000003},{"$f":"G20","v":0.90312000000000003}]
[null,"Commodity Cost",{"$f":"('Ut 1.5 p1'!$F$31)","v":3.5875033710291371},{"$f":"C21","v":3.5875033710291371},{"$f":"D21","v":3.5875033710291371},{"$f":"E21","v":3.5875033710291371},{"$f":"F21","v":3.5875033710291371},{"$f":"G21","v":3.5875033710291371}]
[]
[null,"Total Rate",{"$f":"SUM(C19:C22)","v":4.9639633710291369},{"$f":"SUM(D19:D22)","v":4.5107933710291368},4.0337733710291372,5.9029033710291365,5.4497333710291374,4.9727033710291373]
[]
[null,"Minimum Monthly DNG Charge:",143,null,null,218]
[]
[null,"BSF Category 1",{"$f":"C12","v":6.75}]
[null,"BSF Category 2",{"$f":"C13","v":18.25}]
[null,"BSF Category 3",{"$f":"C14","v":63.5}]
[null,"BSF Category 4",{"$f":"C15","v":420.25}]
[]
[]
["UT Future Rate Class"]
[null,null,"First 10,000 Dth","All Over 10,000 Dth"]
[null,"Distribution Non-Gas Cost"]
[null,"Supplier Non-Gas Cost"]
[null,"Commodity Cost"]
[]
[null,"Total Rate",{"$f":"SUM(C35:C38)","v":0},{"$f":"SUM(D35:D38)","v":0}]
[]
[null,"Minimum Yearly Distribution Non-Gas Charge",null,{"$f":"ROUND(((10000*C35))*12,-2)","v":0}]
[]
[]
[null,"BSF Category 1",{"$f":"C12","v":6.75}]
[null,"BSF Category 2",{"$f":"C13","v":18.25}]
[null,"BSF Category 3",{"$f":"C14","v":63.5}]
[null,"BSF Category 4",{"$f":"C15","v":420.25}]
[]
[]
[]
["UT NGV"]
[null,"Distribution Non-Gas Cost",6.86015]
[null,"Supplier Non-Gas Cost",{"$f":"+'Ut 1.5 p3'!L22","v":0.66913}]
[null,"Commodity Cost",{"$f":"'Ut 1.5 p1'!F31","v":3.5875033710291371}]
[]
[null,"Total Rate",{"$f":"SUM(C52:C55)","v":11.116783371029136}]
[]
[]
["UT IS",null,"First 2,000 Dth","Next 18,000 Dth","All Over 20,000"]
[null,"Distribution Non-Gas Cost",0.97450999999999999,0.11831999999999999,0.10639]
[null,"Supplier Non-Gas Cost",{"$f":"+'Ut 1.5 p3'!$E$48","v":0.17907148584671118},{"$f":"C61","v":0.17907148584671118},{"$f":"D61","v":0.17907148584671118}]
[null,"Commodity Cost",{"$f":"('Ut 1.5 p1'!$F$31)","v":3.5875033710291371},{"$f":"('Ut 1.5 p1'!$F$31)","v":3.5875033710291371},{"$f":"('Ut 1.5 p1'!$F$31)","v":3.5875033710291371}]
[]
[null,"Total Rate",{"$f":"SUM(C60:C62)","v":4.7410848568758484},{"$f":"SUM(D60:D62)","v":3.8848948568758481},3.8729648568758481]
[]
[null,"BSF Category 1",{"$f":"C12","v":6.75}]
[null,"BSF Category 2",{"$f":"C13","v":18.25}]
[null,"BSF Category 3",63.5]
[null,"BSF Category 4",420.25]

{"sheet":"Ut 1.11","index":38,"n_rows":32,"n_cols":6,"rows_kept":32,"cut":false,"hidden":true,"merged":[[31,0,31,4],[32,0,32,4],[33,0,33,4],[34,0,34,4],[35,0,35,4],[16,0,16,4],[17,0,17,4],[18,0,18,4],[19,0,19,4],[30,0,30,4]]}
[null,null,null,null,null,{"$f":"'Control Panel'!E36","v":0}]
[null,null,null,null,null,{"$f":"'Control Panel'!E33","v":"Docket No. 19-057-18"}]
[null,null,null,null,null," Exhibit 1.11"]
[null,null,null,null,null,"Page 1 of 7"]
[]
[]
[]
[]
[]
[]
[]
[]
[]
[]
[]
[]
["DOMINION ENERGY UTAH"]
["333 South State Street"]
["P.O. Box 45433"]
["Salt Lake City, Utah  84145-0433"]
[]
[]
[]
[]
[]
[]
[]
[]
[]
[]
["LEGISLATIVE/PROPOSED RATE SCHEDULES"]
["P.S.C. Utah Tariff"]

{"sheet":"Ut 1.8 p1","index":39,"n_rows":40,"n_cols":6,"rows_kept":40,"cut":false,"hidden":false,"merged":[[39,0,39,4],[14,0,14,4],[15,0,15,4],[16,0,16,4],[17,0,17,4],[28,0,28,4],[30,0,30,4],[31,0,31,4],[32,0,32,4],[33,0,33,4],[34,0,34,4],[38,0,38,4],[36,0,36,4]]}
[null,null,null,null,null,{"$f":"'Control Panel'!E32","v":"Dominion Energy Utah"}]
[null,null,null,null,null,{"$f":"'Control Panel'!E33","v":"Docket No. 19-057-18"}]
[null,null,null,null,null,"DEU Exhibit 1.8"]
[null,null,null,null,null,"Page 1 of 29"]
[]
[]
[]
[]
[]
[]
[]
[]
[]
[]
["DOMINION ENERGY UTAH"]
["333 South State Street"]
["P.O. Box 45433"]
["Salt Lake City, Utah  84145-0433"]
[]
[]
[]
[]
[]
[]
[]
[]
[]
[]
["LEGISLATIVE/PROPOSED COMBINED RATE SCHEDULES"]
[]
["P.S.C. Utah No. 500"]
["Affecting All Rate Schedules"]
["and Classes of Service In"]
["Dominion Energy"]
["Utah Service Area"]
[]
[]
[]
["Date Issued: August 30, 2019"]
["To Become Effective October 1, 2019"]

{"sheet":"Ut Storage","index":40,"n_rows":31,"n_cols":13,"rows_kept":31,"cut":false,"hidden":false,"merged":[[0,0,0,12]]}
["Storage Injection / Withdrawal adjustment"]
[]
[null,null,"   (A)   ","   (B)   ","   (C)   ","   (D)   ","   (E)   ","   (F)   ","   (G)   ",null,"   (H)   ","   (I)   ","   (J)   "]
[null,null,null,null,null,null,"Injections",null,"(J) / (C)"]
[null,null,null,null,"Storage",null,"-------------------------------------------------------------",null,"Storage",null,null,null,"Storage"]
[null,null,"Injection Dth","Withdrawal Dth","Inventory Dth","% that is","Co. Prod.","Purchased","Inventory",null,null,null,"Inventory"]
["Line","Month","Per IRPs","Per IRPs","Balance","Co. Prod. (1)"," $/Dth (2)","$/Dth (3)","Average $/Dth",null,"Injection (4)","Withdrawal (5)","Balance"]
[null,{"$f":"+Expenses!S9","v":"2019-07-01"},null,null,{"$f":"-1*'Other Inputs'!D245","v":6908613},null,null,null,{"$f":"M8/E8","v":4.8521784879251415},null,null,null,{"$f":"'Other Inputs'!E245","v":33521823.379999973}]
[null,{"$f":"'Monthly Inputs'!E3","v":"Aug19"},{"$f":"'Monthly Inputs'!E29","v":2905762.7258300781},{"$f":"-'Monthly Inputs'!E37","v":0},{"$f":"E8+C9+D9","v":9814375.7258300781},{"$f":"F21","v":0.98980723998384423},{"$f":"'Other Inputs'!F112","v":3.7217199999999999},{"$f":"'Monthly Inputs'!E79","v":2.0002681739130437},{"$f":"M9/E9","v":4.5122862984705474}," ",{"$f":"(+F9*C9*G9)+((1-F9)*C9*H9)","v":10763449.735705024},{"$f":"D9*I8","v":0},{"$f":"M8+L9+K9","v":44285273.115704998}]
[null,{"$f":"'Monthly Inputs'!F3","v":"Sep19"},{"$f":"'Monthly Inputs'!F29","v":2226814.7315979004},{"$f":"-'Monthly Inputs'!F37","v":0},{"$f":"E9+C10+D10","v":12041190.457427979},{"$f":"F22","v":0.79414479822662087},{"$f":"G9","v":3.7217199999999999},{"$f":"'Monthly Inputs'!F79","v":1.9556849999999999},4.2988524525391885,null,{"$f":"(+F10*C10*G10)+((1-F10)*C10*H10)","v":7478028.0137007385},{"$f":"D10*I9","v":0},{"$f":"M9+L10+K10","v":51763301.129405737}]
["1.  ",{"$f":"'Monthly Inputs'!G3","v":"Oct19"},{"$f":"'Monthly Inputs'!G29","v":3936714},{"$f":"-'Monthly Inputs'!G37","v":0},{"$f":"E10+C11+D11","v":15977904.457427979},{"$f":"Calculations!D177","v":0.51243015042100382},{"$f":"'Ut 1.2 p3'!$G$50","v":3.8283349658348267},{"$f":"Calculations!D197","v":1.92276},3.9540076507614494,null,11413455.338399954,{"$f":"D11*I10","v":0},{"$f":"M10+L11+K11","v":63176756.467805691}]
["2.  ",{"$f":"'Monthly Inputs'!H3","v":"Nov19"},{"$f":"'Monthly Inputs'!H29","v":1626786},{"$f":"-'Monthly Inputs'!H37","v":-1455328},{"$f":"E11+C12+D12","v":16149362.457427979},{"$f":"Calculations!E177","v":0.41465636579889947},{"$f":"'Ut 1.2 p3'!$G$50","v":3.8283349658348267},{"$f":"Calculations!E197","v":2.1507499999999999},3.8424312750839711,null,4630436.9576498624,{"$f":"D12*I11","v":-5754378.0463673584},{"$f":"M11+L12+K12","v":62052815.379088201}]
["3.  ",{"$f":"'Monthly Inputs'!I3","v":"Dec19"},{"$f":"'Monthly Inputs'!I29","v":0},{"$f":"-'Monthly Inputs'!I37","v":-3831646.0000000005},{"$f":"E12+C13+D13","v":12317716.457427979},{"$f":"Calculations!F177","v":0.34689706571358031},{"$f":"'Ut 1.2 p3'!$G$50","v":3.8283349658348267},{"$f":"Calculations!F197","v":2.3538299999999999},3.8424312750839711,null,0,{"$f":"D13*I12","v":-14722836.4254504},47329978.953637801]
["4.  ",{"$f":"'Monthly Inputs'!J3","v":"Jan20"},{"$f":"'Monthly Inputs'!J29","v":0},{"$f":"-'Monthly Inputs'!J37","v":-3997691.9999999995},8320024.4574279785,{"$f":"Calculations!G177","v":0.31119489645538051},{"$f":"'Ut 1.2 p3'!$G$50","v":3.8283349658348267},{"$f":"Calculations!G197","v":2.32986},{"$f":"M14/E14","v":3.8424312750839711},null,0,{"$f":"D14*I13","v":-15360856.768952988},31969122.184684813]
["5.  ",{"$f":"'Monthly Inputs'!K3","v":"Feb20"},{"$f":"'Monthly Inputs'!K29","v":0},{"$f":"-'Monthly Inputs'!K37","v":-3671446.0000000005},4648578.4574279785,{"$f":"Calculations!H177","v":0.35130867108813052},{"$f":"'Ut 1.2 p3'!$G$50","v":3.8283349658348267},{"$f":"Calculations!H197","v":2.2473999999999998},3.8424312750839711,null,0,-14107278.935181947,17861843.249502867]
["6.  ",{"$f":"'Monthly Inputs'!L3","v":"Mar20"},{"$f":"'Monthly Inputs'!L29","v":0},{"$f":"-'Monthly Inputs'!L37","v":-3086550},{"$f":"E15+C16+D16","v":1562028.4574279785},{"$f":"Calculations!I177","v":0.46855321319518722},{"$f":"'Ut 1.2 p3'!$G$50","v":3.8283349658348267},{"$f":"Calculations!I197","v":1.8371999999999999},{"$f":"M16/E16","v":3.8424312750839715},null,0,-11859856.252110431,6001986.9973924365]
["7.  ",{"$f":"'Monthly Inputs'!M3","v":"Apr20"},{"$f":"'Monthly Inputs'!M29","v":335461},{"$f":"-'Monthly Inputs'!M37","v":0},1897489.4574279785,{"$f":"Calculations!J177","v":0.50808696660818631},{"$f":"'Ut 1.2 p3'!$G$50","v":3.8283349658348267},{"$f":"Calculations!J197","v":1.7943199999999999},{"$f":"M17/E17","v":3.6630484035872102},null,948608.73046268104,0,6950595.727855118]
["8.  ",{"$f":"'Monthly Inputs'!N3","v":"May20"},{"$f":"'Monthly Inputs'!N29","v":1765470.9999999998},{"$f":"-'Monthly Inputs'!N37","v":0},3662960.4574279785,{"$f":"Calculations!K177","v":0.65613578388485094},{"$f":"'Ut 1.2 p3'!$G$50","v":3.8283349658348267},{"$f":"Calculations!K197","v":1.64062},3.3801312342190197,null,5430691.3240063796,{"$f":"D18*I17","v":0},12381287.051861499]
["9.  ",{"$f":"'Monthly Inputs'!O3","v":"Jun20"},{"$f":"'Monthly Inputs'!O29","v":3041730},{"$f":"-'Monthly Inputs'!O37","v":0},6704690.4574279785,{"$f":"Calculations!L177","v":0.71701503379524412},{"$f":"'Ut 1.2 p3'!$G$50","v":3.8283349658348267},{"$f":"Calculations!L197","v":1.59294},3.2964834552181803,null,9720614.1134090461,0,{"$f":"M18+L19+K19","v":22101901.165270545}]
["10.  ",{"$f":"'Monthly Inputs'!P3","v":"Jul20"},{"$f":"'Monthly Inputs'!P29","v":2263500},{"$f":"-'Monthly Inputs'!P37","v":0},8968190.4574279785,{"$f":"Calculations!M177","v":0.94561679113006092},{"$f":"'Ut 1.2 p3'!$G$50","v":3.8283349658348267},{"$f":"Calculations!M197","v":1.85},3.4035641422141985,null,8421910.2961788736,0,{"$f":"M19+L20+K20","v":30523811.461449418}]
["11.  ",{"$f":"'Monthly Inputs'!Q3","v":"Aug20"},{"$f":"'Monthly Inputs'!Q29","v":2299070},{"$f":"-'Monthly Inputs'!Q37","v":0},11267260.457427979,{"$f":"Calculations!N177","v":0.98980723998384423},{"$f":"'Ut 1.2 p3'!$G$50","v":3.8283349658348267},{"$f":"Calculations!N197","v":1.9},3.4862274934738933,null,8756421.7213672381,0,{"$f":"M20+L21+K21","v":39280233.182816654}]
["12.  ",{"$f":"'Monthly Inputs'!R3","v":"Sep20"},{"$f":"'Monthly Inputs'!R29","v":2885570},{"$f":"-'Monthly Inputs'!R37","v":0},14152830.457427979,{"$f":"Calculations!O177","v":0.79414479822662087},{"$f":"'Ut 1.2 p3'!$G$50","v":3.8283349658348267},{"$f":"Calculations!O197","v":1.7},3.466650043436498,null,9782677.1371754427,0,{"$f":"M21+L22+K22","v":49062910.319992095}]
[]
[]
[null,null,null,null,null,null,null,null,null,null,null,null,"Inj./With. Adj."]
["14.  ","Total",{"$f":"SUM(C11:C22)","v":18154302},{"$f":"SUM(D11:D22)","v":-16042662},null,null,null,null,null,null,{"$f":"SUM(K11:K22)","v":59104815.618649475},{"$f":"SUM(L11:L22)","v":-61805206.428063117},{"$f":"L26+K26","v":-2700390.8094136417}]
["15.  ","Average  $ /Dth",null,null,null,null,null,null,null,null,{"$f":"K26/C26","v":3.2556919907275685},{"$f":"L26/D26","v":3.852553050613615}]
[]
[]
[]
["___________________________________________________________________"]

{"sheet":"Ex 1.1 Data","index":41,"n_rows":26,"n_cols":12,"rows_kept":26,"cut":false,"hidden":false,"merged":[]}
["QEPFS gathered",39099667.203999989,"Adjusted test year->",-0.10299161956282289,35072729.154292643,null,null,"Samson Gathered",13796292.640000002,"Adjusted test year->",-0.25997445794892254,10209608.939211292]
["Birch Creek",1345871.5319999994,"Adjusted test year->",-0.10299161956282289,1207258.0431958218]
["Other",15275436.28199999]
[null,null,"WEXPRO I",null,null,null,null,null,null,"WEXPRO II"]
["Input Operator Service Fee >",null,{"$f":"+'Monthly Inputs'!S107","v":169504821.75115463},null,null,null,null,"Input Operator Service Fee >",null,{"$f":"+'Monthly Inputs'!S109","v":34179099.044726923}]
[]
[]
["\\/",null,"2019-07-31",null,null,null,null,"\\/",null,"2019-07-31"]
["\\/","Company","Average Index","Church Buttes",null,null,null,"\\/","Company","Average Index","Church Buttes"]
["\\/","Production","Spot Prices","& Canyon Cr",null,null,null,"\\/","Production","Spot Prices","& Canyon Cr"]
["January",4358163,2.4,{"$f":"C11+0.1","v":2.5},{"$f":"B11*D11","v":10895407.5},null,null,"January",1075453,2.4,{"$f":"J11+0.1","v":2.5},{"$f":"I11*K11","v":2688632.5}]
["February",4113328.9999999995,2.2400000000000002,{"$f":"C12+0.1","v":2.3400000000000003},{"$f":"B12*D12","v":9625189.8599999994},null,null,"February",982880,2.2400000000000002,{"$f":"J12+0.1","v":2.3400000000000003},{"$f":"I12*K12","v":2299939.2000000002}]
["March",4291851.0000000009,1.8,{"$f":"C13+0.1","v":1.9000000000000001},8154516.9000000022,null,null,"March",1028537,1.8,1.9000000000000001,1954220.3]
["April",4070250,1.75,1.85,7529962.5,null,null,"April",975834,1.75,1.85,1805292.9000000001]
["May",4130934.9999999995,1.64,{"$f":"C15+0.1","v":1.74},7187826.8999999994,null,null,"May",989735,1.64,1.74,1722138.9]
["June",3931044,1.59,1.6900000000000002,6643464.3600000003,null,null,"June",940995,1.59,1.6900000000000002,1590281.55]
["July",4000312,1.83,1.9300000000000002,7720602.1600000011,null,null,"July",956076,1.83,1.9300000000000002,1845226.6800000002]
["August",4001024.0000000005,1.88,1.98,7922027.5200000005,null,null,"August",998334,1.88,1.98,1976701.32]
["September",3914310,1.7,1.8,7045758,null,null,"September",896292,1.7,1.8,1613325.6]
["October",4510066,1.88,1.98,8929930.6799999997,null,null,"October",1148158,1.88,1.98,2273352.84]
["November",4273743,2.11,2.21,9444972.0299999993,null,null,"November",1086762,2.11,2.21,2401744.02]
["December",4462731,2.42,2.52,11246082.119999999,null,null,"December",1099931,2.42,2.52,2771826.12]
[]
[null,{"$f":"SUM(B11:B22)","v":50057758},"CANYON CREEK",{"$f":"E24/B24","v":2.0445530247279557},{"$f":"SUM(E11:E22)","v":102345740.53000003},null,null,null,{"$f":"SUM(I11:I22)","v":12178987},"CANYON CREEK",{"$f":"L24/I24","v":2.0480095700898606},{"$f":"SUM(L11:L22)","v":24942681.930000003}]
[null,null,"CHURCH BUTTES",null,null,null,null,null,null,"CHURCH BUTTES"]
[null,null,"All Others ->",{"$f":"D24-0.2","v":1.8445530247279558},null,null,null,null,null,"All Others ->",{"$f":"K24-0.2","v":1.8480095700898607}]

{"sheet":"Expenses","index":42,"n_rows":1042,"n_cols":19,"rows_kept":1042,"cut":false,"hidden":false,"merged":[[8,4,8,5],[10,2,10,4]]}
["%,LACTUALS"]
[]
[]
[]
[]
[]
[null,null,null,null,null,null,null,null,null,null,null,null,null,null,null,null,null,null,"Historical"]
[null,null,null,null,null,null,null,null,null,null,null,null,null,null,null,null,null,null,"12 Months Ending"]
[null,null,"FERC Acct",null,"Description",null,"2018-08-01","2018-09-01","2018-10-01","2018-11-01","2018-12-01","2019-01-01","2019-02-01","2019-03-01","2019-04-01","2019-05-01","2019-06-01","2019-07-01",{"$f":"+R9","v":"2019-07-01"}]
[]
[null,497,"UTILITY OPERATING EXPENSES"]
[null,498,"GAS PURCHASE EXPENSES"]
[null,499]
[null,500,null,"Utah % of Sales Dth from 191 Acct ===>",null,null,6,7,8,9,10,11,0,1,2,3,4,5,12]
[null,501]
["%,FACCOUNT,TQGCACCTS,V758000",502,758,"Gas Well Royalties"]
[null,503,null,null,"Utah",null,0,0,0,0,0,0,0,0,0,0,0,0,0]
[null,504,null,null,"Wyoming",null,0,0,0,0,0,0,0,0,0,0,0,0,0]
[null,505,null,null,"Total",null,0,0,0,0,0,0,0,0,0,0,0,0,0]
[null,506]
["%,FACCOUNT,TQGCACCTS,V758001,V758002,V758003,V758004",507,758.1,"Gas Well Royalties - Other"]
[null,508,null,null,"Utah",null,0,0,0,0,0,0,0,0,0,0,0,0,0]
[null,509,null,null,"Wyoming",null,0,0,0,0,0,0,0,0,0,0,0,0,0]
[null,510,null,null,"Total",null,0,0,0,0,0,0,0,0,0,0,0,0,0]
[null,511]
["%,FACCOUNT,TQGCACCTS,V759000,V759001,V759002,V759003,V759004",512,759,"Gathering by Others, GRI & ACA  -  Gas Cost"]
[null,513,null,null,"Utah",null,0,0,0,0,0,0,0,0,0,0,0,0,0]
[null,514,null,null,"Wyoming",null,0,0,0,0,0,0,0,0,0,0,0,0,0]
[null,515,null,null,"Total",null,0,0,0,0,0,0,0,0,0,0,0,0,0]
[null,516]
["%,FACCOUNT,TQGCACCTS,V759005",517,759,"Gathering by Others - SNG Cost"]
[null,518,null,null,"Utah",null,0,0,0,0,0,0,0,0,0,0,0,0,0]
[null,519,null,null,"Wyoming",null,0,0,0,0,0,0,0,0,0,0,0,0,0]
[null,520,null,null,"Total",null,0,0,0,0,0,0,0,0,0,0,0,0,0]
[null,521]
["%,FACCOUNT,TQGCACCTS,V800000,V800005,V800002",522,800,"Natural Gas Well Head Purchases"]
[null,523,null,null,"Utah",null,0,0,0,0,0,0,0,0,0,0,0,0,0]
[null,524,null,null,"Wyoming",null,0,0,0,0,0,0,0,0,0,0,0,0,0]
[null,525,null,null,"Total",null,0,0,0,0,0,0,0,0,0,0,0,0,0]
[null,526]
["%,FACCOUNT,TQGCACCTS,V801000",527,801,"Natural Gas Field Line Purchases"]
[null,528,null,null,"Utah",null,0,0,0,0,0,0,0,0,0,0,0,0,0]
[null,529,null,null,"Wyoming",null,0,0,0,0,0,0,0,0,0,0,0,0,0]
[null,530,null,null,"Total",null,0,0,0,0,0,0,0,0,0,0,0,0,0]
[null,531]
["%,FACCOUNT,TQGCACCTS,V802000",532,802,"Natural Gas Gasoline Plant Outlet Purchase"]
[null,533,null,null,"Utah",null,0,0,0,0,0,0,0,0,0,0,0,0,0]
[null,534,null,null,"Wyoming",null,0,0,0,0,0,0,0,0,0,0,0,0,0]
[null,535,null,null,"Total",null,0,0,0,0,0,0,0,0,0,0,0,0,0]
[null,536]
["%,FACCOUNT,TQGCACCTS,V803000,V803002",537,803,"Natural Gas Transmission Line - Purchases"]
[null,538,null,null,"Utah",null,0,0,0,0,0,0,0,0,0,0,0,0,0]
[null,539,null,null,"Wyoming",null,0,0,0,0,0,0,0,0,0,0,0,0,0]
[null,540,null,null,"Total",null,0,0,0,0,0,0,0,0,0,0,0,0,0]
[null,541]
["%,FACCOUNT,V804000,FAFFILIATE,V09",542,804,"Natural Gas City Gate Purchases - Resources"]
[null,543,null,null,"Utah",null,0,0,0,0,0,0,0,0,0,0,0,0,0]
[null,544,null,null,"Wyoming",null,0,0,0,0,0,0,0,0,0,0,0,0,0]
[null,545,null,null,"Total",null,0,0,0,0,0,0,0,0,0,0,0,0,0]
[null,546]
["%,FACCOUNT,V804000,FAFFILIATE,V",547,804.1,"Natural Gas City Gate Purchases - Other"]
[null,548,null,null,"Utah",null,0,0,0,0,0,0,0,0,0,0,0,0,0]
[null,549,null,null,"Wyoming",null,0,0,0,0,0,0,0,0,0,0,0,0,0]
[null,550,null,null,"Total",null,0,0,0,0,0,0,0,0,0,0,0,0,0]
[null,551]
[null,552,805,"Purchased Gas Cost Adjustments - Other"]
[null,553,null,null,"Utah",null,0,0,0,0,0,0,0,0,0,0,0,0,0]
[null,554,null,null,"Wyoming",null,0,0,0,0,0,0,0,0,0,0,0,0,0]
[null,555,null,null,"Total",null,0,0,0,0,0,0,0,0,0,0,0,0,0]
[null,556]
["%,FACCOUNT,TQGCACCTS,V805100",557,805.1,"Purchased Gas Cost Adjustments - Utah"]
[null,558,null,null,"Utah",null,0,0,0,0,0,0,0,0,0,0,0,0,0]
[null,559,null,null,"Wyoming",null,0,0,0,0,0,0,0,0,0,0,0,0,0]
[null,560,null,null,"Total",null,0,0,0,0,0,0,0,0,0,0,0,0,0]
[null,561]
["%,FACCOUNT,TQGCACCTS,V806000",562,806,"Exchange Gas"]
[null,563,null,null,"Utah",null,0,0,0,0,0,0,0,0,0,0,0,0,0]
[null,564,null,null,"Wyoming",null,0,0,0,0,0,0,0,0,0,0,0,0,0]
[null,565,null,null,"Total",null,0,0,0,0,0,0,0,0,0,0,0,0,0]
[null,566]
["%,FACCOUNT,TQGCACCTS,V808100",567,808.1,"Gas Withdrawn from Underground Storage"]
[null,568,null,null,"Utah",null,0,0,0,0,0,0,0,0,0,0,0,0,0]
[null,569,null,null,"Wyoming",null,0,0,0,0,0,0,0,0,0,0,0,0,0]
[null,570,null,null,"Total",null,0,0,0,0,0,0,0,0,0,0,0,0,0]
[null,571]
["%,FACCOUNT,TQGCACCTS,V808200",572,808.2,"Gas Delivered to Underground Storage"]
[null,573,null,null,"Utah",null,0,0,0,0,0,0,0,0,0,0,0,0,0]
[null,574,null,null,"Wyoming",null,0,0,0,0,0,0,0,0,0,0,0,0,0]
[null,575,null,null,"Total",null,0,0,0,0,0,0,0,0,0,0,0,0,0]
[null,576]
["%,FACCOUNT,TQGCACCTS,V808300",577,808.3,"Exchange Gas"]
[null,578,null,null,"Utah",null,0,0,0,0,0,0,0,0,0,0,0,0,0]
[null,579,null,null,"Wyoming",null,0,0,0,0,0,0,0,0,0,0,0,0,0]
[null,580,null,null,"Total",null,0,0,0,0,0,0,0,0,0,0,0,0,0]
[null,581]
["%,FACCOUNT,TQGCACCTS,V813000,V813001,V813002,V813003,V813004",582,813,"Other Gas Supply Expenses - Gas Cost"]
[null,583,null,null,"Utah",null,0,0,0,0,0,0,0,0,0,0,0,0,0]
[null,584,null,null,"Wyoming",null,0,0,0,0,0,0,0,0,0,0,0,0,0]
[null,585,null,null,"Total",null,0,0,0,0,0,0,0,0,0,0,0,0,0]
[null,586]
[null,587,813,"Other Gas Supply Expenses - SNG Cost"]
[null,588,null,null,"Utah"]
[null,589,null,null,"Wyoming"]
[null,590,null,null,"Total",null,0,0,0,0,0,0,0,0,0,0,0,0,0]
[null,591]
[null,592,813.5,"CO2 Processing Expenses"]
["%,FACCOUNT,TQGCACCTS,V813005,V813007,V813008",593,null,null,"Utah",null,0,0,0,0,0,0,0,0,0,0,0,0,0]
["%,FACCOUNT,TQGCACCTS,V813006",594,null,null,"Wyoming",null,0,0,0,0,0,0,0,0,0,0,0,0,0]
[null,595,null,null,"Total",null,0,0,0,0,0,0,0,0,0,0,0,0,0]
[null,596]
["%,FACCOUNT,TQGCACCTS,V858000",597,858,"Transportation GRI & ACA - Gas Cost"]
[null,598,null,null,"Utah",null,0,0,0,0,0,0,0,0,0,0,0,0,0]
[null,599,null,null,"Wyoming",null,0,0,0,0,0,0,0,0,0,0,0,0,0]
[null,600,null,null,"Total",null,0,0,0,0,0,0,0,0,0,0,0,0,0]
[null,601]
["%,FACCOUNT,TQGCACCTS,V858001",602,858,"Trans & Comp of Gas by Others - SNG Cost"]
[null,603,null,null,"Utah",null,0,0,0,0,0,0,0,0,0,0,0,0,0]
[null,604,null,null,"Wyoming",null,0,0,0,0,0,0,0,0,0,0,0,0,0]
[null,605,null,null,"Total",null,0,0,0,0,0,0,0,0,0,0,0,0,0]
[null,606]
[null,607,"System Total Gas Purchase Expenses"]
[null,608,null,"Utah Gas Purchase Expenses",null,null,0,0,0,0,0,0,0,0,0,0,0,0,0]
[null,609,null,"Wyoming Gas Purchase Expenses",null,null,0,0,0,0,0,0,0,0,0,0,0,0,0]
[null,610]
[null,611]
[null,612,null,"System Total Gas Purchase Expenses",null,null,0,0,0,0,0,0,0,0,0,0,0,0,0]
[null,613]
[null,614]
[null,615,"OPERATION AND MAINTENANCE EXPENSES"]
[null,616]
[null,617,"Production Expenses"]
[null,618]
["%,FACCOUNT,TQGCACCTS,V810000,V810001",619,810,"Gas Used for Compressor Station Fuel",null,null,0,0,0,0,0,0,0,0,0,0,0,0,0]
["%,FACCOUNT,TQGCACCTS,V812000,V812001",620,812,"Gas Used for Other Utility Operations",null,null,0,0,0,0,0,0,0,0,0,0,0,0,0]
[null,621]
[null,622,null,"Total Production Expenses",null,null,0,0,0,0,0,0,0,0,0,0,0,0,0]
[null,623,null,null,null,null,0,0,0,0,0,0,0,0,0,0,0,0,0]
[null,624,"Distribution Operations & Maintenance Expenses"]
[null,625,null," "]
[null,626,870,"Operation Supervision & Engineering"]
[null,627,null,null,"Utah",null,0,0,0,0,0,0,0,0,0,0,0,0,0]
[null,628,null,null,"Wyoming",null,0,0,0,0,0,0,0,0,0,0,0,0,0]
["%,FACCOUNT,TQGCACCTS,N870",629,null,null,"Total",null,0,0,0,0,0,0,0,0,0,0,0,0,0]
[null,630]
[null,631,871,"Distribution Load Dispatching"]
[null,632,null,null,"Utah",null,0,0,0,0,0,0,0,0,0,0,0,0,0]
[null,633,null,null,"Wyoming",null,0,0,0,0,0,0,0,0,0,0,0,0,0]
["%,FACCOUNT,TQGCACCTS,N871",634,null,null,"Total",null,0,0,0,0,0,0,0,0,0,0,0,0,0]
[null,635]
[null,636,872,"Compressor Station Labor & Expenses"]
[null,637,null,null,"Utah",null,0,0,0,0,0,0,0,0,0,0,0,0,0]
[null,638,null,null,"Wyoming",null,0,0,0,0,0,0,0,0,0,0,0,0,0]
["%,FACCOUNT,TQGCACCTS,N872",639,null,null,"Total",null,0,0,0,0,0,0,0,0,0,0,0,0,0]
[null,640]
[null,641,873,"Compressor Station Fuel & Power"]
[null,642,null,null,"Utah",null,0,0,0,0,0,0,0,0,0,0,0,0,0]
[null,643,null,null,"Wyoming",null,0,0,0,0,0,0,0,0,0,0,0,0,0]
["%,FACCOUNT,TQGCACCTS,N873",644,null,null,"Total",null,0,0,0,0,0,0,0,0,0,0,0,0,0]
[null,645]
[null,646,874,"Mains & Service Expenses"]
[null,647,null,null,"Utah",null,0,0,0,0,0,0,0,0,0,0,0,0,0]
[null,648,null,null,"Wyoming",null,0,0,0,0,0,0,0,0,0,0,0,0,0]
["%,FACCOUNT,TQGCACCTS,N874",649,null,null,"Total",null,0,0,0,0,0,0,0,0,0,0,0,0,0]
[null,650]
[null,651,875,"Measuring & Regulating Station Expenses"]
[null,652,null,null,"Utah",null,0,0,0,0,0,0,0,0,0,0,0,0,0]
[null,653,null,null,"Wyoming",null,0,0,0,0,0,0,0,0,0,0,0,0,0]
["%,FACCOUNT,TQGCACCTS,N875",654,null,null,"Total",null,0,0,0,0,0,0,0,0,0,0,0,0,0]
[null,655]
[null,656,878,"Meter & House Regulator Expenses"]
[null,657,null,null,"Utah",null,0,0,0,0,0,0,0,0,0,0,0,0,0]
[null,658,null,null,"Wyoming",null,0,0,0,0,0,0,0,0,0,0,0,0,0]
["%,FACCOUNT,TQGCACCTS,N878",659,null,null,"Total",null,0,0,0,0,0,0,0,0,0,0,0,0,0]
[null,660]
[null,661,879,"Customer Installations Expenses"]
[null,662,null,null,"Utah",null,0,0,0,0,0,0,0,0,0,0,0,0,0]
[null,663,null,null,"Wyoming",null,0,0,0,0,0,0,0,0,0,0,0,0,0]
["%,FACCOUNT,TQGCACCTS,N879",664,null,null,"Total",null,0,0,0,0,0,0,0,0,0,0,0,0,0]
[null,665]
[null,666,880,"Other Expenses"]
[null,667,null,null,"Utah",null,0,0,0,0,0,0,0,0,0,0,0,0,0]
[null,668,null,null,"Wyoming",null,0,0,0,0,0,0,0,0,0,0,0,0,0]
["%,FACCOUNT,TQGCACCTS,N880",669,null,null,"Total",null,0,0,0,0,0,0,0,0,0,0,0,0,0]
[null,670]
[null,671,881,"Rents"]
[null,672,null,null,"Utah",null,0,0,0,0,0,0,0,0,0,0,0,0,0]
[null,673,null,null,"Wyoming",null,0,0,0,0,0,0,0,0,0,0,0,0,0]
["%,FACCOUNT,TQGCACCTS,N881",674,null,null,"Total",null,0,0,0,0,0,0,0,0,0,0,0,0,0]
[null,675]
[null,676,885,"Maintenance Supervision & Engineering"]
[null,677,null,null,"Utah",null,0,0,0,0,0,0,0,0,0,0,0,0,0]
[null,678,null,null,"Wyoming",null,0,0,0,0,0,0,0,0,0,0,0,0,0]
["%,FACCOUNT,TQGCACCTS,N885",679,null,null,"Total",null,0,0,0,0,0,0,0,0,0,0,0,0,0]
[null,680]
[null,681,886,"Maintenance of Structures & Improvements"]
[null,682,null,null,"Utah",null,0,0,0,0,0,0,0,0,0,0,0,0,0]
[null,683,null,null,"Wyoming",null,0,0,0,0,0,0,0,0,0,0,0,0,0]
["%,FACCOUNT,TQGCACCTS,N886",684,null,null,"Total",null,0,0,0,0,0,0,0,0,0,0,0,0,0]
[null,685]
[null,686,887,"Maintenance of Mains"]
[null,687,null,null,"Utah",null,0,0,0,0,0,0,0,0,0,0,0,0,0]
[null,688,null,null,"Wyoming",null,0,0,0,0,0,0,0,0,0,0,0,0,0]
["%,FACCOUNT,TQGCACCTS,N887",689,null,null,"Total",null,0,0,0,0,0,0,0,0,0,0,0,0,0]
[null,690]
[null,691,888,"Maint of Compressor Station Equipment"]
[null,692,null,null,"Utah",null,0,0,0,0,0,0,0,0,0,0,0,0,0]
[null,693,null,null,"Wyoming",null,0,0,0,0,0,0,0,0,0,0,0,0,0]
["%,FACCOUNT,TQGCACCTS,N888",694,null,null,"Total",null,0,0,0,0,0,0,0,0,0,0,0,0,0]
[null,695]
[null,696,889,"Maint of Meas. & Reg. Station Equipment"]
[null,697,null,null,"Utah",null,0,0,0,0,0,0,0,0,0,0,0,0,0]
[null,698,null,null,"Wyoming",null,0,0,0,0,0,0,0,0,0,0,0,0,0]
["%,FACCOUNT,TQGCACCTS,N889",699,null,null,"Total",null,0,0,0,0,0,0,0,0,0,0,0,0,0]
[null,700]
[null,701,892,"Maintenance of Services"]
[null,702,null,null,"Utah",null,0,0,0,0,0,0,0,0,0,0,0,0,0]
[null,703,null,null,"Wyoming",null,0,0,0,0,0,0,0,0,0,0,0,0,0]
["%,FACCOUNT,TQGCACCTS,N892",704,null,null,"Total",null,0,0,0,0,0,0,0,0,0,0,0,0,0]
[null,705]
[null,706,893,"Maintenance of Meters & House Regulators"]
[null,707,null,null,"Utah",null,0,0,0,0,0,0,0,0,0,0,0,0,0]
[null,708,null,null,"Wyoming",null,0,0,0,0,0,0,0,0,0,0,0,0,0]
["%,FACCOUNT,TQGCACCTS,N893",709,null,null,"Total",null,0,0,0,0,0,0,0,0,0,0,0,0,0]
[null,710]
[null,711,8941,"Maintenance of Communication Equipment"]
[null,712,null,null,"Utah",null,0,0,0,0,0,0,0,0,0,0,0,0,0]
[null,713,null,null,"Wyoming",null,0,0,0,0,0,0,0,0,0,0,0,0,0]
["%,FACCOUNT,TQGCACCTS,V894001",714,null,null,"Total",null,0,0,0,0,0,0,0,0,0,0,0,0,0]
[null,715]
[null,716,8942,"Maintenance of Other Equipment"]
[null,717,null,null,"Utah",null,0,0,0,0,0,0,0,0,0,0,0,0,0]
[null,718,null,null,"Wyoming",null,0,0,0,0,0,0,0,0,0,0,0,0,0]
["%,FACCOUNT,TQGCACCTS,V894000,V894002",719,null,null,"Total",null,0,0,0,0,0,0,0,0,0,0,0,0,0]
[null,720]
[null,721,"System Total Distribution O&M Expenses"]
[null,722,null,"Utah Distribution O&M Expenses",null,null,0,0,0,0,0,0,0,0,0,0,0,0,0]
[null,723,null,"Wyoming Distribution O&M Expenses",null,null,0,0,0,0,0,0,0,0,0,0,0,0,0]
[null,724]
[null,725,null,"System Total Distribution O&M Expenses",null,null,0,0,0,0,0,0,0,0,0,0,0,0,0]
[null,726]
[null,727,"Customer Accounts Expense"]
[null,728]
[null,729,901,"Supervision"]
[null,730,null,null,"Utah",null,0,0,0,0,0,0,0,0,0,0,0,0,0]
[null,731,null,null,"Wyoming",null,0,0,0,0,0,0,0,0,0,0,0,0,0]
["%,FACCOUNT,TQGCACCTS,N901",732,null,null,"Total",null,0,0,0,0,0,0,0,0,0,0,0,0,0]
[null,733]
[null,734,902,"Meter Reading Expense"]
[null,735,null,null,"Utah",null,0,0,0,0,0,0,0,0,0,0,0,0,0]
[null,736,null,null,"Wyoming",null,0,0,0,0,0,0,0,0,0,0,0,0,0]
["%,FACCOUNT,TQGCACCTS,N902",737,null,null,"Total",null,0,0,0,0,0,0,0,0,0,0,0,0,0]
[null,738]
[null,739,9031,"Customer Records Expense"]
[null,740,null,null,"Utah",null,0,0,0,0,0,0,0,0,0,0,0,0,0]
[null,741,null,null,"Wyoming",null,0,0,0,0,0,0,0,0,0,0,0,0,0]
["%,FACCOUNT,TQGCACCTS,V903001",742,null,null,"Total",null,0,0,0,0,0,0,0,0,0,0,0,0,0]
[null,743]
[null,744,9032,"Collection Expense"]
[null,745,null,null,"Utah",null,0,0,0,0,0,0,0,0,0,0,0,0,0]
[null,746,null,null,"Wyoming",null,0,0,0,0,0,0,0,0,0,0,0,0,0]
["%,FACCOUNT,TQGCACCTS,V903002",747,null,null,"Total",null,0,0,0,0,0,0,0,0,0,0,0,0,0]
[null,748]
[null,749,9033,"Interest Exp - Customer Security Deposits"]
[null,750,null,null,"Utah",null,0,0,0,0,0,0,0,0,0,0,0,0,0]
[null,751,null,null,"Wyoming",null,0,0,0,0,0,0,0,0,0,0,0,0,0]
["%,FACCOUNT,TQGCACCTS,V903003",752,null,null,"Total",null,0,0,0,0,0,0,0,0,0,0,0,0,0]
[]
[null,754,904,"Uncollectible Accounts - DNG"]
[null,755,null,null,"Utah",null,0,0,0,0,0,0,0,0,0,0,0,0,0]
[null,756,null,null,"Wyoming",null,0,0,0,0,0,0,0,0,0,0,0,0,0]
["%,FACCOUNT,TQGCACCTS,V904000",757,null,null,"Total",null,0,0,0,0,0,0,0,0,0,0,0,0,0]
[]
[null,754,904,"Uncollectible Accounts - SNG"]
[null,755,null,null,"Utah",null,0,0,0,0,0,0,0,0,0,0,0,0,0]
[null,756,null,null,"Wyoming",null,0,0,0,0,0,0,0,0,0,0,0,0,0]
["%,FACCOUNT,TQGCACCTS,V904001",757,null,null,"Total",null,0,0,0,0,0,0,0,0,0,0,0,0,0]
[null,753]
[null,754,904,"Uncollectible Accounts - Commodity"]
[null,755,null,null,"Utah",null,0,0,0,0,0,0,0,0,0,0,0,0,0]
[null,756,null,null,"Wyoming",null,0,0,0,0,0,0,0,0,0,0,0,0,0]
["%,FACCOUNT,TQGCACCTS,V904002",757,null,null,"Total",null,0,0,0,0,0,0,0,0,0,0,0,0,0]
[null,758]
[null,759,905,"Miscellaneous Expense"]
[null,760,null,null,"Utah",null,0,0,0,0,0,0,0,0,0,0,0,0,0]
[null,761,null,null,"Wyoming",null,0,0,0,0,0,0,0,0,0,0,0,0,0]
["%,FACCOUNT,TQGCACCTS,N905",762,null,null,"Total",null,0,0,0,0,0,0,0,0,0,0,0,0,0]
[null,763]
[null,764,"System Total Customer Accounts Exp"]
[null,765,null,"Utah Customer Accounts Expenses",null,null,0,0,0,0,0,0,0,0,0,0,0,0,0]
[null,766,null,"Wyoming Customer Accounts Expenses",null,null,0,0,0,0,0,0,0,0,0,0,0,0,0]
[null,767]
[null,768,null,"System Total Customer Accounts Exp",null,null,0,0,0,0,0,0,0,0,0,0,0,0,0]
[null,769]
[null,770,"Customer Service & Information Expense"]
[null,771]
[null,772,907,"Supervision"]
[null,773,null,null,"Utah",null,0,0,0,0,0,0,0,0,0,0,0,0,0]
[null,774,null,null,"Wyoming",null,0,0,0,0,0,0,0,0,0,0,0,0,0]
["%,FACCOUNT,TQGCACCTS,N907",775,null,null,"Total",null,0,0,0,0,0,0,0,0,0,0,0,0,0]
[null,776]
[null,777,908,"Customer Assistance Expense"]
[null,778,null,null,"Utah",null,0,0,0,0,0,0,0,0,0,0,0,0,0]
[null,779,null,null,"Wyoming",null,0,0,0,0,0,0,0,0,0,0,0,0,0]
["%,FACCOUNT,TQGCACCTS,N908",780,null,null,"Total",null,0,0,0,0,0,0,0,0,0,0,0,0,0]
[null,781]
[null,782,909,"Info & Instructional Advertising Expense"]
[null,783,null,null,"Utah",null,0,0,0,0,0,0,0,0,0,0,0,0,0]
[null,784,null,null,"Wyoming",null,0,0,0,0,0,0,0,0,0,0,0,0,0]
["%,FACCOUNT,TQGCACCTS,N909",785,null,null,"Total",null,0,0,0,0,0,0,0,0,0,0,0,0,0]
[null,786]
[null,787,910,"Misc Customer Service & Info Expense"]
[null,788,null,null,"Utah",null,0,0,0,0,0,0,0,0,0,0,0,0,0]
[null,789,null,null,"Wyoming",null,0,0,0,0,0,0,0,0,0,0,0,0,0]
["%,FACCOUNT,TQGCACCTS,N910",790,null,null,"Total",null,0,0,0,0,0,0,0,0,0,0,0,0,0]
[null,791]
[null,792,"System Total Cust Service & Info Exp"]
[null,793,null,"Utah Total Cust Service & Info Exp",null,null,0,0,0,0,0,0,0,0,0,0,0,0,0]
[null,794,null,"Wyoming Total Cust Service & Info Exp",null,null,0,0,0,0,0,0,0,0,0,0,0,0,0]
[null,795]
[null,796,null,"System Total Cust Service & Info Exp",null,null,0,0,0,0,0,0,0,0,0,0,0,0,0]
[null,797]
[null,798,"Administrative & General Expense"]
[null,799]
[null,800,920,"Administrative & General Salaries"]
[null,{"$f":"+B324+1","v":801},null,null,"Utah",null,0,0,0,0,0,0,0,0,0,0,0,0,0]
[null,{"$f":"+B325+1","v":802},null,null,"Wyoming",null,0,0,0,0,0,0,0,0,0,0,0,0,0]
["%,FACCOUNT,TQGCACCTS,N920",803,null,null,"Total",null,0,0,0,0,0,0,0,0,0,0,0,0,0]
[null,804,921,"Office Supplies & Expenses"]
[null,805,null,null,"Utah",null,0,0,0,0,0,0,0,0,0,0,0,0,0]
[null,806,null,null,"Wyoming",null,0,0,0,0,0,0,0,0,0,0,0,0,0]
["%,FACCOUNT,TQGCACCTS,N921",807,null,null,"Total",null,0,0,0,0,0,0,0,0,0,0,0,0,0]
[null,808,922,"Administrative Expenses Transferred"]
[null,809,null,null,"Utah",null,0,0,0,0,0,0,0,0,0,0,0,0,0]
[null,810,null,null,"Wyoming",null,0,0,0,0,0,0,0,0,0,0,0,0,0]
["%,FACCOUNT,TQGCACCTS,N922",811,null,null,"Total",null,0,0,0,0,0,0,0,0,0,0,0,0,0]
[null,812,923,"Outside Services Employed"]
[null,813,null,null,"Utah",null,0,0,0,0,0,0,0,0,0,0,0,0,0]
[null,814,null,null,"Wyoming",null,0,0,0,0,0,0,0,0,0,0,0,0,0]
["%,FACCOUNT,TQGCACCTS,N923",815,null,null,"Total",null,0,0,0,0,0,0,0,0,0,0,0,0,0]
[null,816,924,"Property Insurance"]
[null,817,null,null,"Utah",null,0,0,0,0,0,0,0,0,0,0,0,0,0]
[null,818,null,null,"Wyoming",null,0,0,0,0,0,0,0,0,0,0,0,0,0]
["%,FACCOUNT,TQGCACCTS,N924",819,null,null,"Total",null,0,0,0,0,0,0,0,0,0,0,0,0,0]
[null,820,925,"Injuries & Damages"]
[null,821,null,null,"Utah",null,0,0,0,0,0,0,0,0,0,0,0,0,0]
[null,822,null,null,"Wyoming",null,0,0,0,0,0,0,0,0,0,0,0,0,0]
["%,FACCOUNT,TQGCACCTS,N925",823,null,null,"Total",null,0,0,0,0,0,0,0,0,0,0,0,0,0]
[null,824,926,"Employee Pensions & Benefits"]
[null,825,null,null,"Utah",null,0,0,0,0,0,0,0,0,0,0,0,0,0]
[null,826,null,null,"Wyoming",null,0,0,0,0,0,0,0,0,0,0,0,0,0]
["%,FACCOUNT,TQGCACCTS,N926",827,null,null,"Total",null,0,0,0,0,0,0,0,0,0,0,0,0,0]
[null,828,928,"Regulatory Commision Expense"]
[null,829,null,null,"Utah",null,0,0,0,0,0,0,0,0,0,0,0,0,0]
[null,830,null,null,"Wyoming",null,0,0,0,0,0,0,0,0,0,0,0,0,0]
["%,FACCOUNT,TQGCACCTS,N928",831,null,null,"Total",null,0,0,0,0,0,0,0,0,0,0,0,0,0]
[null,832,9301,"General Advertising Expenses"]
[null,833,null,null,"Utah",null,0,0,0,0,0,0,0,0,0,0,0,0,0]
[null,834,null,null,"Wyoming",null,0,0,0,0,0,0,0,0,0,0,0,0,0]
["%,FACCOUNT,V930100",835,null,null,"Total",null,0,0,0,0,0,0,0,0,0,0,0,0,0]
[null,836,9302,"Miscellaneous General Expenses"]
[null,837,null,null,"Utah",null,0,0,0,0,0,0,0,0,0,0,0,0,0]
[null,838,null,null,"Wyoming",null,0,0,0,0,0,0,0,0,0,0,0,0,0]
["%,FACCOUNT,V930200,V930203",839,null,null,"Total",null,0,0,0,0,0,0,0,0,0,0,0,0,0]
[null,840,931,"Rents"]
[null,841,null,null,"Utah",null,0,0,0,0,0,0,0,0,0,0,0,0,0]
[null,842,null,null,"Wyoming",null,0,0,0,0,0,0,0,0,0,0,0,0,0]
["%,FACCOUNT,TQGCACCTS,N931",843,null,null,"Total",null,0,0,0,0,0,0,0,0,0,0,0,0,0]
[null,844,935,"Maintenance of General Plant"]
[null,845,null,null,"Utah",null,0,0,0,0,0,0,0,0,0,0,0,0,0]
[null,846,null,null,"Wyoming",null,0,0,0,0,0,0,0,0,0,0,0,0,0]
["%,FACCOUNT,TQGCACCTS,N932",847,null,null,"Total",null,0,0,0,0,0,0,0,0,0,0,0,0,0]
[]
[null,{"$f":"+B371+1","v":848}]
[null,849,null,"Total Administrative & General Expense",null,null,0,0,0,0,0,0,0,0,0,0,0,0,0]
[null,850,null,"Total Utah Distribution",null,null,0,0,0,0,0,0,0,0,0,0,0,0,0]
[null,851,null,"Total Wyoming Distribution",null,null,0,0,0,0,0,0,0,0,0,0,0,0,0]
[null,852,null,"Total Utility O&M Expenses",null,null,0,0,0,0,0,0,0,0,0,0,0,0,0]
[null,853]
[null,854]
[null,855,"OTHER UTILITY OPERATING EXPENSES"]
[null,856]
[null,857,"Depreciation, Amortization, & Other Taxes"]
[null,858]
["%,FACCOUNT,TQGCACCTS,N403",859,403,"Depreciation Expense"]
[null,860,null,null,"Production",null,0,0,0,0,0,0,0,0,0,0,0,0,497603]
[null,861,null,null,"Distribution - Wyoming",null,0,0,0,0,0,0,0,0,0,0,0,0,0]
[null,862,null,null,"Distribution - Utah",null,0,0,0,0,0,0,0,0,0,0,0,0,0]
[null,863,null,null,"General",null,0,0,0,0,0,0,0,0,0,0,0,0,0]
[null,864,null,null,"Total Depreciation Expense",null,0,0,0,0,0,0,0,0,0,0,0,0,0]
[null,{"$f":"+B389+1","v":865}]
["%,FACCOUNT,TQGCACCTS,N404",866,404,"Amortization and Depletion"]
[null,867,null,null,"Production",null,0,0,0,0,0,0,0,0,0,0,0,0,0]
[null,868,null,null,"Distribution - Wyoming",null,0,0,0,0,0,0,0,0,0,0,0,0,0]
[null,869,null,null,"Distribution - Utah",null,0,0,0,0,0,0,0,0,0,0,0,0,0]
[null,870,null,null,"General",null,0,0,0,0,0,0,0,0,0,0,0,0,0]
[null,871,null,null,"Total Amortization Expense",null,0,0,0,0,0,0,0,0,0,0,0,0,0]
[null,872]
[null,873,null,"Total Depreciation, Deplec & Amort",null,null,0,0,0,0,0,0,0,0,0,0,0,0,0]
[null,874]
[null,875,"Tax Expenses"]
["%,FACCOUNT,TQGCACCTS,N408",876,408,"Taxes Other Than Income Taxes"]
[null,877,null,null,"Production",null,0,0,0,0,0,0,0,0,0,0,0,0,0]
[null,878,null,null,"Distribution - Wyoming",null,0,0,0,0,0,0,0,0,0,0,0,0,0]
[null,879,null,null,"Distribution - Utah",null,0,0,0,0,0,0,0,0,0,0,0,0,0]
[null,880,null,null,"General",null,0,0,0,0,0,0,0,0,0,0,0,0,0]
[null,881,null,null,"Total Other Taxes",null,0,0,0,0,0,0,0,0,0,0,0,0,0]
[null,882,null,null,null,null,0,0,0,0,0,0,0,0,0,0,0,0,0]
["%,FACCOUNT,TQGCACCTS,V409101,V410111",883,409101,"Income Taxes - Federal",null,null,0,0,0,0,0,0,0,0,0,0,0,0,0]
[null,884]
["%,FACCOUNT,V409111",885,409111,"Income Taxes - State",null,null,0,0,0,0,0,0,0,0,0,0,0,0,0]
[null,886]
["%,FACCOUNT,TQGCACCTS,V410101",887,410101,"Deferred Income Taxes",null,null,0,0,0,0,0,0,0,0,0,0,0,0,0]
[null,888]
["%,FACCOUNT,TQGCACCTS,V411100",889,4111,"Deferred Income Tax Credit",null,null,0,0,0,0,0,0,0,0,0,0,0,0,0]
[null,890]
["%,FACCOUNT,TQGCACCTS,V411400",891,411400,"Investment Tax Credit Adjustment",null,null,0,0,0,0,0,0,0,0,0,0,0,0,0]
[null,892]
[null,893,null,"South Georgia Amortization",null,null,0,0,0,0,0,0,0,0,0,0,0,0,0]
[null,894]
["%,FACCOUNT,V236101,FCHARTFIELD1,V716",895,null,"Section 29 Tax Credits",null,null,0,0,0,0,0,0,0,0,0,0,0,0,0]
[null,896]
[null,897,null,"Total Tax Expenses",null,null,0,0,0,0,0,0,0,0,0,0,0,0,0]
[null,898]
[null,899]
[null,900,null,"Total Utility Other Operating Expenses",null,null,0,0,0,0,0,0,0,0,0,0,0,0,0]
[null,901]
[null,902]
[null,903,"SYSTEM TOTAL UTILITY OPERATING EXPENSES",null,null,null,0,0,0,0,0,0,0,0,0,0,0,0,0]
[]
[]
[]
[null,754,904,"Uncollectible Accounts (DNG Only)"]
[null,755,null,null,"Utah",null,0,0,0,0,0,0,0,0,0,0,0,0,0]
[null,756,null,null,"Wyoming",null,0,0,0,0,0,0,0,0,0,0,0,0,0]
["%,FACCOUNT,TQGCACCTS,V904000",757,null,null,"Total",null,0,0,0,0,0,0,0,0,0,0,0,0,0]
[]
[null,null,null,null,null,null,"DTH","DTH","DTH","DTH","DTH","DTH","DTH","DTH","DTH","DTH","DTH","DTH","DTH"]
["%,FACCOUNT,TQGCACCTS,V810000,V810001",619,810,"Gas Used for Compressor Station Fuel",null,null,0,0,0,0,0,0,0,0,0,0,0,0,0]
["%,FACCOUNT,TQGCACCTS,V812000,V812001",620,812,"Gas Used for Other Utility Operations",null,null,0,0,0,0,0,0,0,0,0,0,0,0,0]
[null,621]
[null,622,null,"Total Production Expenses",null,null,0,0,0,0,0,0,0,0,0,0,0,0,0]
[]
[]
[]
["%,FACCOUNT,TQGCACCTS,N483",null,"483","Sales for Resale",null,null,104401.96,101703.17,107037.77,103410.19,286991.75,117221.98,117002.1,135658.85,88880.37,54461.640000000007,62725.450000000004,0,{"$f":"SUM(G445:R445)","v":1279495.23}]
["%,FACCOUNT,TQGCACCTS,N490",null,"490","Incidental Plant Prod Sales",null,null,806783.83,5924.37,700363.96000000008,1446013.29,565424.75,193982.52999999997,42747.119999999995,209418.63,141834.57,200410.18000000002,237731.75,247756.64,{"$f":"SUM(G446:R446)","v":4798391.6199999992}]
["%,FACCOUNT,TQGCACCTS,N492",null,"492","Incidental Gasoline_Oil Sales",null,null,199984.13,177203.97999999998,199772.08,203051.07,126320.59000000001,440584.14,756.35,558792.03,618797.46,419615.31999999995,5.59,794619.11999999988,3739501.8599999994]
["%,FACCOUNT,TQGCACCTS,V495007",null,4951,"Overriding Royalty Revenue from Celsius",null,null,958404.90999999992,194516.61,-547226.96,1295483.8500000001,700029.49,880688.37,1500219.03,1301702.48,904140.09,933608.08,855368.95999999985,198797.73,9175732.6400000006]
["%,FACCOUNT,TQGCACCTS,V495018,V495006",null,4952,"Oil Revenue Received from Wexpro",null,null,24691,15189,3296,10386,28291,20492,21667,35775,10652,28837,12102,37299,248677]
["%,FACCOUNT,TQGCACCTS,V758001,V758002,V758003,V758004",null,"758001","Gas Well Royalities - Other",null,null,0,0,0,0,0,0,31057.840000000004,0,0,0,0,0,31057.840000000004]
[]
[]
[]
[null,null,null,"Other Operating Revenues"]
[]
["%,FACCOUNT,TQGCACCTS,N487",null,"487","Int chgs on Past Due Receivables - Gas",null,null,0,0,0,0,0,0,0,0,0,0,0,0,0]
["%,FACCOUNT,TQGCACCTS,N488",null,"488","Misc Service Revenues",null,null,0,0,0,0,0,0,0,0,0,0,0,0,0]
["%,FACCOUNT,TQGCACCTS,V489100",null,"489100","Revenue from Transportation of Gas of Others",null,null,0,0,0,0,0,0,0,0,0,0,0,0,0]
["%,FACCOUNT,TQGCACCTS,V489101",null,"489101","Capacity Release Credits",null,null,0,0,0,0,0,0,0,0,0,0,0,0,0]
["%,FACCOUNT,TQGCACCTS,N490",null,"490","Incidental Plant Prod Sales",null,null,0,0,0,0,0,0,0,0,0,0,0,0,0]
["%,FACCOUNT,TQGCACCTS,N491",null,"491","Revenue fr Natural Gas Processed by Others",null,null,0,0,0,0,0,0,0,0,0,0,0,0,0]
["%,FACCOUNT,TQGCACCTS,N492",null,"492","Incidental Gasoline_Oil Sales",null,null,0,0,0,0,0,0,0,0,0,0,0,0,0]
["%,FACCOUNT,TQGCACCTS,N493",null,"493","Rent from Gas Property",null,null,0,0,0,0,0,0,0,0,0,0,0,0,0]
["%,FACCOUNT,V495008,V495009,V495003,V495010,V495011,V495051,V495052,V495053,V495054,V495055,V495056,V495057,V495058,V495059,V495060,V495061,V495062,V495063,V495064,V495065,V495066,V495067",null,495,"Other Gas Revenues",null,null,0,0,0,0,0,0,0,0,0,0,0,0,0]
["%,FACCOUNT,TQGCACCTS,V495007",null,4951,"Overriding Royalty Revenue from Celsius",null,null,0,0,0,0,0,0,0,0,0,0,0,0,0]
["%,FACCOUNT,TQGCACCTS,V495018,V495006",null,4952,"Oil Revenue Received from Wexpro",null,null,0,0,0,0,0,0,0,0,0,0,0,0,0]
["%,FACCOUNT,TQGCACCTS,V495017",null,4974,"Standby Charges",null,null,0,0,0,0,0,0,0,0,0,0,0,0,0]
[]
[]
["%,V810000"]
["%,V907000"]
["%,V908002"]
["%,V908003"]
["%,V909001"]
["%,V909002"]
["%,V909005"]
["%,V909014"]
["%,V920000"]
["%,V921000"]
["%,V921001"]
["%,V922000"]
["%,V923000"]
["%,V924000"]
["%,V925000"]
["%,V926000"]
["%,V928000"]
["%,V930200"]
["%,V931000"]
["%,V931001"]
["%,V810000"]
["%,V810001"]
["%,V812000"]
["%,V812001"]
["%,V870000"]
["%,V872000"]
["%,V872001"]
["%,V873000"]
["%,V873001"]
["%,V873002"]
["%,V874000"]
["%,V875000"]
["%,V878000"]
["%,V879001"]
["%,V879002"]
["%,V879006"]
["%,V879007"]
["%,V880000"]
["%,V880001"]
["%,V880002"]
["%,V880003"]
["%,V880004"]
["%,V901000"]
["%,V902000"]
["%,V903001"]
["%,V903002"]
["%,V903003"]
["%,V904000"]
["%,V904001"]
["%,V904002"]
["%,V905000"]
["%,V907000"]
["%,V908002"]
["%,V908003"]
["%,V909001"]
["%,V909002"]
["%,V909005"]
["%,V909014"]
["%,V920000"]
["%,V921000"]
["%,V921001"]
["%,V922000"]
["%,V923000"]
["%,V924000"]
["%,V925000"]
["%,V926000"]
["%,V928000"]
["%,V930200"]
["%,V931000"]
["%,V931001"]
["%,V810000"]
["%,V810001"]
["%,V812000"]
["%,V812001"]
["%,V870000"]
["%,V871000"]
["%,V872000"]
["%,V872001"]
["%,V873000"]
["%,V873001"]
["%,V873002"]
["%,V874000"]
["%,V875000"]
["%,V878000"]
["%,V879001"]
["%,V879002"]
["%,V879003"]
["%,V879006"]
["%,V879007"]
["%,V880000"]
["%,V880001"]
["%,V880002"]
["%,V880003"]
["%,V880004"]
["%,V901000"]
["%,V902000"]
["%,V903001"]
["%,V903002"]
["%,V903003"]
["%,V904000"]
["%,V904001"]
["%,V904002"]
["%,V905000"]
["%,V907000"]
["%,V908002"]
["%,V908003"]
["%,V909001"]
["%,V909002"]
["%,V909003"]
["%,V909005"]
["%,V920000"]
["%,V921000"]
["%,V921001"]
["%,V922000"]
["%,V923000"]
["%,V924000"]
["%,V925000"]
["%,V926000"]
["%,V928000"]
["%,V930200"]
["%,V931000"]
["%,V931001"]
["%,V810000"]
["%,V810001"]
["%,V812000"]
["%,V812001"]
["%,V870000"]
["%,V871000"]
["%,V872000"]
["%,V872001"]
["%,V873000"]
["%,V873001"]
["%,V873002"]
["%,V874000"]
["%,V875000"]
["%,V878000"]
["%,V879001"]
["%,V879002"]
["%,V879003"]
["%,V879006"]
["%,V879007"]
["%,V880000"]
["%,V880001"]
["%,V880003"]
["%,V880004"]
["%,V881000"]
["%,V901000"]
["%,V902000"]
["%,V903001"]
["%,V903002"]
["%,V903003"]
["%,V904000"]
["%,V904001"]
["%,V904002"]
["%,V905000"]
["%,V907000"]
["%,V908003"]
["%,V909001"]
["%,V909002"]
["%,V909003"]
["%,V909005"]
["%,V909014"]
["%,V920000"]
["%,V921000"]
["%,V921001"]
["%,V922000"]
["%,V923000"]
["%,V924000"]
["%,V925000"]
["%,V926000"]
["%,V928000"]
["%,V930200"]
["%,V931000"]
["%,V931001"]
["%,V810000"]
["%,V810001"]
["%,V812000"]
["%,V812001"]
["%,V870000"]
["%,V871000"]
["%,V872000"]
["%,V872001"]
["%,V873000"]
["%,V873001"]
["%,V873002"]
["%,V874000"]
["%,V875000"]
["%,V878000"]
["%,V879001"]
["%,V879002"]
["%,V879003"]
["%,V879006"]
["%,V879007"]
["%,V880000"]
["%,V880001"]
["%,V880003"]
["%,V880004"]
["%,V881000"]
["%,V901000"]
["%,V902000"]
["%,V903001"]
["%,V903002"]
["%,V903003"]
["%,V904000"]
["%,V904001"]
["%,V904002"]
["%,V905000"]
["%,V907000"]
["%,V908003"]
["%,V909001"]
["%,V909002"]
["%,V909003"]
["%,V909005"]
["%,V909014"]
["%,V920000"]
["%,V921000"]
["%,V921001"]
["%,V922000"]
["%,V923000"]
["%,V924000"]
["%,V925000"]
["%,V926000"]
["%,V930200"]
["%,V931000"]
["%,V931001"]
["%,V810000"]
["%,V810001"]
["%,V812000"]
["%,V812001"]
["%,V870000"]
["%,V871000"]
["%,V872001"]
["%,V873000"]
["%,V873001"]
["%,V873002"]
["%,V874000"]
["%,V875000"]
["%,V878000"]
["%,V879001"]
["%,V879002"]
["%,V879006"]
["%,V880000"]
["%,V880001"]
["%,V880003"]
["%,V880004"]
["%,V880005"]
["%,V880006"]
["%,V880007"]
["%,V881000"]
["%,V901000"]
["%,V902000"]
["%,V903001"]
["%,V903002"]
["%,V903003"]
["%,V904000"]
["%,V904001"]
["%,V904002"]
["%,V905000"]
["%,V907000"]
["%,V908003"]
["%,V909001"]
["%,V909002"]
["%,V909005"]
["%,V909014"]
["%,V920000"]
["%,V921000"]
["%,V921001"]
["%,V922000"]
["%,V923000"]
["%,V924000"]
["%,V925000"]
["%,V926000"]
["%,V930200"]
["%,V930203"]
["%,V931000"]
["%,V931001"]
["%,V810000"]
["%,V810001"]
["%,V812000"]
["%,V812001"]
["%,V870000"]
["%,V871000"]
["%,V872001"]
["%,V873000"]
["%,V873001"]
["%,V873002"]
["%,V874000"]
["%,V875000"]
["%,V878000"]
["%,V879001"]
["%,V879002"]
["%,V879003"]
["%,V879006"]
["%,V879007"]
["%,V880000"]
["%,V880001"]
["%,V880003"]
["%,V880004"]
["%,V880005"]
["%,V880006"]
["%,V880007"]
["%,V881000"]
["%,V901000"]
["%,V902000"]
["%,V903001"]
["%,V903002"]
["%,V903003"]
["%,V904000"]
["%,V904001"]
["%,V904002"]
["%,V905000"]
["%,V907000"]
["%,V908003"]
["%,V909001"]
["%,V909002"]
["%,V909005"]
["%,V909014"]
["%,V920000"]
["%,V921000"]
["%,V921001"]
["%,V922000"]
["%,V923000"]
["%,V924000"]
["%,V925000"]
["%,V926000"]
["%,V930200"]
["%,V930203"]
["%,V931000"]
["%,V931001"]
["%,V810000"]
["%,V810001"]
["%,V812000"]
["%,V812001"]
["%,V870000"]
["%,V871000"]
["%,V872000"]
["%,V872001"]
["%,V873000"]
["%,V873001"]
["%,V873002"]
["%,V874000"]
["%,V875000"]
["%,V878000"]
["%,V879001"]
["%,V879002"]
["%,V879003"]
["%,V879006"]
["%,V879007"]
["%,V880000"]
["%,V880001"]
["%,V880003"]
["%,V880004"]
["%,V880005"]
["%,V880006"]
["%,V880007"]
["%,V881000"]
["%,V901000"]
["%,V902000"]
["%,V903001"]
["%,V903002"]
["%,V903003"]
["%,V904000"]
["%,V904001"]
["%,V904002"]
["%,V905000"]
["%,V907000"]
["%,V908003"]
["%,V909001"]
["%,V909002"]
["%,V909005"]
["%,V920000"]
["%,V921000"]
["%,V921001"]
["%,V922000"]
["%,V923000"]
["%,V924000"]
["%,V925000"]
["%,V926000"]
["%,V930200"]
["%,V931000"]
["%,V931001"]
["%,V810000"]
["%,V810001"]
["%,V812000"]
["%,V812001"]
["%,V870000"]
["%,V871000"]
["%,V872001"]
["%,V873000"]
["%,V873001"]
["%,V873002"]
["%,V874000"]
["%,V875000"]
["%,V878000"]
["%,V879001"]
["%,V879002"]
["%,V879006"]
["%,V880000"]
["%,V880001"]
["%,V880004"]
["%,V880005"]
["%,V880006"]
["%,V880007"]
["%,V880008"]
["%,V880009"]
["%,V881000"]
["%,V901000"]
["%,V902000"]
["%,V903001"]
["%,V903002"]
["%,V903003"]
["%,V904000"]
["%,V904001"]
["%,V904002"]
["%,V907000"]
["%,V908003"]
["%,V908007"]
["%,V909001"]
["%,V909002"]
["%,V909004"]
["%,V909005"]
["%,V920000"]
["%,V920002"]
["%,V921000"]
["%,V921010"]
["%,V921011"]
["%,V921012"]
["%,V922000"]
["%,V923000"]
["%,V924000"]
["%,V925000"]
["%,V926000"]
["%,V930200"]
["%,V930208"]
["%,V931000"]
["%,FACCOUNT,TQGCACCTS,XDYYNYN00,NOTHER_OPER_EXPENSES"]
[]
["%,V885000"]
["%,V886000"]
["%,V887000"]
["%,V888000"]
["%,V888001"]
["%,V888002"]
["%,V888003"]
["%,V888005"]
["%,V889000"]
["%,V892000"]
["%,V893000"]
["%,V885000"]
["%,V886000"]
["%,V887000"]
["%,V888000"]
["%,V888001"]
["%,V888002"]
["%,V888003"]
["%,V888005"]
["%,V889000"]
["%,V892000"]
["%,V893000"]
["%,V885000"]
["%,V886000"]
["%,V887000"]
["%,V888000"]
["%,V888001"]
["%,V888002"]
["%,V888003"]
["%,V888005"]
["%,V889000"]
["%,V892000"]
["%,V893000"]
["%,V885000"]
["%,V886000"]
["%,V887000"]
["%,V888000"]
["%,V888001"]
["%,V888002"]
["%,V888003"]
["%,V888005"]
["%,V889000"]
["%,V892000"]
["%,V893000"]
["%,V885000"]
["%,V886000"]
["%,V887000"]
["%,V888000"]
["%,V888001"]
["%,V888002"]
["%,V888003"]
["%,V888005"]
["%,V889000"]
["%,V892000"]
["%,V893000"]
["%,V885000"]
["%,V886000"]
["%,V887000"]
["%,V888000"]
["%,V888001"]
["%,V888002"]
["%,V888003"]
["%,V888005"]
["%,V889000"]
["%,V892000"]
["%,V893000"]
["%,V885000"]
["%,V886000"]
["%,V887000"]
["%,V888000"]
["%,V888001"]
["%,V888002"]
["%,V888003"]
["%,V888005"]
["%,V889000"]
["%,V892000"]
["%,V893000"]
["%,V885000"]
["%,V886000"]
["%,V887000"]
["%,V888000"]
["%,V888001"]
["%,V888002"]
["%,V888003"]
["%,V889000"]
["%,V892000"]
["%,V893000"]
["%,V885000"]
["%,V886000"]
["%,V887000"]
["%,V888000"]
["%,V888001"]
["%,V888002"]
["%,V888003"]
["%,V888006"]
["%,V889000"]
["%,V892000"]
["%,V893000"]
["%,FACCOUNT,TQGCACCTS,XDYYNYN00,NMAINTENANCE_EXPENSE"]
[]
[]
[null,null,"GAS USED"]
[]
[null,null,810,"Compressor Station Fuel"]
["%,FACCOUNT,TQGCACCTS,N810,FOPERATING_UNIT,V02157",null,null,"Allen Station"]
["%,FACCOUNT,TQGCACCTS,N810,FOPERATING_UNIT,V02162",null,null,"Indianola"]
["%,FACCOUNT,TQGCACCTS,N810,FOPERATING_UNIT,V02155",null,null,"Lark Station"]
["%,FACCOUNT,TQGCACCTS,N810,FOPERATING_UNIT,V02156",null,null,"CNG Compressors"]
[null,null,null,"TOTAL ACCOUNT 810"]
[]
[null,null,"812 Other Utility Use:"]
["%,FACCOUNT,TQGCACCTS,N812,FOPERATING_UNIT,V04110",null,null,"Logan Region"]
["%,FACCOUNT,TQGCACCTS,N812,FOPERATING_UNIT,V04111",null,null,"Ogden Region"]
["%,FACCOUNT,TQGCACCTS,N812,FOPERATING_UNIT,V04100,V04102",null,null,"Price Region"]
["%,FACCOUNT,TQGCACCTS,N812,FOPERATING_UNIT,TQRSOPUNITTYPE,NSOUTHERN",null,null,"Southern Utah Region"]
["%,FACCOUNT,TQGCACCTS,N812,FOPERATING_UNIT,V04101",null,null,"Provo Region"]
["%,FACCOUNT,TQGCACCTS,N812,FOPERATING_UNIT,TQRSOPUNITTYPE,NSALT_LAKE",null,null,"Salt Lake Region"]
[null,null,null,"Wyoming Region"]
["%,FACCOUNT,TQGCACCTS,N812,FOPERATING_UNIT,V04140",null,null,"  Evanston & Lyman"]
["%,FACCOUNT,TQGCACCTS,N812,FOPERATING_UNIT,V04141",null,null,"  Rock Springs"]
[null,null,null,"Gas Used for CNG Vehicles"]
["%,FACCOUNT,TQGCACCTS,N812,FOPERATING_UNIT,V01908,V01910,V01911,V01914,V01915,V01933,V01934,V01942,V01943,V01944,V01946",null,null,"  Wyoming"]
["%,FACCOUNT,TQGCACCTS,N812,FOPERATING_UNIT,V01923,V01930,V01953,V01954,V01955,V01965,V01972,V01975,V01976,V01979,V01980,V01982,V01983,V01986,V01990",null,null,"  Salt Lake North"]
["%,FACCOUNT,TQGCACCTS,N812,FOPERATING_UNIT,V01931,V01957,V01958,V01959",null,null,"  Salt Lake South"]
["%,FACCOUNT,TQGCACCTS,N812,FOPERATING_UNIT,V01926,V01927,V01928,V01929,V01936,V01937,V01956,V01960,V01961,V01968,V01969,V01974,V01978",null,null,"  Southern Utah Region"]
["%,FACCOUNT,TQGCACCTS,N812,FOPERATING_UNIT,V01920,V01922,V01925,V01952,V01967",null,null,"  Provo & Roosevelt"]
["%,FACCOUNT,TQGCACCTS,N812,FOPERATING_UNIT,V01921,V01935,V01938,V01945,V01970",null,null,"  Price"]
["%,FACCOUNT,TQGCACCTS,N812,FOPERATING_UNIT,V01918,V01949,V01973",null,null,"  Ogden"]
["%,FACCOUNT,TQGCACCTS,N812,FOPERATING_UNIT,V01917,V01940",null,null,"  Brigham"]
["%,FACCOUNT,TQGCACCTS,N812,FOPERATING_UNIT,V01916,V01948,V01977",null,null,"  Logan"]
["%,FACCOUNT,TQGCACCTS,N812,FOPERATING_UNIT,V01924,V01932,V01964,V01971",null,null,"  Heber"]
["%,FACCOUNT,TQGCACCTS,N812,FOPERATING_UNIT,V01919,V01941,V01950,V01951,V01966",null,null,"  Layton"]
[null,null,null,"TOTAL ACCOUNT 812"]
[]
[]
[null,null,null,"TOTAL ACCOUNTS 810 AND 812"]

{"sheet":"Rate Base","index":43,"n_rows":285,"n_cols":21,"rows_kept":285,"cut":false,"hidden":false,"merged":[[10,2,10,6],[4,2,4,6]]}
["%,LACTUALS"]
[null,null,"Company:",null,null,"Company:"]
[null,null,"Period Ended:",null,null,"Period Ended:"]
[null,null,"Date,Time, Stamp:",null,null,"Date,Time, Stamp:"]
[null,null,null,null,null,null,null,null,null,null,null,null,null,null,null,null,null,null,null,null,"Historical"]
[null,null,null,null,null,null,null,null,null,null,null,null,null,null,null,null,null,null,null,null,"13-Month Avg"]
[null,null,null,null,null,null,null,null,null,null,null,null,null,null,null,null,null,null,null,null,"Period Ended"]
[null,null,null,null,null,null,{"$f":"+H8-30","v":"2018-06-17"},"2018-07-17","2018-08-16","2018-09-01","2018-10-01","2018-11-01","2018-12-01","2019-01-01","2019-02-01","2019-03-01","2019-04-01","2019-05-01","2019-06-01","2019-07-01","2019-07-31"]
[]
[null,null,"UTILITY RATE BASE"]
[null,null,null,"NET UTILITY PLANT"]
[]
[null,null,null,"Intangible Plant"]
[null,null,"101","Gas Plant In Service"]
[null,null,null,null,"Intangible Plant"]
[null,1,null,"302","Franchises & Consents"]
[null,{"$f":"+B16+1","v":2},null,null,"Distribution - Wyoming",null,null,0,0,0,0,0,0,0,0,0,0,0,0,0,0]
[null,3,null,null,"Distribution - Utah",null,null,0,0,0,0,0,0,0,0,0,0,0,0,0,0]
[null,4]
[{"$f":"\"%,FACCOUNT,TQGCACCTS,N\"&(D16)","v":"%,FACCOUNT,TQGCACCTS,N302"},5,null,null,"Total Intangible Plant",null,null,0,0,0,0,0,0,0,0,0,0,0,0,0,0]
[null,6]
[null,7,null,null,"Production & Gathering Plant"]
[{"$f":"\"%,FACCOUNT,TQGCACCTS,N\"&(D23)","v":"%,FACCOUNT,TQGCACCTS,N325"},8,null,"325","Land & Land Rights",null,null,0,0,0,0,0,0,0,0,0,0,0,0,0,0]
["%,FACCOUNT,TQGCACCTS,N326,N327,N328,N329",9,null,"326...9","Structures",null,null,0,0,0,0,0,0,0,0,0,0,0,0,0,0]
[{"$f":"\"%,FACCOUNT,TQGCACCTS,N\"&(D25)","v":"%,FACCOUNT,TQGCACCTS,N330"},10,null,"330","Gas Wells - Construction",null,null,0,0,0,0,0,0,0,0,0,0,0,0,0,0]
[{"$f":"\"%,FACCOUNT,TQGCACCTS,N\"&(D26)","v":"%,FACCOUNT,TQGCACCTS,N331"},11,null,"331","Gas Wells - Equipment",null,null,0,0,0,0,0,0,0,0,0,0,0,0,0,0]
["%,FACCOUNT,TQGCACCTS,N332,N333,N334",12,null,"332...4","Field Lines & Comp, Meas & Reg St Eqpt",null,null,0,0,0,0,0,0,0,0,0,0,0,0,0,0]
[{"$f":"\"%,FACCOUNT,TQGCACCTS,N\"&(D28)","v":"%,FACCOUNT,TQGCACCTS,N336"},13,null,"336","Purification Equipment",null,null,0,0,0,0,0,0,0,0,0,0,0,0,0,0]
[{"$f":"\"%,FACCOUNT,TQGCACCTS,N\"&(D29)","v":"%,FACCOUNT,TQGCACCTS,N337"},14,null,"337","Other Equipment",null,null,0,0,0,0,0,0,0,0,0,0,0,0,0,0]
[null,15]
[null,16,null,null,"Total Production & Gathering Plant",null,null,0,0,0,0,0,0,0,0,0,0,0,0,0,0]
[null,17]
[null,18,null,null,"Distribution Plant"]
[null,19,null,"374","Land & Land Rights"]
[" ",20,null,null,null,"Wyoming",null,0,0,0,0,0,0,0,0,0,0,0,0,0,0]
[{"$f":"\"%,FACCOUNT,TQGCACCTS,N\"&(D34)","v":"%,FACCOUNT,TQGCACCTS,N374"},21,null,null,null,"Utah",null,0,0,0,0,0,0,0,0,0,0,0,0,0,0]
[null,22,null,null,null,"Total",null,0,0,0,0,0,0,0,0,0,0,0,0,0,0]
[null,23]
[null,24,null,"375","Structures & Improvements"]
[" ",25,null,null,null,"Wyoming",null,0,0,0,0,0,0,0,0,0,0,0,0,0,0]
[{"$f":"\"%,FACCOUNT,TQGCACCTS,N\"&(D39)","v":"%,FACCOUNT,TQGCACCTS,N375"},26,null,null,null,"Utah",null,0,0,0,0,0,0,0,0,0,0,0,0,0,0]
[null,27,null,null,null,"Total",null,0,0,0,0,0,0,0,0,0,0,0,0,0,0]
[null,28]
[null,29,null,"376","Mains"]
[null,30,null,null,null,"Dist - Wy - Mains - SD"]
[null,31,null,null,null,"Dist - Wy - Mains - LD"]
[null,32,null,null,null,"Dist - Wy - Mains - Feeders"]
[" ",33,null,null,null,"Wyoming",null,0,0,0,0,0,0,0,0,0,0,0,0,0,0]
[null,34,null,null,null,"Dist - Ut - Mains - SD"]
[null,35,null,null,null,"Dist - Ut - Mains - LD"]
[null,36,null,null,null,"Dist - Ut - Mains - Feeders"]
[{"$f":"\"%,FACCOUNT,TQGCACCTS,N\"&(D44)","v":"%,FACCOUNT,TQGCACCTS,N376"},37,null,null,null,"Utah",null,0,0,0,0,0,0,0,0,0,0,0,0,0,0]
[null,38,null,null,null,"Total",null,0,0,0,0,0,0,0,0,0,0,0,0,0,0]
[null,39,null,null,null,null,null,0,0,0,0,0,0,0,0,0,0,0,0,0,0]
[null,40,null,"377","Compressor Station Equipment"]
[null,41,null,null,null,"Wyoming",null,0,0,0,0,0,0,0,0,0,0,0,0,0,0]
[{"$f":"\"%,FACCOUNT,TQGCACCTS,N\"&(D55)","v":"%,FACCOUNT,TQGCACCTS,N377"},42,null,null,null,"Utah",null,0,0,0,0,0,0,0,0,0,0,0,0,0,0]
[null,43,null,null,null,"Total",null,0,0,0,0,0,0,0,0,0,0,0,0,0,0]
[null,44]
[null,45,null,"378","Measuring & Regulation Station Equip"]
[" ",46,null,null,null,"Wyoming",null,0,0,0,0,0,0,0,0,0,0,0,0,0,0]
[{"$f":"\"%,FACCOUNT,TQGCACCTS,N\"&(D60)","v":"%,FACCOUNT,TQGCACCTS,N378"},47,null,null,null,"Utah",null,0,0,0,0,0,0,0,0,0,0,0,0,0,0]
[null,48,null,null,null,"Total",null,0,0,0,0,0,0,0,0,0,0,0,0,0,0]
[null,49]
[null,50,null,"380","Services"]
[" ",51,null,null,null,"Wyoming",null,0,0,0,0,0,0,0,0,0,0,0,0,0,0]
[{"$f":"\"%,FACCOUNT,TQGCACCTS,N\"&(D65)","v":"%,FACCOUNT,TQGCACCTS,N380"},52,null,null,null,"Utah",null,0,0,0,0,0,0,0,0,0,0,0,0,0,0]
[null,53,null,null,null,"Total",null,0,0,0,0,0,0,0,0,0,0,0,0,0,0]
[null,54]
[null,55,null,"381...2","Meters & Meter Installation"]
[" ",56,null,null,null,"Wyoming",null,0,0,0,0,0,0,0,0,0,0,0,0,0,0]
["%,FACCOUNT,TQGCACCTS,N381,N382",57,null,null,null,"Utah",null,0,0,0,0,0,0,0,0,0,0,0,0,0,0]
[null,58,null,null,null,"Total",null,0,0,0,0,0,0,0,0,0,0,0,0,0,0]
[null,59]
[null,60,null,"383...4","House Regulators & Reg Installations"]
[" ",61,null,null,null,"Wyoming",null,0,0,0,0,0,0,0,0,0,0,0,0,0,0]
["%,FACCOUNT,TQGCACCTS,N383,N384",62,null,null,null,"Utah",null,0,0,0,0,0,0,0,0,0,0,0,0,0,0]
[null,63,null,null,null,"Total",null,0,0,0,0,0,0,0,0,0,0,0,0,0,0]
[null,64,null,null,null,null," "]
[null,65,null,"387","Other Equipment"]
[" ",{"$f":"+B80+1","v":66},null,null,null,"Wyoming",null,0,0,0,0,0,0,0,0,0,0,0,0,0,0]
[{"$f":"\"%,FACCOUNT,TQGCACCTS,N\"&(D80)","v":"%,FACCOUNT,TQGCACCTS,N387"},67,null,null,null,"Utah",null,0,0,0,0,0,0,0,0,0,0,0,0,0,0]
[null,68,null,null,null,"Total",null,0,0,0,0,0,0,0,0,0,0,0,0,0,0]
[null,69,null,null,null,null," "]
[null,70,null,null,"Total Distribution Plant",null,null,0,0,0,0,0,0,0,0,0,0,0,0,0,0]
[null,71]
[null,72,"General Plant"]
[null,73,null,"389","Land & Land Rights"]
[null,74,null,null,null,"Distribution - Wyoming",null,0,0,0,0,0,0,0,0,0,0,0,0,0,0]
[{"$f":"\"%,FACCOUNT,TQGCACCTS,N\"&(D88)","v":"%,FACCOUNT,TQGCACCTS,N389"},75,null,null,null,"Distribution - Utah",null,0,0,0,0,0,0,0,0,0,0,0,0,0,0]
[null,76,null,null,null,"Total",null,0,0,0,0,0,0,0,0,0,0,0,0,0,0]
[null,77]
[null,78,null,"390","Structures & Improvements"]
[" ",79,null,null,null,"Distribution - Wyoming",null,0,0,0,0,0,0,0,0,0,0,0,0,0,0]
[{"$f":"\"%,FACCOUNT,TQGCACCTS,N\"&(D93)","v":"%,FACCOUNT,TQGCACCTS,N390"},80,null,null,null,"Distribution - Utah",null,0,0,0,0,0,0,0,0,0,0,0,0,0,0]
[null,81,null,null,null,"General",null,0,0,0,0,0,0,0,0,0,0,0,0,0,0]
[null,82,null,null,null,"Total",null,0,0,0,0,0,0,0,0,0,0,0,0,0,0]
[null,83]
[null,84,null,"391","Office Furniture & Equipment"]
[" ",85,null,null,null,"Distribution - Wyoming",null,0,0,0,0,0,0,0,0,0,0,0,0,0,0]
[{"$f":"\"%,FACCOUNT,TQGCACCTS,N\"&(D99)","v":"%,FACCOUNT,TQGCACCTS,N391"},86,null,null,null,"Distribution - Utah",null,0,0,0,0,0,0,0,0,0,0,0,0,0,0]
[null,87,null,null,null,"General",null,0,0,0,0,0,0,0,0,0,0,0,0,0,0]
[null,88,null,null,null,"Total",null,0,0,0,0,0,0,0,0,0,0,0,0,0,0]
[null,89]
[null,90,null,"392","Transportation Equipment"]
[" ",91,null,null,null,"Distribution - Wyoming",null,0,0,0,0,0,0,0,0,0,0,0,0,0,0]
[{"$f":"\"%,FACCOUNT,TQGCACCTS,N\"&(D105)","v":"%,FACCOUNT,TQGCACCTS,N392"},92,null,null,null,"Distribution - Utah",null,0,0,0,0,0,0,0,0,0,0,0,0,0,0]
[null,93,null,null,null,"General",null,0,0,0,0,0,0,0,0,0,0,0,0,0,0]
[null,94,null,null,null,"Total",null,0,0,0,0,0,0,0,0,0,0,0,0,0,0]
[null,95]
[null,96,null,"393","Stores Equipment"]
[" ",97,null,null,null,"Distribution - Wyoming",null,0,0,0,0,0,0,0,0,0,0,0,0,0,0]
[{"$f":"\"%,FACCOUNT,TQGCACCTS,N\"&(D111)","v":"%,FACCOUNT,TQGCACCTS,N393"},98,null,null,null,"Distribution - Utah",null,0,0,0,0,0,0,0,0,0,0,0,0,0,0]
[null,99,null,null,null,"Total",null,0,0,0,0,0,0,0,0,0,0,0,0,0,0]
[null,100]
[null,101,null,"394","Tools, Shop & Garage Equipment"]
[" ",102,null,null,null,"Distribution - Wyoming",null,0,0,0,0,0,0,0,0,0,0,0,0,0,0]
[{"$f":"\"%,FACCOUNT,TQGCACCTS,N\"&(D116)","v":"%,FACCOUNT,TQGCACCTS,N394"},103,null,null,null,"Distribution - Utah",null,0,0,0,0,0,0,0,0,0,0,0,0,0,0]
[null,104,null,null,null,"General",null,0,0,0,0,0,0,0,0,0,0,0,0,0,0]
[null,105,null,null,null,"Total",null,0,0,0,0,0,0,0,0,0,0,0,0,0,0]
[null,106]
[null,107,null,"395","Laboratory Equipment"]
[" ",108,null,null,null,"Distribution - Wyoming",null,0,0,0,0,0,0,0,0,0,0,0,0,0,0]
[{"$f":"\"%,FACCOUNT,TQGCACCTS,N\"&(D122)","v":"%,FACCOUNT,TQGCACCTS,N395"},109,null,null,null,"Distribution - Utah",null,0,0,0,0,0,0,0,0,0,0,0,0,0,0]
[null,110,null,null,null,"General",null,0,0,0,0,0,0,0,0,0,0,0,0,0,0]
[null,111,null,null,null,"Total",null,0,0,0,0,0,0,0,0,0,0,0,0,0,0]
[null,112]
[null,113,null,"396","Power Operated Equipment"]
[" ",114,null,null,null,"Distribution - Wyoming",null,0,0,0,0,0,0,0,0,0,0,0,0,0,0]
[{"$f":"\"%,FACCOUNT,TQGCACCTS,N\"&(D128)","v":"%,FACCOUNT,TQGCACCTS,N396"},115,null,null,null,"Distribution - Utah",null,0,0,0,0,0,0,0,0,0,0,0,0,0,0]
[null,116,null,null,null,"General",null,0,0,0,0,0,0,0,0,0,0,0,0,0,0]
[null,117,null,null,null,"Total",null,0,0,0,0,0,0,0,0,0,0,0,0,0,0]
[null,118]
[null,119,null,"397","Communication Equipment"]
[" ",120,null,null,null,"Distribution - Wyoming",null,0,0,0,0,0,0,0,0,0,0,0,0,0,0]
[{"$f":"\"%,FACCOUNT,TQGCACCTS,N\"&(D134)","v":"%,FACCOUNT,TQGCACCTS,N397"},121,null,null,null,"Distribution - Utah",null,0,0,0,0,0,0,0,0,0,0,0,0,0,0]
[null,122,null,null,null,"Total",null,0,0,0,0,0,0,0,0,0,0,0,0,0,0]
[null,123]
[null,124,null,"398","Miscellaneous Equipment"]
[" ",125,null,null,null,"Distribution - Wyoming",null,0,0,0,0,0,0,0,0,0,0,0,0,0,0]
[{"$f":"\"%,FACCOUNT,TQGCACCTS,N\"&(D139)","v":"%,FACCOUNT,TQGCACCTS,N398"},126,null,null,null,"Distribution - Utah",null,0,0,0,0,0,0,0,0,0,0,0,0,0,0]
[null,127,null,null,null,"General",null,0,0,0,0,0,0,0,0,0,0,0,0,0,0]
[null,128,null,null,null,"Total",null,0,0,0,0,0,0,0,0,0,0,0,0,0,0]
[null,129]
[null,{"$f":"+B144+1","v":130},null,null,"Total General Plant",null,null,0,0,0,0,0,0,0,0,0,0,0,0,0,0]
[null,131]
[null,132,"101","Gas Plant in Service"]
[null,133,null,null,"Production",null,null,79968136,79968136,79968136,79968136,79968136,79968136,79968136,79968136,79968136,79968136,79968136,79968136,79968136,{"$f":"((H148/2)+SUM(I148:S148)+(T148/2))/12","v":79968136}]
[null,134,null,null,"Distribution - Wyoming",null,null,0,0,0,0,0,0,0,0,0,0,0,0,0,0]
[null,135,null,null,"Distribution - Utah",null,null,0,0,0,0,0,0,0,0,0,0,0,0,0,0]
[null,136,null,null,"General",null,null,0,0,0,0,0,0,0,0,0,0,0,0,0,0]
[null,137,null,null,"Total",null,null,0,0,0,0,0,0,0,0,0,0,0,0,0,0]
[null,138]
[null,139,"105","Gas Plant Held for Future Use"]
[null,140,null,null,"Distribution - Utah",null,null,5036.83,5036.83,5036.83,5036.83,5036.83,5036.83,5036.83,5036.83,5036.83,5036.83,0,0,5036.83,{"$f":"((H155/2)+SUM(I155:S155)+(T155/2))/12","v":4197.3583333333345}]
["%,FACCOUNT,TQGCACCTS,N105",141,null,null,"Total",null,null,5036.83,5036.83,5036.83,5036.83,5036.83,5036.83,5036.83,5036.83,5036.83,5036.83,0,0,5036.83,{"$f":"SUM(U155)","v":4197.3583333333345}]
[null,142]
[null,143,"106","Completed Construction Not Classified - Gas"]
[null,144,null,null,"Production",null,null,0,0,0,0,0,0,0,0,0,0,0,0,0,{"$f":"((H159/2)+SUM(I159:S159)+(T159/2))/12","v":0}]
[null,145,null,null,"Distribution - Wyoming",null,null,1993330.3800000001,2239100.69,276963.56,950180.8,1588249.67,1993330.3800000001,2239100.69,694464.74,694528.8,694464.74,800826.87,800805.98,1993330.3800000001,{"$f":"((H160/2)+SUM(I160:S160)+(T160/2))/12","v":1247112.2749999999}]
[null,146,null,null,"Distribution - Utah",null,null,12826474.791999988,9308466.1199999992,6777010.3099999996,9121644.75,9719600.2219999917,12826474.791999988,9308466.1199999992,651695.31000000006,128043.79799999925,145144.7379999992,5137049.4099999992,8133513.8200000003,12826474.791999988,{"$f":"((H161/2)+SUM(I161:S161)+(T161/2))/12","v":7006965.3484999985}]
[null,147,null,null,"General",null,null,1200519.75,1438369,471060.27,1131562.3699999994,1107897.0900000001,1200519.75,1438369,0,38447,407051.99,1705726.6500000006,2337329.59,1200519.75,{"$f":"((H162/2)+SUM(I162:S162)+(T162/2))/12","v":1039737.7050000001}]
[null,148,null,null,"Total",null,null,16020324.921999989,12985935.809999999,7525034.1399999987,11203387.92,12415746.981999991,16020324.921999989,12985935.809999999,1346160.05,861019.5979999993,1246661.4679999992,7643602.9299999997,11271649.390000001,16020324.921999989,{"$f":"SUM(U159:U162)","v":9293815.3284999989}]
[null,149]
[null,150,"108","Accum Prov for Depreciation of Gas Plant in Service"]
[null,151,null,null,"Production",null,null,-69869425,-69910892,-69952359,-69993826,-70035293,-70076759,-70076759,-70118226,-70159693,-70201160,-70242627,-70242627,-70325561,{"$f":"((H166/2)+SUM(I166:S166)+(T166/2))/12","v":-70092309.5}]
[null,152,null,null,"Distribution - Wyoming",null,null,0,0,0,0,0,0,0,0,0,0,0,0,0,0]
[null,153,null,null,"Distribution - Utah",null,null,0,0,0,0,0,0,0,0,0,0,0,0,0,0]
[null,154,null,null,"General",null,null,0,0,0,0,0,0,0,0,0,0,0,0,0,0]
[null,155,null,null,"Total",null,null,0,0,0,0,0,0,0,0,0,0,0,0,0,0]
[null,156]
[null,157,"111","Accum Prov for Amortization of Gas Plant in Service"]
[null,158,null,null,"Production",null,null,-6150277,-6150277,-6150277,-6150277,-6150277,-6150277,-6150277,-6150277,-6150277,-6150277,-6150277,-6150277,-6150277,{"$f":"((H173/2)+SUM(I173:S173)+(T173/2))/12","v":-6150277}]
[null,159,null,null,"Distribution - Wyoming",null,null,0,0,0,0,0,0,0,0,0,0,0,0,0,0]
[null,160,null,null,"Distribution - Utah",null,null,0,0,0,0,0,0,0,0,0,0,0,0,0,0]
[null,161,null,null,"General",null,null,0,0,0,0,0,0,0,0,0,0,0,0,0,0]
[null,162,null,null,"Total",null,null,0,0,0,0,0,0,0,0,0,0,0,0,0,0]
[null,163]
[null,164,"254","Other Regulatory Liabilities - ARC"]
[null,165,null,null,"Production",null,null,0,0,0,0,0,0,0,0,0,0,0,0,0,{"$f":"((H180/2)+SUM(I180:S180)+(T180/2))/12","v":0}]
[null,166,null,null,"Distribution - Wyoming",null,null,-6140761.1100000003,-6196748.9800000004,-6236339.0700000003,-6213637.6699999999,-6181248.29,-6140761.1100000003,-6196748.9800000004,-6315729.0099999998,-6315729.0099999998,-6315729.0099999998,-6315729.0099999998,-6315729.0099999998,-6140761.1100000003,{"$f":"((H181/2)+SUM(I181:S181)+(T181/2))/12","v":-6240407.5216666674}]
[null,167,null,null,"Distribution - Utah",null,null,-186299261.02000001,-186248871.44,-186481184.78999999,-186218622.28,-186141349.55000001,-186299261.02000001,-186248871.44,-188074206.56999999,-190128957.88999999,-190128957.88999999,-190128957.88999999,-189034810.75999999,-186299261.02000001,{"$f":"((H182/2)+SUM(I182:S182)+(T182/2))/12","v":-187619442.71166667}]
[null,168,null,null,"General",null,null,0,0,0,0,0,0,0,-243070289.09999999,-242946363.83000001,-242946423.56999999,-242946314.06,-242946364.19,0,{"$f":"((H183/2)+SUM(I183:S183)+(T183/2))/12","v":-101237979.5625}]
[null,169,null,null,"Total",null,null,-192440022.13000003,-192445620.41999999,-192717523.85999998,-192432259.94999999,-192322597.84,-192440022.13000003,-192445620.41999999,-437460224.67999995,-439391050.73000002,-439391110.46999997,-439391000.95999998,-438296903.95999998,-192440022.13000003,{"$f":"SUM(U180:U183)","v":-295097829.79583335}]
[null,170]
[null,171]
[null,172,"System Net Utility Plant"]
[null,173,null,null,"Production",null,null,3943397,3943397,4067798,4026331,3984864,3943397,3943397,4151984.3399999253,4109268.9699999951,4067798.0799999945,4031368.0299999975,3989901.1500000022,3943397,{"$f":"((H188/2)+SUM(I188:S188)+(T188/2))/12","v":4016908.4641666599}]
[null,174,null,null,"Distribution - Wyoming",null,null,52431596.463999994,54642591.469999999,50207898.394000009,50797307.513999984,51973211.943999998,52431596.463999994,54642591.469999999,49033703.410000011,49580125.160000004,49778428.240000002,49714135.470000006,49977066.050000004,52431596.463999994,{"$f":"((H189/2)+SUM(I189:S189)+(T189/2))/12","v":51267521.00416667}]
[null,175,null,null,"Distribution - Utah",null,null,1668454071.1179998,1706662742.2999997,1654258709.6960001,1659765109.4559996,1663136893.3079996,1668454071.1179998,1706662742.2999997,1760221866.2199998,1772598424.6879997,1771848862.0479994,1786527823.9199996,1794474335.7400002,1668454071.1179998,{"$f":"((H190/2)+SUM(I190:S190)+(T190/2))/12","v":1717755470.9926662}]
[null,176,null,null,"General",null,null,137256374.58000004,137913169.70000005,138028505.81,138248889.79000002,137938090.03000003,137256374.58000004,137913169.70000005,-110034117.74000001,-111005141.65000004,-111676571.48999998,-111496718.48999999,-111961102.75999999,137256374.58000004,{"$f":"((H191/2)+SUM(I191:S191)+(T191/2))/12","v":34031743.505000025}]
[null,177,null,null,"Total"]
[null,178]
[null,179,null,"System Net Utility Plant",null,null,null,2055097757.852,2096125168.1899996,2039897928.6900003,2045873925.8799996,2049945459.3619993,2055097757.852,2096125168.1899996,1703373436.2299998,1715282677.1679997,1714018516.8779993,1728776608.9299996,1736480200.1800003,2055097757.852,{"$f":"U152+U156+U163+U170+U177","v":9298012.6868333314}]
["%,FACCOUNT,TQGCACCTS,N154,N156",180]
[null,181]
[null,182,"WORKING CAPITAL"]
[null,183]
["%,FACCOUNT,TQGCACCTS,N164",184,154,"Plant Materials & Operating Supplies"]
[null,185,null,null,"Distribution - Wyoming",null,null,0,0,0,0,0,0,0,1037567.4109139629,1031653.0188574977,1023482.9950271025,827969.49626951665,760572.84848188981,0,{"$f":"((H200/2)+SUM(I200:S200)+(T200/2))/12","v":390103.81412916415}]
[null,186,null,null,"Distribution - Utah",null,null,22002243.219999999,22628439.690000001,24060178.699999999,24379560.43,25423043.52,22002243.219999999,22628439.690000001,30755104.549086038,30579792.8111425,30337620.654972896,24542297.833730482,22544556.841518112,22002243.219999999,{"$f":"((H201/2)+SUM(I201:S201)+(T201/2))/12","v":25156960.096704174}]
[null,187,null,null,"Total",null,null,22002243.219999999,22628439.690000001,24060178.699999999,24379560.43,25423043.52,22002243.219999999,22628439.690000001,31792671.960000001,31611445.829999998,31361103.649999999,25370267.329999998,23305129.690000001,22002243.219999999,{"$f":"SUM(U200:U201)","v":25547063.910833336}]
["%,FACCOUNT,TQGCACCTS,N165",188]
[null,189,1641,"Gas Stored Underground"]
[null,190,null,null,"Production",null,null,39219511.989999995,43502522.789999984,62143023.659999982,62647436.719999984,52783329.589999981,44167774.479999982,33177810.05999998,24117118.759999979,8155444.2399999797,6352626.4299999792,8741282.3899999782,19062047.869999975,33521823.379999973,{"$f":"((H205/2)+SUM(I205:S205)+(T205/2))/12","v":33435090.389583316}]
[null,191,null,null,"Total",null,null,39219511.989999995,43502522.789999984,62143023.659999982,62647436.719999984,52783329.589999981,44167774.479999982,33177810.05999998,24117118.759999979,8155444.2399999797,6352626.4299999792,8741282.3899999782,19062047.869999975,33521823.379999973,{"$f":"((H206/2)+SUM(I206:S206)+(T206/2))/12","v":33435090.389583316}]
[null,192]
[null,193,165,"Prepayments"]
[null,{"$f":"+B208+1","v":194},null,null,"General",null,null,4793895.25,4367971.97,2310232.3199999998,3646873.1,4896628.5600000005,4793895.25,4367971.97,3180846.88,2916243.01,2554922.2999999998,2113798.13,2982486.24,4793895.25,{"$f":"((H209/2)+SUM(I209:S209)+(T209/2))/12","v":3577147.0816666665}]
["%,FACCOUNT,V190008",195,null,null,"Total",null,null,4793895.25,4367971.97,2310232.3199999998,3646873.1,4896628.5600000005,4793895.25,4367971.97,3180846.88,2916243.01,2554922.2999999998,2113798.13,2982486.24,4793895.25,{"$f":"SUM(U209)","v":3577147.0816666665}]
[null,196]
[null,197,"190008","Accum Deferred Income Tax Federal"]
[null,198,null,null,"Production",null,null,0,0,0,0,0,0,0,0,0,0,0,0,0,{"$f":"((H213/2)+SUM(I213:S213)+(T213/2))/12","v":0}]
[null,199,null,null,"Distribution - Wyoming",null,null,0,0,0,0,0,0,0,0,0,0,0,0,0,{"$f":"((H214/2)+SUM(I214:S214)+(T214/2))/12","v":0}]
[null,200,null,null,"Distribution - Utah",null,null,0,0,0,0,0,0,0,0,0,0,0,0,0,{"$f":"((H215/2)+SUM(I215:S215)+(T215/2))/12","v":0}]
[null,201,null,null,"General",null,null,0,0,0,0,0,0,0,32300012.969999999,29904986.309999999,32423956.600000001,32372223.170000002,32213824.239999998,0,{"$f":"((H216/2)+SUM(I216:S216)+(T216/2))/12","v":13267916.940833332}]
["%,FACCOUNT,V190009",202,null,null,"Total",null,null,0,0,0,0,0,0,0,32300012.969999999,29904986.309999999,32423956.600000001,32372223.170000002,32213824.239999998,0,{"$f":"SUM(U213:U216)","v":13267916.940833332}]
[null,203]
[null,204,"190009","Accum Deferred Income Tax State"]
["%,FOPERATING_UNIT,TQRSOPUNITTYPE,NWYO_REGION,NWYOMING,FACCOUNT,TQGCACCTS,N235",205,null,null,"Production",null,null,0,0,0,0,0,0,0,0,0,0,0,0,0,{"$f":"((H220/2)+SUM(I220:S220)+(T220/2))/12","v":0}]
[null,206,null,null,"Distribution - Wyoming",null,null,0,0,0,0,0,0,0,0,0,0,0,0,0,{"$f":"((H221/2)+SUM(I221:S221)+(T221/2))/12","v":0}]
["%,FACCOUNT,TQGCACCTS,N235",207,null,null,"Distribution - Utah",null,null,0,0,0,0,0,0,0,0,0,0,0,0,0,{"$f":"((H222/2)+SUM(I222:S222)+(T222/2))/12","v":0}]
[null,208,null,null,"General",null,null,0,0,0,0,0,0,0,7702822.5800000001,7055994.4800000004,7650338.2400000002,7638131.8700000001,7600758.1100000003,0,{"$f":"((H223/2)+SUM(I223:S223)+(T223/2))/12","v":3137337.1066666669}]
[null,209,null,null,"Total",null,null,0,0,0,0,0,0,0,7702822.5800000001,7055994.4800000004,7650338.2400000002,7638131.8700000001,7600758.1100000003,0,{"$f":"SUM(U220:U223)","v":3137337.1066666669}]
[null,210]
[null,211,2351,"Customer Deposits"]
["%,FACCOUNT,TQGCACCTS,N252",212,null,null,"Distribution - Wyoming",null,null,-260801,-250950.09,-272979.68,-261693.76,-263417.59999999998,-260801,-250950.09,-248764.37,-250399.39,-243200.55,-239567.05,-231162.81,-260801,{"$f":"((H227/2)+SUM(I227:S227)+(T227/2))/12","v":-252890.61583333332}]
[null,213,null,null,"Distribution - Utah",null,null,-6797581.7400000002,-6760662.6600000001,-6662069.9500000002,-6673252.6200000001,-6782840.1100000003,-6797581.7400000002,-6760662.6600000001,-5419092.21,-5462569.7699999996,-5434455.4800000004,-5268773.7300000004,-5208932.29,-6797581.7400000002,{"$f":"((H228/2)+SUM(I228:S228)+(T228/2))/12","v":-6169039.5800000019}]
[null,214,null,null,"Total",null,null,-7058382.7400000002,-7011612.75,-6935049.6299999999,-6934946.3799999999,-7046257.71,-7058382.7400000002,-7011612.75,-5667856.5800000001,-5712969.1599999992,-5677656.0300000003,-5508340.7800000003,-5440095.0999999996,-7058382.7400000002,{"$f":"SUM(U227:U228)","v":-6421930.1958333356}]
[null,215]
["%,FACCOUNT,V253000",216,252,"Misc Customer Credits"]
[null,217,null,null,"Distribution - Wyoming",null,null,-465842.24,-465842.24,-510513.99,-465842.24,-465842.24,-465842.24,-465842.24,-404156.02,-404156.02,-404156.02,-404156.02,-404156.02,-465842.24,{"$f":"((H232/2)+SUM(I232:S232)+(T232/2))/12","v":-443862.29416666675}]
[null,218,null,null,"Distribution - Utah",null,null,-16967883.640000001,-16893271.25,-17278147.050000001,-17044300.110000003,-17012595.390000001,-16967883.640000001,-16893271.25,-11724439,-11724439,-11724439,-11724439,-11724439,-16967883.640000001,{"$f":"((H233/2)+SUM(I233:S233)+(T233/2))/12","v":-14806628.944166666}]
["%,FACCOUNT,V255000,FPRODUCT,V060,V",219,null,null,"Total",null,null,-17433725.879999999,-17359113.489999998,-17788661.039999999,-17510142.350000001,-17478437.629999999,-17433725.879999999,-17359113.489999998,-12128595.02,-12128595.02,-12128595.02,-12128595.02,-12128595.02,-17433725.879999999,{"$f":"((H234/2)+SUM(I234:S234)+(T234/2))/12","v":-15250491.238333335}]
[null,220]
[null,221,2531,"Unclaimed Customer Deposits"]
["%,FACCOUNT,V255000,FPRODUCT,V090,V",222,null,null,"General",null,null,-46197.35,-16591.05,-44370.28,-45040.33,-45851.590000000004,-46197.35,-16591.05,-31942.38,-36478.11,-36955.300000000003,-37617.43,-37849.040000000001,-46197.35,{"$f":"((H237/2)+SUM(I237:S237)+(T237/2))/12","v":-36806.77166666666}]
["%,FACCOUNT,V255000",223,null,null,"Total",null,null,-46197.35,-16591.05,-44370.28,-45040.33,-45851.590000000004,-46197.35,-16591.05,-31942.38,-36478.11,-36955.300000000003,-37617.43,-37849.040000000001,-46197.35,{"$f":"SUM(U237)","v":-36806.77166666666}]
[null,224]
[null,225,255,"Deferred Investment Tax Credits"]
["%,FACCOUNT,V282000,FPRODUCT,V060,V",226,null,null,"Production",null,null,-1311,-1311,-1311,-1311,-1311,0,0,0,0,0,0,0,0,{"$f":"((H241/2)+SUM(I241:S241)+(T241/2))/12","v":-491.625}]
[null,227,null,null,"Distribution - Wyoming",null,null,0,0,0,0,0,0,0,0,0,0,0,0,0,0]
[null,228,null,null,"Distribution - Utah",null,null,0,0,0,0,0,0,0,0,0,0,0,0,0,0]
["%,FACCOUNT,V282000,FPRODUCT,V090,V",229,null,null,"General",null,null,0,0,0,0,0,0,0,0,0,0,0,0,0,0]
["%,FACCOUNT,V282000",230,null,null,"Total",null,null,0,0,0,0,0,0,0,0,0,0,0,0,0,0]
[null,231]
[null,232,282000,"Accum Deferred Income Taxes - Federal"]
["%,FACCOUNT,V282100,FPRODUCT,V060,V",233,null,null,"Production",null,null,1861750,-10016752,-8372698,-8172642,-8133451,-7045486,-7045486,-8226119,-8610267,-8240231,-8638495,-8638495,-9435062,{"$f":"((H248/2)+SUM(I248:S248)+(T248/2))/12","v":-7910564.833333333}]
["%,FOPERATING_UNIT,TQRSOPUNITTYPE,NWYO_REGION,NWYOMING,FACCOUNT,TQGCACCTS,V282100",234,null,null,"Distribution - Wyoming",null,null,0,0,0,0,0,0,0,0,0,0,0,0,0,0]
[null,235,null,null,"Distribution - Utah",null,null,0,0,0,0,0,0,0,0,0,0,0,0,0,0]
["%,FACCOUNT,V282100,FPRODUCT,V090,V",236,null,null,"General",null,null,0,0,0,0,0,0,0,0,0,0,0,0,0,0]
["%,FACCOUNT,V282100",237,null,null,"Total",null,null,0,0,0,0,0,0,0,0,0,0,0,0,0,0]
[null,238]
[null,239,282100,"Accum Deferred Income Taxes - State"]
[null,240,null,null,"Production",null,null,-700755.31,-700755.31,-700755.31,-700755.31,-700755.31,-700755.31,-700755.31,-700755.31,-700755.31,-700755.31,-700755.31,-700755.31,-700755.31,{"$f":"((H255/2)+SUM(I255:S255)+(T255/2))/12","v":-700755.31000000017}]
["%,FACCOUNT,V282108,V282006,V282008",241,null,null,"Distribution - Wyoming",null,null,0,0,0,0,0,0,0,0,0,0,0,0,0,0]
[null,242,null,null,"Distribution - Utah",null,null,0,0,0,0,0,0,0,0,0,0,0,0,0,0]
[null,243,null,null,"General",null,null,0,0,0,0,0,0,0,0,0,0,0,0,0,0]
[null,244,null,null,"Total",null,null,0,0,0,0,0,0,0,0,0,0,0,0,0,0]
[null,245]
[null,246,"282_108_008","Accum Deferred IncomeTaxes - Sec 29 Cr","Deferred Fed & State Taxes-QRS Transf"]
[null,247,null,"General",null,null,null,0,0,0,0,0,0,0,0,0,0,0,0,0,{"$f":"((H262/2)+SUM(I262:S262)+(T262/2))/12","v":0}]
[null,248,null,"Total",null,null,null,0,0,0,0,0,0,0,0,0,0,0,0,0,{"$f":"SUM(U262)","v":0}]
[null,249]
[null,250,"System Working Capital (W/O WC Cash)"]
[null,251,null,"Production",null,null,null,40379195.689999998,44662206.689999998,7946012.6899999995,16383969.689999999,29104815.690000001,40379195.689999998,44662206.689999998,22976607.050000004,9358288.5,7946012.9700000007,16383969.749999998,29104815.840000004,40379195.689999998,{"$f":"U205+U213+U220+U241+U248+U255","v":24823278.621249985}]
[null,252,null,"Distribution - Wyoming",null,null,null,-14447677.929280013,-14699059.192803029,-14296377.111672996,-14276063.953632006,-14379352.966921005,-14447677.929280013,-14699059.192803029,-8103097.6190860374,-8110647.031142503,-8111618.2149728974,-8303498.2137304833,-8362490.6215181109,-14447677.929280013,{"$f":"U200+U214+U221+U227+U242+U249+U256+U232","v":-306649.09587083594}]
[null,253,null,"Distribution - Utah",null,null,null,-478445142.65071994,-491476442.82719702,-464923359.98832697,-468570209.88636804,-471095957.24307895,-478445142.65071994,-491476442.82719702,-308045374.11091399,-308264163.40885746,-308478221.27502716,-314107862.34626949,-316045761.89848191,-478445142.65071994,{"$f":"U201+U215+U222+U228+U243+U250+U257+U233","v":4181291.572537506}]
[null,254,null,"General",null,null,null,-9343596.3599999994,-9646246.209999999,-12109124.299999999,-10678810.029999999,-9335041.1799999997,-9343596.3599999994,-9646246.209999999,60912263.75,57839082.799999997,60590598.950000003,60084872.850000001,60757556.659999996,-9343596.3599999994,{"$f":"U209+U216+U223+U237+U244+U251+U258+U262","v":19945594.357499994}]
[null,255]
[null,256]
[null,257,null,"System Working Capital (W/O WC Cash)",null,null,null,-468549002.5,-468501233.09000003,-487013044.74000007,-484516736.92000008,-473864217.55000001,-468549002.5,-468501233.09000003,-232259600.92999998,-249177439.14000008,-248053227.56999993,-245942517.95999998,-234545880.02000001,-468549002.5,{"$f":"U202+U206+U210+U217+U224+U229+U238+U245+U252+U259+U263+U234","v":57255327.223749973}]
[null,{"$f":"+B272+1","v":258}]
[null,259,"RATE BASE (W/O Working Cap. Cash)"]
[null,260,null,"Production",null,null,null,{"$f":"+H148+H166+H173+H206+H241+H248+H255","v":44327629.679999992},{"$f":"+I148+I166+I173+I206+I241+I248+I255","v":36690671.479999982},{"$f":"+J148+J166+J173+J206+J241+J248+J255","v":56933759.349999979},57596761.409999982,47730378.279999979,40162633.169999979,29172668.749999981,18889877.449999981,2502587.9299999797,1028339.1199999792,2977264.0799999782,13298029.559999974,26878304.069999974,{"$f":"((H275/2)+SUM(I275:S275)+(T275/2))/12","v":28548828.121249985}]
[null,261,null,"Distribution - Wyoming",null,null,null,0,0,0,0,0,0,0,0,0,0,0,0,0,0]
[null,262,null,"Distribution - Utah",null,null,null,0,0,0,0,0,0,0,0,0,0,0,0,0,0]
["%,FACCOUNT,TQGCACCTS,N164",263,null,"General",null,null,null,0,0,0,0,0,0,0,0,0,0,0,0,0,0]
[null,264,null,null,null,null,null,0,0,0,0,0,0,0,0,0,0,0,0,0,0]
[null,265]
[null,266,null,"RATE BASE (W/O Working Cap. Cash)",null,null,null,0,0,0,0,0,0,0,0,0,0,0,0,0,0]
[null,267]
[null,268,1641,"Gas Stored Underground  (DTH)"]
[null,269,null,null,"Production (DTH)",null,null,-9013015,-10000594,-14408853,-14551397,-12326024,-10305617,-8741403,-6249154,-3981403,93561,-41345,-630942,-6908613,{"$f":"((H284/2)+SUM(I284:S284)+(T284/2))/12","v":-7425332.083333333}]
[null,270,null,null,"Total (DTH)",null,null,-9013015,-10000594,-14408853,-14551397,-12326024,-10305617,-8741403,-6249154,-3981403,93561,-41345,-630942,-6908613,{"$f":"((H285/2)+SUM(I285:S285)+(T285/2))/12","v":-7425332.083333333}]

{"sheet":"RevRun Fcst","index":44,"n_rows":419,"n_cols":20,"rows_kept":419,"cut":false,"hidden":false,"merged":[]}
[]
[]
[null,null,null,"TEMPERATURE ADJUSTED INPUT DATA FROM REVRUN SYSTEM"]
[null,null,null,"08/06/19"]
[]
[]
[null,null,null," ",null,null,null,null,null,null,null,null,null,null,null,null,null,null,null,"12-Month"]
[null,"Rate Class",null,"Description",null,null,null,"Oct19","Nov19","Dec19","Jan20","Feb20","Mar20","Apr20","May20","Jun20","Jul20","Aug20","Sep20","Total"]
[]
[null,"UTILITY OPERATING REVENUE"]
[null,"TARIFF DTH SALES AND REVENUE"]
[]
[13,"Utah",null,null,null,null,1,10,11,12,1,2,3,4,5,6,7,8,9]
[14,null,"GS","Distribution Non-Gas Rev",null,null,2,17246248.880000003,32788119.359999996,47033088.970000006,50074020.669999994,43660955.460000001,36240836.960000001,21034573.370000001,15955785.580000002,12678934.83,11752135.08,11448874.390000001,11980737.870000001,311894311.42000002]
[15,null,null,null,null,null,3]
[16,null,null,"Supplier Non-Gas Revenue",null,null,4,3386638.71,13522558.52,21410546.199999999,23099743.259999998,19490647.34,15361826.09,4714678.24,2864367.98,1677334.4100000001,1347941.41,1234116.51,1423872.63,109534271.3]
[17,null,null,null,null,null,5]
[18,null,null,"Commodity Revenue",null,null,6,20342678.940000001,38137076.359999999,60383220.710000001,65147188.780000001,54968614.480000004,43324281.700000003,28319875.329999998,17205531.27,10075321.970000001,8096741.8599999994,7413024.5999999996,8552841.4000000004,361966397.39999998]
[19,null,null,"Total Revenue",null,null,7,40975566.530000001,84447754.239999995,128826855.88,138320952.70999998,118120217.28,94926944.75,54069126.939999998,36025684.829999998,24431591.210000001,21196818.350000001,20096015.5,21957451.899999999,783394980.12]
[20,null,null,"# of Customers",null,null,8,1043993,1048260,1053238,1058287,1059912,1062554,1062832,1063564,1063866,1061844,1063412,1064284,1058837.1666666667]
[21,null,null,"Total Dth",null,null,9,6191522,11607446,18378309,19828276,16730313,13186230,8619471,5236696,3066537,2464334,2256237,2603153,110168524]
[22,null,null,null,null,null,10]
[23,null,"GS-C","Distribution Non-Gas Rev",null,null,11,null,null,null,null,null,null,null,null,null,null,null,null,0]
[24,null,null,null,null,null,12]
[25,null,null,"Supplier Non-Gas Revenue",null,null,13,null,null,null,null,null,null,null,null,null,null,null,null,0]
[26,null,null,null,null,null,14]
[27,null,null,"Commodity Revenue",null,null,15,null,null,null,null,null,null,null,null,null,null,null,null,0]
[28,null,null,"Total Revenue",null,null,16,null,null,null,null,null,null,null,null,null,null,null,null,0]
[29,null,null,"# of Customers",null,null,17]
[30,null,null,"Total Dth",null,null,18,null,null,null,null,null,null,null,null,null,null,null,null,0]
[31,null,null,null,null,null,19]
[32,null,"GSS","Distribution Non-Gas Rev",null,null,20,0,0,0,0,0,0,0,0,0,0,0,0,0]
[33,null,null,null,null,null,21,0,0,0,0,0,0,0,0,0,0,0,0]
[34,null,null,"Supplier Non-Gas Revenue",null,null,22,0,0,0,0,0,0,0,0,0,0,0,0,0]
[35,null,null,null,null,null,23,0,0,0,0,0,0,0,0,0,0,0,0]
[36,null,null,"Commodity Revenue",null,null,24,0,0,0,0,0,0,0,0,0,0,0,0,0]
[37,null,null,"Total Revenue",null,null,25,0,0,0,0,0,0,0,0,0,0,0,0,0]
[38,null,null,"# of Customers",null,null,26,0,0,0,0,0,0,0,0,0,0,0,0,0]
[39,null,null,"Total Dth",null,null,27,0,0,0,0,0,0,0,0,0,0,0,0,0]
[40,null,null,null,null,null,28]
[41,null,"F-S","Distribution Non-Gas Rev",null,null,29,146380.22,264184.73,290373.00999999989,337168.55,316625.34999999998,282565.46999999997,158198.03,147751.53999999998,151024.63,124201.13,117161.80000000002,123224.11000000002,2458858.5699999994]
[42,null,null,null,null,null,30]
[43,null,null,"Supplier Non-Gas Revenue",null,null,31,114668.89000000001,268426.52,325417.08999999997,402778.2,368635.15,312655.56,150164.04999999999,127282.79999999999,124117.43,83047.42,75096.51999999999,81733.039999999994,2434022.6700000004]
[44,null,null,null,null,null,32]
[45,null,null,"Commodity Revenue",null,null,33,688786.89,777267.29,942291.62,1166301.7799999998,1067435.69,905338.82000000007,901997.39000000013,764555.41999999993,745541.84000000008,498844.79999999993,451085.76,490949.57999999996,9400396.8800000008]
[46,null,null,"Total Revenue",null,null,34,949836,1309878.54,1558081.7199999997,1906248.5299999998,1752696.19,1500559.85,1210359.4700000002,1039589.7599999999,1020683.9000000001,706093.34999999986,643344.08000000007,695906.73,14293278.119999999]
[47,null,null,"# of Customers",null,null,35,459,459,459,459,459,459,459,459,459,426,426,426,450.75]
[48,null,null,"Total Dth",null,null,36,209640,236570,286797,354977,324886,275550,274533,232701,226914,151829,137293,149426,2861116]
[49,null,null,null,null,null,37]
[50,null,"F-3","Distribution Non-Gas Rev",null,null,38,0,0,0,0,0,0,0,0,0,0,0,0,0]
[51,null,null,"Supplier Non-Gas Revenue",null,null,39]
[52,null,null,"Supplier Non-Gas Demand Revenue",null,null,40,0,0,0,0,0,0,0,0,0,0,0,0,0]
[53,null,null,"Commodity Tariff Revenue",null,null,41]
[54,null,null,"Commodity Demand Revenue",null,null,42,0,0,0,0,0,0,0,0,0,0,0,0,0]
[55,null,null,"Total Revenue",null,null,43,0,0,0,0,0,0,0,0,0,0,0,0,0]
[56,null,null,"# of Customers",null,null,44,0,0,0,0,0,0,0,0,0,0,0,0,0]
[57,null,null,"Total Sales Dth",null,null,45,0,0,0,0,0,0,0,0,0,0,0,0,0]
[58,null,null,null,null,null,46]
[59,null,"NGV","Distribution Non-Gas Rev",null,null,47,150991.48000000001,146113.89000000001,132681.67000000001,121430.53,137716.4,129897.18000000002,127313.82,139526.64000000001,144687.07,136195.29999999999,154234.81999999998,138099.81999999998,1658888.6200000006]
[60,null,null,null,null,null,48]
[61,null,null,"Supplier Non-Gas Revenue",null,null,49,20194.810000000001,19542.45,17745.91,16241.1,18419.3,17373.490000000002,17027.97,18661.41,19351.61,18215.849999999999,20628.61,18470.580000000002,221873.09000000003]
[62,null,null,null,null,null,50]
[63,null,null,"Commodity Revenue",null,null,51,78925.960000000006,76376.36,69355.100000000006,63473.93,71986.84,67899.59,66549.22,72933.08,75630.539999999994,71191.73,80621.320000000007,72187.259999999995,867130.92999999993]
[64,null,null,"Total Revenue",null,null,52,250112.25,242032.7,219782.68000000002,201145.56,228122.53999999998,215170.26,210891.01,231121.13,239669.21999999997,225602.88,255484.75,228757.65999999997,2747892.64]
[65,null,null,"# of Customers",null,null,53,1,1,1,1,1,1,1,1,1,1,1,1,1]
[66,null,null,"Total Dth",null,null,54,24022,23246,21109,19319,21910,20666,20255,22198,23019,21668,24538,21971,263921]
[67,null,null,null,null,null,55]
[68,null,"F-4","Distribution Non-Gas Rev",null,null,56,0,0,0,0,0,0,0,0,0,0,0,0,0]
[69,null,null,null,null,null,57]
[70,null,null,"Supplier Non-Gas Revenue",null,null,58,0,0,0,0,0,0,0,0,0,0,0,0,0]
[71,null,null,null,null,null,59]
[72,null,null,"Commodity Revenue",null,null,60,0,0,0,0,0,0,0,0,0,0,0,0,0]
[73,null,null,"Total Revenue",null,null,61,0,0,0,0,0,0,0,0,0,0,0,0,0]
[74,null,null,"# of Customers",null,null,62,0,0,0,0,0,0,0,0,0,0,0,0,0]
[75,null,null,"Total Dth",null,null,63,0,0,0,0,0,0,0,0,0,0,0,0,0]
[76,null,null,null,null,null,64]
[77,null,"I-2","Distribution Non-Gas Rev",null,null,65,0,0,0,0,0,0,0,0,0,0,0,0,0]
[78,null,null,null,null,null,66]
[79,null,null,"Supplier Non-Gas Revenue",null,null,67,0,0,0,0,0,0,0,0,0,0,0,0,0]
[80,null,null,null,null,null,68]
[81,null,null,"Commodity Revenue",null,null,69,0,0,0,0,0,0,0,0,0,0,0,0,0]
[82,null,null,"Total Revenue",null,null,70,0,0,0,0,0,0,0,0,0,0,0,0,0]
[83,null,null,"# of Customers",null,null,71]
[84,null,null,"Total Dth",null,null,72,0,0,0,0,0,0,0,0,0,0,0,0,0]
[85,null,null,null,null,null,73]
[104,null,"ISE","Distribution Non-Gas Rev",null,null,74,0,0,0,0,0,0,0,0,0,0,0,0,0]
[105,null,null,null,null,null,75]
[106,null,null,"Supplier Non-Gas Revenue",null,null,76,0,0,0,0,0,0,0,0,0,0,0,0,0]
[107,null,null,null,null,null,77]
[108,null,null,"Commodity Revenue",null,null,78,0,0,0,0,0,0,0,0,0,0,0,0,0]
[109,null,null,"Total Revenue",null,null,79,0,0,0,0,0,0,0,0,0,0,0,0,0]
[110,null,null,"# of Customers",null,null,80,0,0,0,0,0,0,0,0,0,0,0,0,0]
[111,null,null,"Total Dth",null,null,81,0,0,0,0,0,0,0,0,0,0,0,0,0]
[112,null,null,null,null,null,82]
[86,null,"IS","Distribution Non-Gas Rev",null,null,83,10291.269999999999,11426,13526.689999999999,13059.35,11521.679999999998,11975.249999999998,11155.120000000003,10150.780000000001,10260.5,8654.3100000000013,9182.3399999999983,9918.7400000000016,131122.02999999997]
[87,null,null,null,null,null,84]
[88,null,null,"Supplier Non-Gas Revenue",null,null,85,1517.08,2118.94,3336.25,3060.3100000000004,2173.02,2431.59,1966.01,1485.21,1510.1,1145.69,1265.49,1432.56,23442.25]
[89,null,null,null,null,null,86]
[90,null,null,"Commodity Revenue",null,null,87,27835.35,38878.15,61213.45,56150.39,39870.39,44614.75,36072.269999999997,27250.52,27707.21,21021.08,23219.119999999999,26284.560000000001,430117.24000000005]
[91,null,null,"Total Revenue",null,null,88,39643.699999999997,52423.090000000004,78076.39,72270.05,53565.09,59021.59,49193.4,38886.51,39477.81,30821.08,33666.949999999997,37635.86,584681.5199999999]
[92,null,null,"# of Customers",null,null,89,18,18,18,18,18,18,18,18,18,18,18,18,18]
[93,null,null,"Total Dth",null,null,90,8472,11833,18631,17090,12135,13579,10979,8294,8433,6398,7067,8000,130911]
[94,null,null,null,null,null,91]
[95,null,"IS-2","Distribution Non-Gas Rev",null,null,92,0,0,0,0,0,0,0,0,0,0,0,0,0]
[96,null,null,null,null,null,93]
[97,null,null,"Supplier Non-Gas Revenue",null,null,94,0,0,0,0,0,0,0,0,0,0,0,0,0]
[98,null,null,null,null,null,95]
[99,null,null,"Commodity Revenue",null,null,96,0,0,0,0,0,0,0,0,0,0,0,0,0]
[100,null,null,"Total Revenue",null,null,97,0,0,0,0,0,0,0,0,0,0,0,0,0]
[101,null,null,"# of Customers",null,null,98,0,0,0,0,0,0,0,0,0,0,0,0,0]
[102,null,null,"Total Dth",null,null,99,0,0,0,0,0,0,0,0,0,0,0,0,0]
[103,null,null,null,null,null,100,0,0,0,0,0,0,0,0,0,0,0,0]
[113,null,"FT-1L","Distribution Non-Gas Rev",null,null,101,0,0,0,0,0,0,0,0,0,0,0,0,0]
[114,null,null,null,null,null,102,0,0,0,0,0,0,0,0,0,0,0,0]
[115,null,null,"Supplier Non-Gas Revenue",null,null,103,0,0,0,0,0,0,0,0,0,0,0,0,0]
[116,null,null,null,null,null,104,0,0,0,0,0,0,0,0,0,0,0,0]
[117,null,null,"Commodity Revenue",null,null,105,0,0,0,0,0,0,0,0,0,0,0,0,0]
[118,null,null,"Total Revenue",null,null,106,0,0,0,0,0,0,0,0,0,0,0,0,0]
[119,null,null,"# of Customers",null,null,107,0,0,0,0,0,0,0,0,0,0,0,0,0]
[120,null,null,"Total Dth",null,null,108,0,0,0,0,0,0,0,0,0,0,0,0,0]
[121,null,null,null,null,null,109]
[122,null,"FT-1","Distribution Non-Gas Rev",null,null,110,88866.290000000008,95706.74000000002,100986.46999999999,101585.93,99227.160000000018,93992.849999999977,89846.219999999987,84160.999999999985,109920.69000000003,168490.78000000003,176443.75,93076.4,1302304.2799999998]
[123,null,null,null,null,null,111]
[124,null,null,"Supplier Non-Gas Revenue",null,null,112,0,0,0,0,0,0,0,0,0,0,0,0,0]
[125,null,null,null,null,null,113]
[126,null,null,"Commodity Revenue",null,null,114,0,0,0,0,0,0,0,0,0,0,0,0,0]
[127,null,null,"Total Revenue",null,null,115,88866.290000000008,95706.74000000002,100986.46999999999,101585.93,99227.160000000018,93992.849999999977,89846.219999999987,84160.999999999985,109920.69000000003,168490.78000000003,176443.75,93076.4,1302304.2799999998]
[128,null,null,"# of Customers",null,null,116,6,6,6,6,6,6,6,6,6,6,6,6,6]
[129,null,null,"Total Dth",null,null,117,94554,121035,141743,143429,134312,114052,98009,76724,175271,481847,514440,110439,2205855]
[130,null,null,null,null,null,118]
[131,null,"FT-2","Distribution Non-Gas Rev",null,null,119,0,0,0,0,0,0,0,0,0,0,0,0,0]
[132,null,null,null,null,null,120,0,0,0,0,0,0,0,0,0,0,0,0]
[133,null,null,"Supplier Non-Gas Revenue",null,null,121,0,0,0,0,0,0,0,0,0,0,0,0,0]
[134,null,null,null,null,null,122,0,0,0,0,0,0,0,0,0,0,0,0]
[135,null,null,"Commodity Revenue",null,null,123,0,0,0,0,0,0,0,0,0,0,0,0,0]
[136,null,null,"Total Revenue",null,null,124,0,0,0,0,0,0,0,0,0,0,0,0,0]
[137,null,null,"# of Customers",null,null,125,0,0,0,0,0,0,0,0,0,0,0,0,0]
[138,null,null,"Total Dth",null,null,126,0,0,0,0,0,0,0,0,0,0,0,0,0]
[139,null,null,null,null,null,127]
[140,null,"MT","Distribution Non-Gas Rev",null,null,128,1708.59,2968.79,4301.9400000000005,3567.6899999999996,3677.1,3129.2599999999998,1800.17,1406.3000000000002,1125.9099999999999,1118.5999999999999,1111.31,1147.78,27063.439999999999]
[141,null,null,null,null,null,129]
[142,null,null,"Supplier Non-Gas Revenue",null,null,130,0,0,0,0,0,0,0,0,0,0,0,0,0]
[143,null,null,null,null,null,131]
[144,null,null,"Commodity Revenue",null,null,132,0,0,0,0,0,0,0,0,0,0,0,0,0]
[145,null,null,"Total Revenue",null,null,133,1708.59,2968.79,4301.9400000000005,3567.6899999999996,3677.1,3129.2599999999998,1800.17,1406.3000000000002,1125.9099999999999,1118.5999999999999,1111.31,1147.78,27063.439999999999]
[146,null,null,"# of Customers",null,null,134,1,1,1,1,1,1,1,1,1,1,1,1,1]
[147,null,null,"Total Dth",null,null,135,1127,2682,4327,3421,3556,2880,1240,754,408,399,390,435,21619]
[148,null,null,null,null,null,136]
[149,null,"FT-E","Distribution Non-Gas Rev",null,null,137,218706,218706,218706,218706,218706,218706,218706,218706,218706,218706,218706,218706,2624472]
[150,null,null,null,null,null,138]
[151,null,null,"Supplier Non-Gas Revenue",null,null,139,0,0,0,0,0,0,0,0,0,0,0,0,0]
[152,null,null,null,null,null,140]
[153,null,null,"Commodity Revenue",null,null,141,0,0,0,0,0,0,0,0,0,0,0,0,0]
[154,null,null,"Total Revenue",null,null,142,218706,218706,218706,218706,218706,218706,218706,218706,218706,218706,218706,218706,2624472]
[155,null,null,"# of Customers",null,null,143,1,1,1,1,1,1,1,1,1,1,1,1,1]
[156,null,null,"Total Dth",null,null,144,2404691,2511695,3183872,3298393,2557039,2198346,2499361,2421039,2816791,3688270,3664352,2756063,33999912]
[157,null,null,null,null,null,145]
[158,null,"TS","Distribution Non-Gas Rev",null,null,146,2126223.5199999996,2234792.96,2342249.0399999996,2358791.1399999992,2242161.6899999995,2206278.1799999997,2102606.8799999994,2046681.7900000005,2008851.7800000003,2146044.9700000007,2160381.3000000003,2131606.69,26106669.939999998]
[159,null,null,null,null,null,147]
[160,null,null,"Supplier Non-Gas Revenue",null,null,148,0,0,0,0,0,0,0,0,0,0,0,0,0]
[161,null,null,null,null,null,149]
[162,null,null,"Commodity Revenue",null,null,150,0,0,0,0,0,0,0,0,0,0,0,0,0]
[163,null,null,"Total Revenue",null,null,151,2126223.5199999996,2234792.96,2342249.0399999996,2358791.1399999992,2242161.6899999995,2206278.1799999997,2102606.8799999994,2046681.7900000005,2008851.7800000003,2146044.9700000007,2160381.3000000003,2131606.69,26106669.939999998]
[164,null,null,"# of Customers",null,null,152,1095,1095,1095,1095,1095,1095,1095,1095,1095,1238,1238,1238,1130.75]
[165,null,null,"Total Dth",null,null,153,4424820,5051675,5702200,5862963,5104274,4920234,4325041,4016624,3758895,3942739,4032941,3856935,54999341]
[166,null,null,null,null,null,154]
[167,null,"TSE","Distribution Non-Gas Rev",null,null,155,0,0,0,0,0,0,0,0,0,0,0,0,0]
[168,null,null,null,null,null,156,0,0,0,0,0,0,0,0,0,0,0,0]
[169,null,null,"Supplier Non-Gas Revenue",null,null,157,0,0,0,0,0,0,0,0,0,0,0,0,0]
[170,null,null,null,null,null,158,0,0,0,0,0,0,0,0,0,0,0,0]
[171,null,null,"Commodity Revenue",null,null,159,0,0,0,0,0,0,0,0,0,0,0,0,0]
[172,null,null,"Total Revenue",null,null,160,0,0,0,0,0,0,0,0,0,0,0,0,0]
[173,null,null,"# of Customers",null,null,161,0,0,0,0,0,0,0,0,0,0,0,0,0]
[174,null,null,"Total Dth",null,null,162,0,0,0,0,0,0,0,0,0,0,0,0,0]
[175,null,null,null,null,null,163]
[176,null,"FT-2C","Distribution Non-Gas Rev",null,null,164,null,null,null,null,null,null,null,null,null,null,null,null,0]
[177,null,null,null,null,null,165]
[178,null,null,"Supplier Non-Gas Revenue",null,null,166,null,null,null,null,null,null,null,null,null,null,null,null,0]
[179,null,null,null,null,null,167]
[180,null,null,"Commodity Revenue",null,null,168,null,null,null,null,null,null,null,null,null,null,null,null,0]
[181,null,null,"Total Revenue",null,null,169,null,null,null,null,null,null,null,null,null,null,null,null,0]
[182,null,null,"# of Customers",null,null,170,0,0,0,0,0,0,0,0,0,0,0,0,0]
[183,null,null,"Total Dth",null,null,171,null,null,null,null,null,null,null,null,null,null,null,null,0]
[184,null,null,null,null,null,172]
[185,null,"E-1","Distribution Non-Gas Rev",null,null,173,0,0,0,0,0,0,0,0,0,0,0,0,0]
[186,null,null,null,null,null,174,0,0,0,0,0,0,0,0,0,0,0,0]
[187,null,null,"Supplier Non-Gas Revenue",null,null,175,0,0,0,0,0,0,0,0,0,0,0,0,0]
[188,null,null,null,null,null,176,0,0,0,0,0,0,0,0,0,0,0,0]
[189,null,null,"Commodity Revenue",null,null,177,0,0,0,0,0,0,0,0,0,0,0,0,0]
[190,null,null,"Total Revenue",null,null,178,0,0,0,0,0,0,0,0,0,0,0,0,0]
[191,null,null,"# of Customers",null,null,179,0,0,0,0,0,0,0,0,0,0,0,0,0]
[192,null,null,"Total Dth",null,null,180,0,0,0,0,0,0,0,0,0,0,0,0,0]
[193,null,null,null,null,null,181]
[194,null,"CET","Distribution Non-Gas Revenue",null,null,182]
[195,null,"DSM","Distribution Non-Gas Rev",null,null,183]
[196,null,null,null,null,null,184,null,null,null,null,null,null,null,null,null,null,null,null,0]
[197,null,"Utah Totals",null,null,null,185]
[198,null,null,"Distribution Non-Gas Rev",null,null,186,19989416.25,35762018.469999991,50135913.789999999,53228329.859999992,46690590.839999996,39187381.149999999,23744199.610000003,18604169.630000003,15323511.41,14555546.170000002,14286095.710000003,14696517.41,346203690.30000001]
[199,null,null,"Supplier Non-Gas Revenue",null,null,187,3523019.49,13812646.43,21757045.449999999,23521822.869999997,19879874.809999999,15694286.73,4883836.2700000005,3011797.4,1822313.55,1450350.3699999999,1331107.1299999999,1525508.8099999998,112213609.31]
[200,null,null,"Commodity Revenue",null,null,188,21138227.140000001,39029598.159999996,61456080.880000003,66433114.880000003,56147907.400000006,44342134.859999999,29324494.209999997,18070270.289999999,10924201.560000001,8687799.4699999988,7967950.7999999998,9142262.8000000007,372664042.44999999]
[201,null,null,"Total Utah Revenue",null,null,189,44650662.880000003,88604263.059999987,133349040.12,143183267.60999998,122718373.05,99223802.739999995,57952530.090000004,39686237.32,28070026.520000003,24693696.009999998,23585153.640000004,25364289.020000003,831081342.05999994]
[202,null,null,"# of Customers",null,null,190,1045574,1049841,1054819,1059868,1061493,1064135,1064413,1065145,1065447,1063535,1065103,1065975,1060445.6666666667]
[203,null,null,"Sales Dth",null,null,191,6433656,11879095,18704846,20219662,17089244,13496025,8925238,5499889,3324903,2644229,2425135,2782550,113424472]
[204,null,null,"Transportation Dth",null,null,192,6925192,7687087,9032142,9308206,7799181,7235512,6923651,6515141,6751365,8113255,8212123,6723872,91226727]
[205,null,null,"Total Utah Dth",null,null,193,13358848,19566182,27736988,29527868,24888425,20731537,15848889,12015030,10076268,10757484,10637258,9506422,204651199]
[206,null,null,null,null,null,194]
[207,"Idaho",null,null,null,null,195]
[208,null,"GS-1","Distribution Non-Gas Rev",null,null,196,0,0,0,0,0,0,0,0,0,0,0,0,0]
[209,null,null,null,null,null,197,0,0,0,0,0,0,0,0,0,0,0,0]
[210,null,null,"Supplier Non-Gas Revenue",null,null,198,0,0,0,0,0,0,0,0,0,0,0,0,0]
[211,null,null,null,null,null,199,0,0,0,0,0,0,0,0,0,0,0,0]
[212,null,null,"Commodity Revenue",null,null,200,0,0,0,0,0,0,0,0,0,0,0,0,0]
[213,null,null,"Total Revenue",null,null,201,0,0,0,0,0,0,0,0,0,0,0,0,0]
[214,null,null,"# of Customers",null,null,202,0,0,0,0,0,0,0,0,0,0,0,0,0]
[215,null,null,"Total Dth",null,null,203,0,0,0,0,0,0,0,0,0,0,0,0,0]
[216,null,null,null,null,null,204,0,0,0,0,0,0,0,0,0,0,0,0]
[217,null,"I-2","Distribution Non-Gas Rev",null,null,205,0,0,0,0,0,0,0,0,0,0,0,0,0]
[218,null,null,null,null,null,206,0,0,0,0,0,0,0,0,0,0,0,0]
[219,null,null,"Supplier Non-Gas Revenue",null,null,207,0,0,0,0,0,0,0,0,0,0,0,0,0]
[220,null,null,null,null,null,208,0,0,0,0,0,0,0,0,0,0,0,0]
[221,null,null,"Commodity Revenue",null,null,209,0,0,0,0,0,0,0,0,0,0,0,0,0]
[222,null,null,"Total Revenue",null,null,210,0,0,0,0,0,0,0,0,0,0,0,0,0]
[223,null,null,"# of Customers",null,null,211,0,0,0,0,0,0,0,0,0,0,0,0,0]
[224,null,null,"Total Dth",null,null,212,0,0,0,0,0,0,0,0,0,0,0,0,0]
[225,null,null,null,null,null,213]
[226,null,"Idaho Totals",null,null,null,214]
[227,null,null,"Distribution Non-Gas Rev",null,null,215,0,0,0,0,0,0,0,0,0,0,0,0,0]
[228,null,null,"Supplier Non-Gas Revenue",null,null,216,0,0,0,0,0,0,0,0,0,0,0,0,0]
[229,null,null,"Commodity Revenue",null,null,217,0,0,0,0,0,0,0,0,0,0,0,0,0]
[230,null,null,"Total Idaho Revenue",null,null,218,0,0,0,0,0,0,0,0,0,0,0,0,0]
[231,null,null,"# of Customers",null,null,219,0,0,0,0,0,0,0,0,0,0,0,0,0]
[232,null,null,"Sales Dth",null,null,220,0,0,0,0,0,0,0,0,0,0,0,0,0]
[233,null,null,"Transportation Dth",null,null,221,0,0,0,0,0,0,0,0,0,0,0,0,0]
[234,null,null,"Total Idaho Dth",null,null,222,0,0,0,0,0,0,0,0,0,0,0,0,0]
[235,null,null,null,null,null,223]
[236,"Wyoming",null,null,null,null,224]
[237,null,"GS-1","Distribution Non-Gas Rev",null,null,225,805973.39999999991,1140429.3099999998,1458105.71,1535903.62,1406171.76,1247076.5499999998,1006681.9399999998,777127.94000000006,573370.28,481530.97000000003,473790.81999999989,540344.79,11446507.09]
[238,null,null,null,null,null,226]
[239,null,null,null,null,null,227,0,0,0,0,0,0,0,0,0,0,0,0,0]
[240,null,null,null,null,null,228]
[241,null,null,"Commodity Revenue",null,null,229,967531.62,1693819.35,2386830.44,2556743.33,2272804.65,1925447.79,1402156.58,903860.39,462210.39,263494.07,246767.82,390647.81999999995,15472314.250000002]
[242,null,null,"Total Revenue",null,null,230,1773505.02,2834248.66,3844936.15,4092646.95,3678976.41,3172524.34,2408838.52,1680988.33,1035580.67,745025.04,720558.6399999999,930992.61,26918821.340000004]
[243,null,null,"# of Customers",null,null,231,27737,27746,27751,27765,27767,27770,27774,27777,27784,27780,27779,27786,27768]
[244,null,null,"Total Dth",null,null,232,225596,394942,556529,596147,529942,448950,326936,210750,107772,61438,57538,91086,3607626]
[245,null,null,null,null,null,233]
[246,null,"FS","Distribution Non-Gas Rev",null,null,234,15845.56,14761.980000000001,17579.07,17667.78,15997.669999999996,14362.880000000001,13061.01,12899.18,9317.5499999999993,8637.19,9342.8700000000008,10983.71,160456.44999999998]
[247,null,null,null,null,null,235]
[248,null,null,"Supplier Non-Gas Revenue",null,null,236,0,0,0,0,0,0,0,0,0,0,0,0,0]
[249,null,null,null,null,null,237]
[250,null,null,"Commodity Revenue",null,null,238,77614.05,71399.61,90797.760000000009,91338.15,81263.8,71554.010000000009,63924.270000000004,62980.74,40987.86,37265.21,41125.11,50165.86,780416.42999999993]
[251,null,null,"Total Revenue",null,null,239,93459.61,86161.59,108376.83000000002,109005.93,97261.47,85916.890000000014,76985.279999999999,75879.92,50305.41,45902.400000000001,50467.98,61149.57,940872.88000000012]
[252,null,null,"# of Customers",null,null,240,26,26,26,26,26,26,26,26,26,26,26,26,26]
[253,null,null,"Total Dth",null,null,241,18097,16648,21171,21297,18948,16684,14905,14685,9557,8689,9589,11697,181967]
[254,null,null,null,null,null,242]
[255,null,"NGV","Distribution Non-Gas Rev",null,null,243,2318.46,3520.619999999999,1466.38,1347.48,1598.4799999999998,1961.78,2199.5599999999995,1948.5599999999997,2648.73,2232.59,2635.52,2476.98,26355.14]
[256,null,null,null,null,null,244]
[257,null,null,null,null,null,245,0,0,0,0,0,0,0,0,0,0,0,0,0]
[258,null,null,null,null,null,246]
[259,null,null,"Commodity Revenue",null,null,247,1505.36,2285.92,952.11,874.91,1037.8800000000001,1273.77,1428.16,1265.19,1719.8,1449.61,1711.22,1608.29,17112.219999999998]
[260,null,null,"Total Revenue",null,null,248,3823.8199999999997,5806.5399999999991,2418.4900000000002,2222.39,2636.3599999999997,3235.55,3627.7199999999993,3213.75,4368.53,3682.2,4346.74,4085.27,43467.359999999986]
[261,null,null,"# of Customers",null,null,249,1,1,1,1,1,1,1,1,1,1,1,1,1]
[262,null,null,"Total Dth",null,null,250,351,533,222,204,242,297,333,295,401,338,399,375,3990]
[263,null,null,null,null,null,251]
[264,null,"GSW","Distribution Non-Gas Rev",null,null,252,0,0,0,0,0,0,0,0,0,0,0,0,0]
[265,null,null,null,null,null,253]
[266,null,null,null,null,null,254]
[267,null,null,null,null,null,255]
[268,null,null,"Commodity Revenue",null,null,256,0,0,0,0,0,0,0,0,0,0,0,0,0]
[269,null,null,"Total Revenue",null,null,257,0,0,0,0,0,0,0,0,0,0,0,0,0]
[270,null,null,"# of Customers",null,null,258,0,0,0,0,0,0,0,0,0,0,0,0,0]
[271,null,null,"Total Dth",null,null,259,0,0,0,0,0,0,0,0,0,0,0,0,0]
[272,null,null,null,null,null,260]
[273,null,"IS","Distribution Non-Gas Rev",null,null,261,3734.5899999999997,5252.63,5166.1399999999994,5705.17,5402.42,5433.84,5083.5199999999995,4263.72,3523.19,3051.7999999999997,2584.06,2855.12,52056.200000000004]
[274,null,null,null,null,null,262]
[275,null,null,"Supplier Non-Gas Revenue",null,null,263,1574.03,2708.3,2643.6800000000003,3046.45,2820.24,2843.71,2581.94,1969.3999999999999,1416.08,1063.8600000000001,714.3599999999999,916.91000000000008,24298.960000000003]
[276,null,null,null,null,null,264]
[277,null,null,"Commodity Revenue",null,null,265,37393.870000000003,64340.280000000006,62804.899999999994,72373.17,66999.31,67556.860000000015,61338.130000000005,46786.31,33641.19,25273.78,16970.7,21782.71,577261.21]
[278,null,null,"Total Revenue",null,null,266,42702.490000000005,72301.210000000006,70614.720000000001,81124.789999999994,75221.97,75834.410000000018,69003.59,53019.43,38580.460000000006,29389.439999999999,20269.120000000003,25554.739999999998,653616.37]
[279,null,null,"# of Customers",null,null,267,4,4,4,4,4,4,4,4,4,4,4,4,4]
[280,null,null,"Total Dth",null,null,268,8719,15002,14644,16875,15622,15752,14302,10909,7844,5893,3957,5079,134598]
[281,null,null,null,null,null,269]
[282,null,"I-4","Distribution Non-Gas Rev",null,null,270,0,0,0,0,0,0,0,0,0,0,0,0,0]
[283,null,null,null,null,null,271]
[284,null,null,"Supplier Non-Gas Revenue",null,null,272]
[285,null,null,null,null,null,273]
[286,null,null,"Commodity Revenue",null,null,274,0,0,0,0,0,0,0,0,0,0,0,0,0]
[287,null,null,"Total Revenue",null,null,275,0,0,0,0,0,0,0,0,0,0,0,0,0]
[288,null,null,"# of Customers",null,null,276,0,0,0,0,0,0,0,0,0,0,0,0,0]
[289,null,null,"Total Dth",null,null,277,0,0,0,0,0,0,0,0,0,0,0,0,0]
[290,null,null,null,null,null,278]
[291,null,"IC","Distribution Non-Gas Rev",null,null,279,0,0,0,0,0,0,0,0,0,0,0,0,0]
[292,null,"Sales"," (To Commodity Costs) ",null,null,280]
[293,null,null,null,null,null,281]
[294,null,null,null,null,null,282]
[295,null,null,"Commodity Revenue",null,null,283,null,null,null,null,null,null,null,null,null,null,null,null,0]
[296,null,null,"Total Revenue",null,null,284,0,0,0,0,0,0,0,0,0,0,0,0,0]
[297,null,null,"# of Customers",null,null,285,0,0,0,0,0,0,0,0,0,0,0,0,0]
[298,null,null,"Total Dth",null,null,286,0,0,0,0,0,0,0,0,0,0,0,0,0]
[299,null,null,null,null,null,287]
[300,null,"I-T","Distribution Non-Gas Rev",null,null,288,6034.2099999999991,6591.0799999999981,7439.3099999999986,7477.4,6866.71,7116.1299999999983,6413.9799999999987,6027.9499999999989,5572.6699999999992,5855.6699999999992,5924.2899999999991,5828.829999999999,77148.229999999981]
[301,null,null,null,null,null,289]
[302,null,null,null,null,null,290,0,0,0,0,0,0,0,0,0,0,0,0,0]
[303,null,null,null,null,null,291]
[304,null,null,"Commodity Revenue",null,null,292,0,0,0,0,0,0,0,0,0,0,0,0,0]
[305,null,null,"Total Revenue",null,null,293,6034.2099999999991,6591.0799999999981,7439.3099999999986,7477.4,6866.71,7116.1299999999983,6413.9799999999987,6027.9499999999989,5572.6699999999992,5855.6699999999992,5924.2899999999991,5828.829999999999,77148.229999999981]
[306,null,null,"# of Customers",null,null,294,4,4,4,4,4,4,4,4,4,4,4,4,4]
[307,null,null,"Total Dth",null,null,295,10059,13524,18802,19039,15239,16791,12422,10020,7187,8948,9375,8781,150187]
[308,null,null,null,null,null,296]
[309,null,"IC","Distribution Non-Gas Rev",null,null,297,2934.88,2531.48,3376.33,1930.39,2601.77,2640,1725.21,970.8,1100.29,901.45999999999992,757.42000000000007,2393.36,23863.39]
[310,null,"Trans",null,null,null,298]
[311,null,null,null,null,null,299,0,0,0,0,0,0,0,0,0,0,0,0,0]
[312,null,null,null,null,null,300]
[313,null,null,"Commodity Revenue",null,null,301,0,0,0,0,0,0,0,0,0,0,0,0,0]
[314,null,null,"Total Revenue",null,null,302,2934.88,2531.48,3376.33,1930.39,2601.77,2640,1725.21,970.8,1100.29,901.45999999999992,757.42000000000007,2393.36,23863.39]
[315,null,null,"# of Customers",null,null,303,2,2,2,2,2,2,2,2,2,2,2,2,2]
[316,null,null,"Total Dth",null,null,304,39362,27891,40945,16917,27883,29498,17782,8985,12273,9417,7089,32670,270712]
[317,null,null,null,null,null,305]
[318,null,"CET","Distribution Non-Gas Rev",null,null,306]
[319,null,"DSM","Distribution Non-Gas Rev",null,null,307,null,null,null,null,null,null,null,null,null,null,null,null,0]
[320,null,"Wyoming Totals",null,null,null,308]
[321,null,null,"Distribution Non-Gas Rev",null,null,309,827872.00999999989,1163964.5399999998,1482317.2999999998,1560624.05,1429170.3299999998,1268835.0499999998,1027026.0299999999,796239.40000000014,588859.75,495452.55000000005,488353.2699999999,556660.6,11685374.879999999]
[322,null,null,"Supplier Non-Gas Revenue",null,null,310,1574.03,2708.3,2643.6800000000003,3046.45,2820.24,2843.71,2581.94,1969.3999999999999,1416.08,1063.8600000000001,714.3599999999999,916.91000000000008,24298.960000000003]
[323,null,null,"Non-Core DNG Revenue Credits",null,null,311,8969.09,9122.5599999999977,10815.64,9407.7899999999991,9468.48,9756.1299999999974,8139.1899999999987,6998.7499999999991,6672.9599999999991,6757.1299999999992,6681.7099999999991,8222.1899999999987,101011.62]
[324,null,null,"Commodity Revenue",null,null,312,1084044.9000000001,1831845.1600000001,2541385.21,2721329.56,2422105.6399999997,2065832.4300000002,1528847.1400000001,1014892.6299999999,538559.24,327482.67000000004,306574.84999999998,464204.67999999993,16847104.109999999]
[325,null,null,"Total Wyoming Revenue",null,null,313,1922460.03,3007640.56,4037161.8299999996,4294407.8499999996,3863564.6899999995,3347267.32,2566594.2999999998,1820100.1800000002,1135508.0299999998,830756.21000000008,802324.19,1030004.3799999999,28657789.570000004]
[326,null,null,"# of Customers",null,null,314,27774,27783,27788,27802,27804,27807,27811,27814,27821,27817,27816,27823,27805]
[327,null,null,"Sales Dth",null,null,315,252763,427125,592566,634523,564754,481683,356476,236639,125574,76358,71483,108237,3928181]
[328,null,null,"Transportation Dth",null,null,316,49421,41415,59747,35956,43122,46289,30204,19005,19460,18365,16464,41451,420899]
[329,null,null,"Total Wyoming Dth",null,null,317,302184,468540,652313,670479,607876,527972,386680,255644,145034,94723,87947,149688,4349080]
[330,null,null,null,null,null,318]
[331,"Colorado",null,null,null,null,319]
[332,null,"I-4","Distribution Non-Gas Rev",null,null,320,null,null,null,null,null,null,null,null,null,null,null,null,0]
[333,null,null,null,null,null,321]
[334,null,null,null,null,null,322]
[335,null,null,null,null,null,323]
[336,null,null,"Commodity Revenue",null,null,324,null,null,null,null,null,null,null,null,null,null,null,null,0]
[337,null,null,"Total Revenue",null,null,325,null,null,null,null,null,null,null,null,null,null,null,null,0]
[338,null,null,"# of Customers",null,null,326,0,0,0,0,0,0,0,0,0,0,0,0,0]
[339,null,null,"Total Dth",null,null,327,null,null,null,null,null,null,null,null,null,null,null,null,0]
[340,null,null,null,null,null,328]
[341,null,"IC","Distribution Non-Gas Rev",null,null,329,null,null,null,null,null,null,null,null,null,null,null,null,0]
[342,null,null,null,null,null,330]
[343,null,null,null,null,null,331]
[344,null,null,null,null,null,332]
[345,null,null,"Commodity Revenue",null,null,333,null,null,null,null,null,null,null,null,null,null,null,null,0]
[346,null,null,"Total Revenue",null,null,334,null,null,null,null,null,null,null,null,null,null,null,null,0]
[347,null,null,"# of Customers",null,null,335,0,0,0,0,0,0,0,0,0,0,0,0,0]
[348,null,null,"Total Dth",null,null,336,null,null,null,null,null,null,null,null,null,null,null,null,0]
[349,null,null,null,null,null,337]
[350,null,"Colorado Totals",null,null,null,338]
[351,null,null,"Distribution Non-Gas Rev",null,null,339,null,null,null,null,null,null,null,null,null,null,null,null,0]
[352,null,null,"Commodity Revenue",null,null,340,null,null,null,null,null,null,null,null,null,null,null,null,0]
[353,null,null,"Total Colorado Revenue",null,null,341,null,null,null,null,null,null,null,null,null,null,null,null,0]
[354,null,null,"# of Customers",null,null,342,0,0,0,0,0,0,0,0,0,0,0,0,0]
[355,null,null,"Sales Dth",null,null,343,null,null,null,null,null,null,null,null,null,null,null,null,0]
[356,null,null,"Transportation Dth",null,null,344,null,null,null,null,null,null,null,null,null,null,null,null,0]
[357,null,null,"Total Colorado Dth",null,null,345,null,null,null,null,null,null,null,null,null,null,null,null,0]
[358,null,null,null,null,null,346]
[359,"System Total Tariff Sales and Revenue",null,null,null,null,347]
[360,null,"SystemTotal Tariff Revenue",null,null,null,348]
[361,null,null,"Distribution Non-Gas Rev",null,null,349,20817288.260000002,36925983.00999999,51618231.089999996,54788953.909999989,48119761.169999994,40456216.199999996,24771225.640000004,19400409.030000001,15912371.16,15050998.720000003,14774448.980000002,15253178.01,357889065.18000001]
[362,null,null,"Supplier Non-Gas Revenue",null,null,350,3524593.52,13815354.73,21759689.129999999,23524869.319999997,19882695.049999997,15697130.440000001,4886418.2100000009,3013766.8,1823729.6300000001,1451414.23,1331821.49,1526425.7199999997,112237908.26999997]
[363,null,null,"Non-Core DNG Revenue Credits",null,null,351,8969.09,9122.5599999999977,10815.64,9407.7899999999991,9468.48,9756.1299999999974,8139.1899999999987,6998.7499999999991,6672.9599999999991,6757.1299999999992,6681.7099999999991,8222.1899999999987,101011.62]
[364,null,null,"Commodity Revenue",null,null,352,22222272.039999999,40861443.319999993,63997466.090000004,69154444.439999998,58570013.040000007,46407967.289999999,30853341.349999998,19085162.919999998,11462760.800000001,9015282.1399999987,8274525.6499999994,9606467.4800000004,389511146.56000006]
[365,null,null,null,null,null,353]
[366,null,null,"SystemTotal Tariff Revenue",null,null,354,46573122.909999996,91611903.61999999,137386201.94999999,147477675.45999998,126581937.74000001,102571070.06,60519124.390000001,41506337.5,29205534.550000001,25524452.220000003,24387477.830000002,26394293.400000002,859739131.63]
[367,null,null,"# of Customers",null,null,355,1073348,1077624,1082607,1087670,1089297,1091942,1092224,1092959,1093268,1091352,1092919,1093798,1088250.6666666667]
[368,null,null,"Sales Dth",null,null,356,6686419,12306220,19297412,20854185,17653998,13977708,9281714,5736528,3450477,2720587,2496618,2890787,117352653]
[369,null,null,"Transportation Dth",null,null,357,6974613,7728502,9091889,9344162,7842303,7281801,6953855,6534146,6770825,8131620,8228587,6765323,91647626]
[370,null,null,"SystemTotal Dth",null,null,358,13661032,20034722,28389301,30198347,25496301,21259509,16235569,12270674,10221302,10852207,10725205,9656110,209000279]
[371,null,null,null,null,null,359]
[372,null,null,null,null,null,360]
[null,null,null,null,null,null,361]
[null,null,null,null,null,null,362]
[null,null,null,null,null,null,363]
[null,null,null,null,null,null,364]
[null,null,null,null,null,null,365]
[null,null,null,null,null,null,366]
[null,null,null,null,null,null,367]
[null,null,null,null,null,null,368]
[null,null,null,null,null,null,369]
[null,null,null,null,null,null,370]
[null,null,null,null,null,null,371]
[null,null,null,null,null,null,372]
[null,null,null,null,null,null,373]
[null,null,null,null,null,null,374]
[null,null,null,null,null,null,375]
[null,null,null,null,null,null,376]
[null,null,null,null,null,null,377]
[null,null,null,null,null,null,378]
[null,null,null,null,null,null,379]
[null,null,null,null,null,null,380]
[null,null,null,null,null,null,381]
[null,null,null,null,null,null,382]
[null,null,null,null,null,null,383]
[null,null,null,null,null,null,384]
[null,null,null,null,null,null,385]
[null,null,null,null,null,null,386]
[null,null,null,null,null,null,387]
[null,null,null,null,null,null,388]
[null,null,null,null,null,null,389]
[null,null,null,null,null,null,390]
[null,null,null,null,null,null,391]
[null,null,null,null,null,null,392]
[null,null,null,null,null,null,393]
[null,null,null,null,null,null,394]
[null,null,null,null,null,null,395]
[null,null,null,null,null,null,396]
[null,null,null,null,null,null,397]
[null,null,null,null,null,null,398]
[null,null,null,null,null,null,399]
[null,null,null,null,null,null,400]
[null,null,null,null,null,null,401]
[null,null,null,null,null,null,402]
[null,null,null,null,null,null,403]
[null,null,null,null,null,null,404]
[null,null,null,null,null,null,405]
[null,null,null,null,null,null,406]
[null,null,null,null,null,null,407]