{"text_format":"1","workbook":"xlsx","n_sheets":10,"sheets":["Graphs","Delta Reliability","Delta Pre-reliability","Data Base Rel","Data Base Pre","Delta Base Rel - Pre","Data Compare Rel","Data Compare Pre","Delta Compare Rel - Pre","Resource Map"],"not_rendered":{"charts":18,"images":0,"macros":0,"external_links":0,"defined_names":16,"comments":0,"pivot_tables":0},"unopened":[],"bounds":{"document_bytes":16777216,"sheet_cells":100000,"rows_first":2000,"rows_last":500,"rows_between":2000,"halvings":0,"cell_chars":16384,"cell_head_chars":4096},"cells_cut":0,"cells_raw":0,"read":"whole","date_system":"1900"}

{"sheet":"Graphs","index":0,"n_rows":23,"n_cols":18,"rows_kept":23,"cut":false,"hidden":false,"merged":[]}
[]
[]
[]
[]
[]
[null,"Change in Cumulative Resources Relative to P45CNW-",null,null,null,null,null,null,null,null,null,null,null,null,null,null,null,"Reliability Resources"]
[]
[]
[]
[]
[]
[]
[]
[]
[]
[]
[]
[]
[]
[]
[]
[]
[null,"Case S05-MM_ Portfolio",null,null,null,null,null,null,null,null,null,null,null,null,null,null,null,"Case P45CNW- Portfolio"]

{"sheet":"Delta Reliability","index":1,"n_rows":81,"n_cols":27,"rows_kept":81,"cut":false,"hidden":false,"merged":[]}
[]
[]
[null,null,"Coal"]
[null,null,"Cumulative",2019,2020,2021,2022,2023,2024,2025,2026,2027,2028,2029,2030,2031,2032,2033,2034,2035,2036,2037,2038]
[null,null,"Coal Removed",{"$f":"'Data Compare Rel'!D8-'Data Base Rel'!D8","v":0},{"$f":"'Data Compare Rel'!E8-'Data Base Rel'!E8","v":0},{"$f":"'Data Compare Rel'!F8-'Data Base Rel'!F8","v":0},{"$f":"'Data Compare Rel'!G8-'Data Base Rel'!G8","v":0},{"$f":"'Data Compare Rel'!H8-'Data Base Rel'!H8","v":0},{"$f":"'Data Compare Rel'!I8-'Data Base Rel'!I8","v":0},{"$f":"'Data Compare Rel'!J8-'Data Base Rel'!J8","v":0},{"$f":"'Data Compare Rel'!K8-'Data Base Rel'!K8","v":0},{"$f":"'Data Compare Rel'!L8-'Data Base Rel'!L8","v":0},{"$f":"'Data Compare Rel'!M8-'Data Base Rel'!M8","v":0},{"$f":"'Data Compare Rel'!N8-'Data Base Rel'!N8","v":0},{"$f":"'Data Compare Rel'!O8-'Data Base Rel'!O8","v":0},{"$f":"'Data Compare Rel'!P8-'Data Base Rel'!P8","v":0},{"$f":"'Data Compare Rel'!Q8-'Data Base Rel'!Q8","v":0},{"$f":"'Data Compare Rel'!R8-'Data Base Rel'!R8","v":0},{"$f":"'Data Compare Rel'!S8-'Data Base Rel'!S8","v":0},{"$f":"'Data Compare Rel'!T8-'Data Base Rel'!T8","v":0},{"$f":"'Data Compare Rel'!U8-'Data Base Rel'!U8","v":0},{"$f":"'Data Compare Rel'!V8-'Data Base Rel'!V8","v":0},{"$f":"'Data Compare Rel'!W8-'Data Base Rel'!W8","v":0}]
[]
[null,null,"Renewable and Storage"]
[null,null,"Cumulative",2019,2020,2021,2022,2023,2024,2025,2026,2027,2028,2029,2030,2031,2032,2033,2034,2035,2036,2037,2038,null,"Wind","Solar","Battery"]
[null,null,"Wind",{"$f":"'Data Compare Rel'!D24-'Data Base Rel'!D24","v":0},{"$f":"'Data Compare Rel'!E24-'Data Base Rel'!E24","v":0},{"$f":"'Data Compare Rel'!F24-'Data Base Rel'!F24","v":0},{"$f":"'Data Compare Rel'!G24-'Data Base Rel'!G24","v":0},{"$f":"'Data Compare Rel'!H24-'Data Base Rel'!H24","v":-69.2},{"$f":"'Data Compare Rel'!I24-'Data Base Rel'!I24","v":-69.200000000000045},{"$f":"'Data Compare Rel'!J24-'Data Base Rel'!J24","v":-69.200000000000045},{"$f":"'Data Compare Rel'!K24-'Data Base Rel'!K24","v":-69.200000000000045},{"$f":"'Data Compare Rel'!L24-'Data Base Rel'!L24","v":-69.200000000000045},{"$f":"'Data Compare Rel'!M24-'Data Base Rel'!M24","v":-69.200000000000045},{"$f":"'Data Compare Rel'!N24-'Data Base Rel'!N24","v":-69.200000000000045},{"$f":"'Data Compare Rel'!O24-'Data Base Rel'!O24","v":-115.20000000000027},{"$f":"'Data Compare Rel'!P24-'Data Base Rel'!P24","v":-115.20000000000027},{"$f":"'Data Compare Rel'!Q24-'Data Base Rel'!Q24","v":-115.20000000000027},{"$f":"'Data Compare Rel'!R24-'Data Base Rel'!R24","v":-115.20000000000027},{"$f":"'Data Compare Rel'!S24-'Data Base Rel'!S24","v":-115.20000000000027},{"$f":"'Data Compare Rel'!T24-'Data Base Rel'!T24","v":-115.20000000000027},{"$f":"'Data Compare Rel'!U24-'Data Base Rel'!U24","v":-115.20000000000027},{"$f":"'Data Compare Rel'!V24-'Data Base Rel'!V24","v":-115.20000000000027},{"$f":"'Data Compare Rel'!W24-'Data Base Rel'!W24","v":-115.20000000000027},null,{"$f":"'Data Compare Rel'!Y24-'Data Base Rel'!Y24","v":-89.600000000000136},{"$f":"'Data Compare Rel'!Z24-'Data Base Rel'!Z24","v":-240.40000000000055},{"$f":"0.25*W11+0.25*W12+W13","v":-23.700000000000131}]
[null,null,"Solar",{"$f":"'Data Compare Rel'!D25-'Data Base Rel'!D25","v":0},{"$f":"'Data Compare Rel'!E25-'Data Base Rel'!E25","v":0},{"$f":"'Data Compare Rel'!F25-'Data Base Rel'!F25","v":0},{"$f":"'Data Compare Rel'!G25-'Data Base Rel'!G25","v":0},{"$f":"'Data Compare Rel'!H25-'Data Base Rel'!H25","v":0},{"$f":"'Data Compare Rel'!I25-'Data Base Rel'!I25","v":0},{"$f":"'Data Compare Rel'!J25-'Data Base Rel'!J25","v":0},{"$f":"'Data Compare Rel'!K25-'Data Base Rel'!K25","v":0},{"$f":"'Data Compare Rel'!L25-'Data Base Rel'!L25","v":0},{"$f":"'Data Compare Rel'!M25-'Data Base Rel'!M25","v":0},{"$f":"'Data Compare Rel'!N25-'Data Base Rel'!N25","v":0},{"$f":"'Data Compare Rel'!O25-'Data Base Rel'!O25","v":0},{"$f":"'Data Compare Rel'!P25-'Data Base Rel'!P25","v":0},{"$f":"'Data Compare Rel'!Q25-'Data Base Rel'!Q25","v":0},{"$f":"'Data Compare Rel'!R25-'Data Base Rel'!R25","v":0},{"$f":"'Data Compare Rel'!S25-'Data Base Rel'!S25","v":0},{"$f":"'Data Compare Rel'!T25-'Data Base Rel'!T25","v":0},{"$f":"'Data Compare Rel'!U25-'Data Base Rel'!U25","v":0},{"$f":"'Data Compare Rel'!V25-'Data Base Rel'!V25","v":0},{"$f":"'Data Compare Rel'!W25-'Data Base Rel'!W25","v":0}]
[null,null,"Wind+Bat",{"$f":"'Data Compare Rel'!D26-'Data Base Rel'!D26","v":0},{"$f":"'Data Compare Rel'!E26-'Data Base Rel'!E26","v":0},{"$f":"'Data Compare Rel'!F26-'Data Base Rel'!F26","v":0},{"$f":"'Data Compare Rel'!G26-'Data Base Rel'!G26","v":0},{"$f":"'Data Compare Rel'!H26-'Data Base Rel'!H26","v":0},{"$f":"'Data Compare Rel'!I26-'Data Base Rel'!I26","v":0},{"$f":"'Data Compare Rel'!J26-'Data Base Rel'!J26","v":0},{"$f":"'Data Compare Rel'!K26-'Data Base Rel'!K26","v":0},{"$f":"'Data Compare Rel'!L26-'Data Base Rel'!L26","v":0},{"$f":"'Data Compare Rel'!M26-'Data Base Rel'!M26","v":0},{"$f":"'Data Compare Rel'!N26-'Data Base Rel'!N26","v":-9.8000000000000007},{"$f":"'Data Compare Rel'!O26-'Data Base Rel'!O26","v":20.399999999999999},{"$f":"'Data Compare Rel'!P26-'Data Base Rel'!P26","v":20.399999999999999},{"$f":"'Data Compare Rel'!Q26-'Data Base Rel'!Q26","v":36.200000000000003},{"$f":"'Data Compare Rel'!R26-'Data Base Rel'!R26","v":36.200000000000003},{"$f":"'Data Compare Rel'!S26-'Data Base Rel'!S26","v":36.200000000000003},{"$f":"'Data Compare Rel'!T26-'Data Base Rel'!T26","v":36.200000000000003},{"$f":"'Data Compare Rel'!U26-'Data Base Rel'!U26","v":36.200000000000003},{"$f":"'Data Compare Rel'!V26-'Data Base Rel'!V26","v":25.600000000000009},{"$f":"'Data Compare Rel'!W26-'Data Base Rel'!W26","v":25.600000000000009}]
[null,null,"Solar+Bat",{"$f":"'Data Compare Rel'!D27-'Data Base Rel'!D27","v":0},{"$f":"'Data Compare Rel'!E27-'Data Base Rel'!E27","v":0},{"$f":"'Data Compare Rel'!F27-'Data Base Rel'!F27","v":0},{"$f":"'Data Compare Rel'!G27-'Data Base Rel'!G27","v":0},{"$f":"'Data Compare Rel'!H27-'Data Base Rel'!H27","v":69.400000000000006},{"$f":"'Data Compare Rel'!I27-'Data Base Rel'!I27","v":79},{"$f":"'Data Compare Rel'!J27-'Data Base Rel'!J27","v":79},{"$f":"'Data Compare Rel'!K27-'Data Base Rel'!K27","v":79},{"$f":"'Data Compare Rel'!L27-'Data Base Rel'!L27","v":79},{"$f":"'Data Compare Rel'!M27-'Data Base Rel'!M27","v":79},{"$f":"'Data Compare Rel'!N27-'Data Base Rel'!N27","v":79},{"$f":"'Data Compare Rel'!O27-'Data Base Rel'!O27","v":-421},{"$f":"'Data Compare Rel'!P27-'Data Base Rel'!P27","v":79},{"$f":"'Data Compare Rel'!Q27-'Data Base Rel'!Q27","v":554},{"$f":"'Data Compare Rel'!R27-'Data Base Rel'!R27","v":179},{"$f":"'Data Compare Rel'!S27-'Data Base Rel'!S27","v":179},{"$f":"'Data Compare Rel'!T27-'Data Base Rel'!T27","v":179},{"$f":"'Data Compare Rel'!U27-'Data Base Rel'!U27","v":-240.40000000000009},{"$f":"'Data Compare Rel'!V27-'Data Base Rel'!V27","v":-245.40000000000055},{"$f":"'Data Compare Rel'!W27-'Data Base Rel'!W27","v":-240.40000000000055}]
[null,null,"Battery",{"$f":"'Data Compare Rel'!D28-'Data Base Rel'!D28","v":0},{"$f":"'Data Compare Rel'!E28-'Data Base Rel'!E28","v":0},{"$f":"'Data Compare Rel'!F28-'Data Base Rel'!F28","v":0},{"$f":"'Data Compare Rel'!G28-'Data Base Rel'!G28","v":0},{"$f":"'Data Compare Rel'!H28-'Data Base Rel'!H28","v":0},{"$f":"'Data Compare Rel'!I28-'Data Base Rel'!I28","v":0},{"$f":"'Data Compare Rel'!J28-'Data Base Rel'!J28","v":0},{"$f":"'Data Compare Rel'!K28-'Data Base Rel'!K28","v":0},{"$f":"'Data Compare Rel'!L28-'Data Base Rel'!L28","v":0},{"$f":"'Data Compare Rel'!M28-'Data Base Rel'!M28","v":60},{"$f":"'Data Compare Rel'!N28-'Data Base Rel'!N28","v":-375},{"$f":"'Data Compare Rel'!O28-'Data Base Rel'!O28","v":-45},{"$f":"'Data Compare Rel'!P28-'Data Base Rel'!P28","v":-75},{"$f":"'Data Compare Rel'!Q28-'Data Base Rel'!Q28","v":-150},{"$f":"'Data Compare Rel'!R28-'Data Base Rel'!R28","v":45},{"$f":"'Data Compare Rel'!S28-'Data Base Rel'!S28","v":45},{"$f":"'Data Compare Rel'!T28-'Data Base Rel'!T28","v":45},{"$f":"'Data Compare Rel'!U28-'Data Base Rel'!U28","v":45},{"$f":"'Data Compare Rel'!V28-'Data Base Rel'!V28","v":165},{"$f":"'Data Compare Rel'!W28-'Data Base Rel'!W28","v":30}]
[null,null,"Pumped Storage",{"$f":"'Data Compare Rel'!D29-'Data Base Rel'!D29","v":0},{"$f":"'Data Compare Rel'!E29-'Data Base Rel'!E29","v":0},{"$f":"'Data Compare Rel'!F29-'Data Base Rel'!F29","v":0},{"$f":"'Data Compare Rel'!G29-'Data Base Rel'!G29","v":0},{"$f":"'Data Compare Rel'!H29-'Data Base Rel'!H29","v":0},{"$f":"'Data Compare Rel'!I29-'Data Base Rel'!I29","v":0},{"$f":"'Data Compare Rel'!J29-'Data Base Rel'!J29","v":0},{"$f":"'Data Compare Rel'!K29-'Data Base Rel'!K29","v":0},{"$f":"'Data Compare Rel'!L29-'Data Base Rel'!L29","v":0},{"$f":"'Data Compare Rel'!M29-'Data Base Rel'!M29","v":0},{"$f":"'Data Compare Rel'!N29-'Data Base Rel'!N29","v":0},{"$f":"'Data Compare Rel'!O29-'Data Base Rel'!O29","v":0},{"$f":"'Data Compare Rel'!P29-'Data Base Rel'!P29","v":0},{"$f":"'Data Compare Rel'!Q29-'Data Base Rel'!Q29","v":0},{"$f":"'Data Compare Rel'!R29-'Data Base Rel'!R29","v":0},{"$f":"'Data Compare Rel'!S29-'Data Base Rel'!S29","v":0},{"$f":"'Data Compare Rel'!T29-'Data Base Rel'!T29","v":0},{"$f":"'Data Compare Rel'!U29-'Data Base Rel'!U29","v":0},{"$f":"'Data Compare Rel'!V29-'Data Base Rel'!V29","v":0},{"$f":"'Data Compare Rel'!W29-'Data Base Rel'!W29","v":0}]
[null,null,"Renewable Removed",{"$f":"'Data Compare Rel'!D30-'Data Base Rel'!D30","v":0},{"$f":"'Data Compare Rel'!E30-'Data Base Rel'!E30","v":0},{"$f":"'Data Compare Rel'!F30-'Data Base Rel'!F30","v":0},{"$f":"'Data Compare Rel'!G30-'Data Base Rel'!G30","v":0},{"$f":"'Data Compare Rel'!H30-'Data Base Rel'!H30","v":0},{"$f":"'Data Compare Rel'!I30-'Data Base Rel'!I30","v":0},{"$f":"'Data Compare Rel'!J30-'Data Base Rel'!J30","v":0},{"$f":"'Data Compare Rel'!K30-'Data Base Rel'!K30","v":0},{"$f":"'Data Compare Rel'!L30-'Data Base Rel'!L30","v":0},{"$f":"'Data Compare Rel'!M30-'Data Base Rel'!M30","v":0},{"$f":"'Data Compare Rel'!N30-'Data Base Rel'!N30","v":0},{"$f":"'Data Compare Rel'!O30-'Data Base Rel'!O30","v":0},{"$f":"'Data Compare Rel'!P30-'Data Base Rel'!P30","v":0},{"$f":"'Data Compare Rel'!Q30-'Data Base Rel'!Q30","v":0},{"$f":"'Data Compare Rel'!R30-'Data Base Rel'!R30","v":0},{"$f":"'Data Compare Rel'!S30-'Data Base Rel'!S30","v":0},{"$f":"'Data Compare Rel'!T30-'Data Base Rel'!T30","v":0},{"$f":"'Data Compare Rel'!U30-'Data Base Rel'!U30","v":0},{"$f":"'Data Compare Rel'!V30-'Data Base Rel'!V30","v":0},{"$f":"'Data Compare Rel'!W30-'Data Base Rel'!W30","v":0}]
[]
[null,null,"Gas"]
[null,null,"Cumulative",2019,2020,2021,2022,2023,2024,2025,2026,2027,2028,2029,2030,2031,2032,2033,2034,2035,2036,2037,2038]
[null,null,"Gas Peaker",{"$f":"'Data Compare Rel'!D40-'Data Base Rel'!D40","v":0},{"$f":"'Data Compare Rel'!E40-'Data Base Rel'!E40","v":0},{"$f":"'Data Compare Rel'!F40-'Data Base Rel'!F40","v":0},{"$f":"'Data Compare Rel'!G40-'Data Base Rel'!G40","v":0},{"$f":"'Data Compare Rel'!H40-'Data Base Rel'!H40","v":0},{"$f":"'Data Compare Rel'!I40-'Data Base Rel'!I40","v":0},{"$f":"'Data Compare Rel'!J40-'Data Base Rel'!J40","v":0},{"$f":"'Data Compare Rel'!K40-'Data Base Rel'!K40","v":-184.9},{"$f":"'Data Compare Rel'!L40-'Data Base Rel'!L40","v":-184.9},{"$f":"'Data Compare Rel'!M40-'Data Base Rel'!M40","v":-184.9},{"$f":"'Data Compare Rel'!N40-'Data Base Rel'!N40","v":-184.9},{"$f":"'Data Compare Rel'!O40-'Data Base Rel'!O40","v":0},{"$f":"'Data Compare Rel'!P40-'Data Base Rel'!P40","v":0},{"$f":"'Data Compare Rel'!Q40-'Data Base Rel'!Q40","v":0},{"$f":"'Data Compare Rel'!R40-'Data Base Rel'!R40","v":0},{"$f":"'Data Compare Rel'!S40-'Data Base Rel'!S40","v":0},{"$f":"'Data Compare Rel'!T40-'Data Base Rel'!T40","v":0},{"$f":"'Data Compare Rel'!U40-'Data Base Rel'!U40","v":0},{"$f":"'Data Compare Rel'!V40-'Data Base Rel'!V40","v":0},{"$f":"'Data Compare Rel'!W40-'Data Base Rel'!W40","v":0}]
[null,null,"Gas CCCT",{"$f":"'Data Compare Rel'!D41-'Data Base Rel'!D41","v":0},{"$f":"'Data Compare Rel'!E41-'Data Base Rel'!E41","v":0},{"$f":"'Data Compare Rel'!F41-'Data Base Rel'!F41","v":0},{"$f":"'Data Compare Rel'!G41-'Data Base Rel'!G41","v":0},{"$f":"'Data Compare Rel'!H41-'Data Base Rel'!H41","v":0},{"$f":"'Data Compare Rel'!I41-'Data Base Rel'!I41","v":0},{"$f":"'Data Compare Rel'!J41-'Data Base Rel'!J41","v":0},{"$f":"'Data Compare Rel'!K41-'Data Base Rel'!K41","v":0},{"$f":"'Data Compare Rel'!L41-'Data Base Rel'!L41","v":0},{"$f":"'Data Compare Rel'!M41-'Data Base Rel'!M41","v":0},{"$f":"'Data Compare Rel'!N41-'Data Base Rel'!N41","v":0},{"$f":"'Data Compare Rel'!O41-'Data Base Rel'!O41","v":0},{"$f":"'Data Compare Rel'!P41-'Data Base Rel'!P41","v":0},{"$f":"'Data Compare Rel'!Q41-'Data Base Rel'!Q41","v":0},{"$f":"'Data Compare Rel'!R41-'Data Base Rel'!R41","v":0},{"$f":"'Data Compare Rel'!S41-'Data Base Rel'!S41","v":0},{"$f":"'Data Compare Rel'!T41-'Data Base Rel'!T41","v":0},{"$f":"'Data Compare Rel'!U41-'Data Base Rel'!U41","v":0},{"$f":"'Data Compare Rel'!V41-'Data Base Rel'!V41","v":0},{"$f":"'Data Compare Rel'!W41-'Data Base Rel'!W41","v":0}]
[null,null,"Gas Conv.",{"$f":"'Data Compare Rel'!D42-'Data Base Rel'!D42","v":0},{"$f":"'Data Compare Rel'!E42-'Data Base Rel'!E42","v":0},{"$f":"'Data Compare Rel'!F42-'Data Base Rel'!F42","v":0},{"$f":"'Data Compare Rel'!G42-'Data Base Rel'!G42","v":0},{"$f":"'Data Compare Rel'!H42-'Data Base Rel'!H42","v":0},{"$f":"'Data Compare Rel'!I42-'Data Base Rel'!I42","v":0},{"$f":"'Data Compare Rel'!J42-'Data Base Rel'!J42","v":0},{"$f":"'Data Compare Rel'!K42-'Data Base Rel'!K42","v":0},{"$f":"'Data Compare Rel'!L42-'Data Base Rel'!L42","v":0},{"$f":"'Data Compare Rel'!M42-'Data Base Rel'!M42","v":0},{"$f":"'Data Compare Rel'!N42-'Data Base Rel'!N42","v":0},{"$f":"'Data Compare Rel'!O42-'Data Base Rel'!O42","v":0},{"$f":"'Data Compare Rel'!P42-'Data Base Rel'!P42","v":0},{"$f":"'Data Compare Rel'!Q42-'Data Base Rel'!Q42","v":0},{"$f":"'Data Compare Rel'!R42-'Data Base Rel'!R42","v":0},{"$f":"'Data Compare Rel'!S42-'Data Base Rel'!S42","v":0},{"$f":"'Data Compare Rel'!T42-'Data Base Rel'!T42","v":0},{"$f":"'Data Compare Rel'!U42-'Data Base Rel'!U42","v":0},{"$f":"'Data Compare Rel'!V42-'Data Base Rel'!V42","v":0},{"$f":"'Data Compare Rel'!W42-'Data Base Rel'!W42","v":0}]
[null,null,"Gas Removed",{"$f":"'Data Compare Rel'!D43-'Data Base Rel'!D43","v":0},{"$f":"'Data Compare Rel'!E43-'Data Base Rel'!E43","v":0},{"$f":"'Data Compare Rel'!F43-'Data Base Rel'!F43","v":0},{"$f":"'Data Compare Rel'!G43-'Data Base Rel'!G43","v":0},{"$f":"'Data Compare Rel'!H43-'Data Base Rel'!H43","v":0},{"$f":"'Data Compare Rel'!I43-'Data Base Rel'!I43","v":0},{"$f":"'Data Compare Rel'!J43-'Data Base Rel'!J43","v":0},{"$f":"'Data Compare Rel'!K43-'Data Base Rel'!K43","v":0},{"$f":"'Data Compare Rel'!L43-'Data Base Rel'!L43","v":0},{"$f":"'Data Compare Rel'!M43-'Data Base Rel'!M43","v":0},{"$f":"'Data Compare Rel'!N43-'Data Base Rel'!N43","v":0},{"$f":"'Data Compare Rel'!O43-'Data Base Rel'!O43","v":0},{"$f":"'Data Compare Rel'!P43-'Data Base Rel'!P43","v":0},{"$f":"'Data Compare Rel'!Q43-'Data Base Rel'!Q43","v":0},{"$f":"'Data Compare Rel'!R43-'Data Base Rel'!R43","v":0},{"$f":"'Data Compare Rel'!S43-'Data Base Rel'!S43","v":0},{"$f":"'Data Compare Rel'!T43-'Data Base Rel'!T43","v":0},{"$f":"'Data Compare Rel'!U43-'Data Base Rel'!U43","v":0},{"$f":"'Data Compare Rel'!V43-'Data Base Rel'!V43","v":0},{"$f":"'Data Compare Rel'!W43-'Data Base Rel'!W43","v":0}]
[]
[null,null,"Demand-Side Management"]
[null,null,"Cumulative",2019,2020,2021,2022,2023,2024,2025,2026,2027,2028,2029,2030,2031,2032,2033,2034,2035,2036,2037,2038]
[null,null,"Class 2 DSM",{"$f":"'Data Compare Rel'!D51-'Data Base Rel'!D51","v":0},{"$f":"'Data Compare Rel'!E51-'Data Base Rel'!E51","v":-1.6499999999999773},{"$f":"'Data Compare Rel'!F51-'Data Base Rel'!F51","v":-1.6499999999999773},{"$f":"'Data Compare Rel'!G51-'Data Base Rel'!G51","v":-6.0800000000000409},{"$f":"'Data Compare Rel'!H51-'Data Base Rel'!H51","v":-8.7400000000000091},{"$f":"'Data Compare Rel'!I51-'Data Base Rel'!I51","v":-10.900000000000091},{"$f":"'Data Compare Rel'!J51-'Data Base Rel'!J51","v":-11.090000000000146},{"$f":"'Data Compare Rel'!K51-'Data Base Rel'!K51","v":-11.270000000000209},{"$f":"'Data Compare Rel'!L51-'Data Base Rel'!L51","v":-13.150000000000091},{"$f":"'Data Compare Rel'!M51-'Data Base Rel'!M51","v":-13.210000000000036},{"$f":"'Data Compare Rel'!N51-'Data Base Rel'!N51","v":-13.460000000000036},{"$f":"'Data Compare Rel'!O51-'Data Base Rel'!O51","v":-10.740000000000009},{"$f":"'Data Compare Rel'!P51-'Data Base Rel'!P51","v":-10.779999999999973},{"$f":"'Data Compare Rel'!Q51-'Data Base Rel'!Q51","v":-12.789999999999964},{"$f":"'Data Compare Rel'!R51-'Data Base Rel'!R51","v":-6.4200000000000728},{"$f":"'Data Compare Rel'!S51-'Data Base Rel'!S51","v":-6.3400000000001455},{"$f":"'Data Compare Rel'!T51-'Data Base Rel'!T51","v":-5.9099999999998545},{"$f":"'Data Compare Rel'!U51-'Data Base Rel'!U51","v":-2.1599999999998545},{"$f":"'Data Compare Rel'!V51-'Data Base Rel'!V51","v":0.89000000000032742},{"$f":"'Data Compare Rel'!W51-'Data Base Rel'!W51","v":4.9200000000005275}]
[null,null,"Class 1 DSM",{"$f":"'Data Compare Rel'!D52-'Data Base Rel'!D52","v":0},{"$f":"'Data Compare Rel'!E52-'Data Base Rel'!E52","v":0},{"$f":"'Data Compare Rel'!F52-'Data Base Rel'!F52","v":0},{"$f":"'Data Compare Rel'!G52-'Data Base Rel'!G52","v":0},{"$f":"'Data Compare Rel'!H52-'Data Base Rel'!H52","v":0},{"$f":"'Data Compare Rel'!I52-'Data Base Rel'!I52","v":0},{"$f":"'Data Compare Rel'!J52-'Data Base Rel'!J52","v":0},{"$f":"'Data Compare Rel'!K52-'Data Base Rel'!K52","v":0},{"$f":"'Data Compare Rel'!L52-'Data Base Rel'!L52","v":0},{"$f":"'Data Compare Rel'!M52-'Data Base Rel'!M52","v":0},{"$f":"'Data Compare Rel'!N52-'Data Base Rel'!N52","v":-33.501000000000005},{"$f":"'Data Compare Rel'!O52-'Data Base Rel'!O52","v":-7.5120000000000005},{"$f":"'Data Compare Rel'!P52-'Data Base Rel'!P52","v":-7.5120000000000005},{"$f":"'Data Compare Rel'!Q52-'Data Base Rel'!Q52","v":0},{"$f":"'Data Compare Rel'!R52-'Data Base Rel'!R52","v":0},{"$f":"'Data Compare Rel'!S52-'Data Base Rel'!S52","v":0},{"$f":"'Data Compare Rel'!T52-'Data Base Rel'!T52","v":-8.3349999999999795},{"$f":"'Data Compare Rel'!U52-'Data Base Rel'!U52","v":-11.988999999999976},{"$f":"'Data Compare Rel'!V52-'Data Base Rel'!V52","v":-34.456999999999994},{"$f":"'Data Compare Rel'!W52-'Data Base Rel'!W52","v":-97.355999999999995}]
[]
[null,null,"FOTs"]
[null,null,"Incremental",2019,2020,2021,2022,2023,2024,2025,2026,2027,2028,2029,2030,2031,2032,2033,2034,2035,2036,2037,2038]
[null,null,"FOT",{"$f":"'Data Compare Rel'!D56-'Data Base Rel'!D56","v":-7.6999999999998181E-2},{"$f":"'Data Compare Rel'!E56-'Data Base Rel'!E56","v":9.9999999999909051E-2},{"$f":"'Data Compare Rel'!F56-'Data Base Rel'!F56","v":0.56000000000000227},{"$f":"'Data Compare Rel'!G56-'Data Base Rel'!G56","v":1.1999999999999886},{"$f":"'Data Compare Rel'!H56-'Data Base Rel'!H56","v":1.7599999999999909},{"$f":"'Data Compare Rel'!I56-'Data Base Rel'!I56","v":44.075000000000017},{"$f":"'Data Compare Rel'!J56-'Data Base Rel'!J56","v":42.08},{"$f":"'Data Compare Rel'!K56-'Data Base Rel'!K56","v":6.8000000000000114},{"$f":"'Data Compare Rel'!L56-'Data Base Rel'!L56","v":-20.680000000000007},{"$f":"'Data Compare Rel'!M56-'Data Base Rel'!M56","v":-57.029999999999973},{"$f":"'Data Compare Rel'!N56-'Data Base Rel'!N56","v":-75.569999999999936},{"$f":"'Data Compare Rel'!O56-'Data Base Rel'!O56","v":101.36999999999989},{"$f":"'Data Compare Rel'!P56-'Data Base Rel'!P56","v":106.52999999999997},{"$f":"'Data Compare Rel'!Q56-'Data Base Rel'!Q56","v":-61.379999999999882},{"$f":"'Data Compare Rel'!R56-'Data Base Rel'!R56","v":2.3099999999999454},{"$f":"'Data Compare Rel'!S56-'Data Base Rel'!S56","v":-18.990000000000009},{"$f":"'Data Compare Rel'!T56-'Data Base Rel'!T56","v":-22.986999999999853},{"$f":"'Data Compare Rel'!U56-'Data Base Rel'!U56","v":86.437000000000126},{"$f":"'Data Compare Rel'!V56-'Data Base Rel'!V56","v":0.52500000000009095},{"$f":"'Data Compare Rel'!W56-'Data Base Rel'!W56","v":-12.636999999999944}]
[]
[]
[null,null,null,2019,2020,2021,2022,2023,2024,2025,2026,2027,2028,2029,2030,2031,2032,2033,2034,2035,2036,2037,2038]
[null,null,"Coal Removed",{"$f":"D5","v":0},{"$f":"E5","v":0},0,0,0,0,0,0,0,0,0,0,0,0,0,0,0,0,0,0]
[null,null,"Wind",{"$f":"D9","v":0},{"$f":"E9","v":0},0,0,-69.2,-69.200000000000045,-69.200000000000045,-69.200000000000045,-69.200000000000045,-69.200000000000045,-69.200000000000045,-115.20000000000027,-115.20000000000027,-115.20000000000027,-115.20000000000027,-115.20000000000027,-115.20000000000027,-115.20000000000027,-115.20000000000027,-115.20000000000027]
[null,null,"Solar",0,{"$f":"E10","v":0},0,0,0,0,0,0,0,0,0,0,0,0,0,0,0,0,0,0]
[null,null,"Wind+Bat",0,{"$f":"E11","v":0},0,0,0,0,0,0,0,0,-9.8000000000000007,20.399999999999999,20.399999999999999,36.200000000000003,36.200000000000003,36.200000000000003,36.200000000000003,36.200000000000003,25.600000000000009,25.600000000000009]
[null,null,"Solar+Bat",0,{"$f":"E12","v":0},0,0,69.400000000000006,79,79,79,79,79,79,-421,79,554,179,179,179,-240.40000000000009,-245.40000000000055,-240.40000000000055]
[null,null,"Battery",0,{"$f":"E13","v":0},0,0,0,0,0,0,0,60,-375,-45,-75,-150,45,45,45,45,165,30]
[null,null,"Pumped Storage",0,{"$f":"E14","v":0},0,0,0,0,0,0,0,0,0,0,0,0,0,0,0,0,0,0]
[null,null,"Gas",{"$f":"SUM(D19:D22)","v":0},{"$f":"SUM(E19:E22)","v":0},0,0,0,0,0,-184.9,-184.9,-184.9,-184.9,0,0,0,0,0,0,0,0,0]
[null,null,"Class 1 DSM",{"$f":"D27","v":0},{"$f":"E27","v":0},0,0,0,0,0,0,0,0,-33.501000000000005,-7.5120000000000005,-7.5120000000000005,0,0,0,-8.3349999999999795,-11.988999999999976,-34.456999999999994,-97.355999999999995]
[null,null,"Class 2 DSM",{"$f":"D26","v":0},{"$f":"E26","v":-1.6499999999999773},-1.6499999999999773,-6.0800000000000409,-8.7400000000000091,-10.900000000000091,-11.090000000000146,-11.270000000000209,-13.150000000000091,-13.210000000000036,-13.460000000000036,-10.740000000000009,-10.779999999999973,-12.789999999999964,-6.4200000000000728,-6.3400000000001455,-5.9099999999998545,-2.1599999999998545,0.89000000000032742,4.9200000000005275]
[null,null,"FOT",{"$f":"D31","v":-7.6999999999998181E-2},{"$f":"E31","v":9.9999999999909051E-2},0.56000000000000227,1.1999999999999886,1.7599999999999909,44.075000000000017,42.08,6.8000000000000114,-20.680000000000007,-57.029999999999973,-75.569999999999936,101.36999999999989,106.52999999999997,-61.379999999999882,2.3099999999999454,-18.990000000000009,-22.986999999999853,86.437000000000126,0.52500000000009095,-12.636999999999944]
[]
[]
[null,null,"Existing Capacity Removed",{"$f":"D5+D15+D22","v":0},{"$f":"E5+E15+E22","v":0},0,0,0,0,0,0,0,0,0,0,0,0,0,0,0,0,0,0]
[]
[]
[null,null,"All"]
[null,null,"Incremental",2019,2020,2021,2022,2023,2024,2025,2026,2027,2028,2029,2030,2031,2032,2033,2034,2035,2036,2037,2038]
[null,null,"Wind",{"$f":"'Data Compare Rel'!D12-'Data Base Rel'!D12","v":0},{"$f":"'Data Compare Rel'!E12-'Data Base Rel'!E12","v":0},{"$f":"'Data Compare Rel'!F12-'Data Base Rel'!F12","v":0},{"$f":"'Data Compare Rel'!G12-'Data Base Rel'!G12","v":0},{"$f":"'Data Compare Rel'!H12-'Data Base Rel'!H12","v":-69.2},{"$f":"'Data Compare Rel'!I12-'Data Base Rel'!I12","v":0},{"$f":"'Data Compare Rel'!J12-'Data Base Rel'!J12","v":0},{"$f":"'Data Compare Rel'!K12-'Data Base Rel'!K12","v":0},{"$f":"'Data Compare Rel'!L12-'Data Base Rel'!L12","v":0},{"$f":"'Data Compare Rel'!M12-'Data Base Rel'!M12","v":0},{"$f":"'Data Compare Rel'!N12-'Data Base Rel'!N12","v":0},{"$f":"'Data Compare Rel'!O12-'Data Base Rel'!O12","v":-45.999999999999886},{"$f":"'Data Compare Rel'!P12-'Data Base Rel'!P12","v":0},{"$f":"'Data Compare Rel'!Q12-'Data Base Rel'!Q12","v":0},{"$f":"'Data Compare Rel'!R12-'Data Base Rel'!R12","v":0},{"$f":"'Data Compare Rel'!S12-'Data Base Rel'!S12","v":0},{"$f":"'Data Compare Rel'!T12-'Data Base Rel'!T12","v":0},{"$f":"'Data Compare Rel'!U12-'Data Base Rel'!U12","v":0},{"$f":"'Data Compare Rel'!V12-'Data Base Rel'!V12","v":0},{"$f":"'Data Compare Rel'!W12-'Data Base Rel'!W12","v":0}]
[null,null,"Solar",{"$f":"'Data Compare Rel'!D13-'Data Base Rel'!D13","v":0},{"$f":"'Data Compare Rel'!E13-'Data Base Rel'!E13","v":0},{"$f":"'Data Compare Rel'!F13-'Data Base Rel'!F13","v":0},{"$f":"'Data Compare Rel'!G13-'Data Base Rel'!G13","v":0},{"$f":"'Data Compare Rel'!H13-'Data Base Rel'!H13","v":0},{"$f":"'Data Compare Rel'!I13-'Data Base Rel'!I13","v":0},{"$f":"'Data Compare Rel'!J13-'Data Base Rel'!J13","v":0},{"$f":"'Data Compare Rel'!K13-'Data Base Rel'!K13","v":0},{"$f":"'Data Compare Rel'!L13-'Data Base Rel'!L13","v":0},{"$f":"'Data Compare Rel'!M13-'Data Base Rel'!M13","v":0},{"$f":"'Data Compare Rel'!N13-'Data Base Rel'!N13","v":0},{"$f":"'Data Compare Rel'!O13-'Data Base Rel'!O13","v":0},{"$f":"'Data Compare Rel'!P13-'Data Base Rel'!P13","v":0},{"$f":"'Data Compare Rel'!Q13-'Data Base Rel'!Q13","v":0},{"$f":"'Data Compare Rel'!R13-'Data Base Rel'!R13","v":0},{"$f":"'Data Compare Rel'!S13-'Data Base Rel'!S13","v":0},{"$f":"'Data Compare Rel'!T13-'Data Base Rel'!T13","v":0},{"$f":"'Data Compare Rel'!U13-'Data Base Rel'!U13","v":0},{"$f":"'Data Compare Rel'!V13-'Data Base Rel'!V13","v":0},{"$f":"'Data Compare Rel'!W13-'Data Base Rel'!W13","v":0}]
[null,null,"Wind+Bat",{"$f":"'Data Compare Rel'!D14-'Data Base Rel'!D14","v":0},{"$f":"'Data Compare Rel'!E14-'Data Base Rel'!E14","v":0},{"$f":"'Data Compare Rel'!F14-'Data Base Rel'!F14","v":0},{"$f":"'Data Compare Rel'!G14-'Data Base Rel'!G14","v":0},{"$f":"'Data Compare Rel'!H14-'Data Base Rel'!H14","v":0},{"$f":"'Data Compare Rel'!I14-'Data Base Rel'!I14","v":0},{"$f":"'Data Compare Rel'!J14-'Data Base Rel'!J14","v":0},{"$f":"'Data Compare Rel'!K14-'Data Base Rel'!K14","v":0},{"$f":"'Data Compare Rel'!L14-'Data Base Rel'!L14","v":0},{"$f":"'Data Compare Rel'!M14-'Data Base Rel'!M14","v":0},{"$f":"'Data Compare Rel'!N14-'Data Base Rel'!N14","v":-9.8000000000000007},{"$f":"'Data Compare Rel'!O14-'Data Base Rel'!O14","v":30.2},{"$f":"'Data Compare Rel'!P14-'Data Base Rel'!P14","v":0},{"$f":"'Data Compare Rel'!Q14-'Data Base Rel'!Q14","v":15.800000000000004},{"$f":"'Data Compare Rel'!R14-'Data Base Rel'!R14","v":0},{"$f":"'Data Compare Rel'!S14-'Data Base Rel'!S14","v":0},{"$f":"'Data Compare Rel'!T14-'Data Base Rel'!T14","v":0},{"$f":"'Data Compare Rel'!U14-'Data Base Rel'!U14","v":0},{"$f":"'Data Compare Rel'!V14-'Data Base Rel'!V14","v":-10.6},{"$f":"'Data Compare Rel'!W14-'Data Base Rel'!W14","v":0}]
[null,null,"Solar+Bat",{"$f":"'Data Compare Rel'!D15-'Data Base Rel'!D15","v":0},{"$f":"'Data Compare Rel'!E15-'Data Base Rel'!E15","v":0},{"$f":"'Data Compare Rel'!F15-'Data Base Rel'!F15","v":0},{"$f":"'Data Compare Rel'!G15-'Data Base Rel'!G15","v":0},{"$f":"'Data Compare Rel'!H15-'Data Base Rel'!H15","v":69.399999999999991},{"$f":"'Data Compare Rel'!I15-'Data Base Rel'!I15","v":9.5999999999999091},{"$f":"'Data Compare Rel'!J15-'Data Base Rel'!J15","v":0},{"$f":"'Data Compare Rel'!K15-'Data Base Rel'!K15","v":0},{"$f":"'Data Compare Rel'!L15-'Data Base Rel'!L15","v":0},{"$f":"'Data Compare Rel'!M15-'Data Base Rel'!M15","v":0},{"$f":"'Data Compare Rel'!N15-'Data Base Rel'!N15","v":0},{"$f":"'Data Compare Rel'!O15-'Data Base Rel'!O15","v":-500},{"$f":"'Data Compare Rel'!P15-'Data Base Rel'!P15","v":500},{"$f":"'Data Compare Rel'!Q15-'Data Base Rel'!Q15","v":475},{"$f":"'Data Compare Rel'!R15-'Data Base Rel'!R15","v":-375},{"$f":"'Data Compare Rel'!S15-'Data Base Rel'!S15","v":0},{"$f":"'Data Compare Rel'!T15-'Data Base Rel'!T15","v":0},{"$f":"'Data Compare Rel'!U15-'Data Base Rel'!U15","v":-419.4},{"$f":"'Data Compare Rel'!V15-'Data Base Rel'!V15","v":-5},{"$f":"'Data Compare Rel'!W15-'Data Base Rel'!W15","v":5}]
[null,null,"Battery",{"$f":"'Data Compare Rel'!D16-'Data Base Rel'!D16","v":0},{"$f":"'Data Compare Rel'!E16-'Data Base Rel'!E16","v":0},{"$f":"'Data Compare Rel'!F16-'Data Base Rel'!F16","v":0},{"$f":"'Data Compare Rel'!G16-'Data Base Rel'!G16","v":0},{"$f":"'Data Compare Rel'!H16-'Data Base Rel'!H16","v":0},{"$f":"'Data Compare Rel'!I16-'Data Base Rel'!I16","v":0},{"$f":"'Data Compare Rel'!J16-'Data Base Rel'!J16","v":0},{"$f":"'Data Compare Rel'!K16-'Data Base Rel'!K16","v":0},{"$f":"'Data Compare Rel'!L16-'Data Base Rel'!L16","v":0},{"$f":"'Data Compare Rel'!M16-'Data Base Rel'!M16","v":60},{"$f":"'Data Compare Rel'!N16-'Data Base Rel'!N16","v":-435},{"$f":"'Data Compare Rel'!O16-'Data Base Rel'!O16","v":330},{"$f":"'Data Compare Rel'!P16-'Data Base Rel'!P16","v":-30},{"$f":"'Data Compare Rel'!Q16-'Data Base Rel'!Q16","v":-75},{"$f":"'Data Compare Rel'!R16-'Data Base Rel'!R16","v":195},{"$f":"'Data Compare Rel'!S16-'Data Base Rel'!S16","v":0},{"$f":"'Data Compare Rel'!T16-'Data Base Rel'!T16","v":0},{"$f":"'Data Compare Rel'!U16-'Data Base Rel'!U16","v":0},{"$f":"'Data Compare Rel'!V16-'Data Base Rel'!V16","v":120},{"$f":"'Data Compare Rel'!W16-'Data Base Rel'!W16","v":-135}]
[null,null,"Pumped Storage",{"$f":"'Data Compare Rel'!D17-'Data Base Rel'!D17","v":0},{"$f":"'Data Compare Rel'!E17-'Data Base Rel'!E17","v":0},{"$f":"'Data Compare Rel'!F17-'Data Base Rel'!F17","v":0},{"$f":"'Data Compare Rel'!G17-'Data Base Rel'!G17","v":0},{"$f":"'Data Compare Rel'!H17-'Data Base Rel'!H17","v":0},{"$f":"'Data Compare Rel'!I17-'Data Base Rel'!I17","v":0},{"$f":"'Data Compare Rel'!J17-'Data Base Rel'!J17","v":0},{"$f":"'Data Compare Rel'!K17-'Data Base Rel'!K17","v":0},{"$f":"'Data Compare Rel'!L17-'Data Base Rel'!L17","v":0},{"$f":"'Data Compare Rel'!M17-'Data Base Rel'!M17","v":0},{"$f":"'Data Compare Rel'!N17-'Data Base Rel'!N17","v":0},{"$f":"'Data Compare Rel'!O17-'Data Base Rel'!O17","v":0},{"$f":"'Data Compare Rel'!P17-'Data Base Rel'!P17","v":0},{"$f":"'Data Compare Rel'!Q17-'Data Base Rel'!Q17","v":0},{"$f":"'Data Compare Rel'!R17-'Data Base Rel'!R17","v":0},{"$f":"'Data Compare Rel'!S17-'Data Base Rel'!S17","v":0},{"$f":"'Data Compare Rel'!T17-'Data Base Rel'!T17","v":0},{"$f":"'Data Compare Rel'!U17-'Data Base Rel'!U17","v":0},{"$f":"'Data Compare Rel'!V17-'Data Base Rel'!V17","v":0},{"$f":"'Data Compare Rel'!W17-'Data Base Rel'!W17","v":0}]
[null,null,"Gas Peaker",{"$f":"'Data Compare Rel'!D34-'Data Base Rel'!D34","v":0},{"$f":"'Data Compare Rel'!E34-'Data Base Rel'!E34","v":0},{"$f":"'Data Compare Rel'!F34-'Data Base Rel'!F34","v":0},{"$f":"'Data Compare Rel'!G34-'Data Base Rel'!G34","v":0},{"$f":"'Data Compare Rel'!H34-'Data Base Rel'!H34","v":0},{"$f":"'Data Compare Rel'!I34-'Data Base Rel'!I34","v":0},{"$f":"'Data Compare Rel'!J34-'Data Base Rel'!J34","v":0},{"$f":"'Data Compare Rel'!K34-'Data Base Rel'!K34","v":-184.9},{"$f":"'Data Compare Rel'!L34-'Data Base Rel'!L34","v":0},{"$f":"'Data Compare Rel'!M34-'Data Base Rel'!M34","v":0},{"$f":"'Data Compare Rel'!N34-'Data Base Rel'!N34","v":0},{"$f":"'Data Compare Rel'!O34-'Data Base Rel'!O34","v":184.90000000000003},{"$f":"'Data Compare Rel'!P34-'Data Base Rel'!P34","v":0},{"$f":"'Data Compare Rel'!Q34-'Data Base Rel'!Q34","v":0},{"$f":"'Data Compare Rel'!R34-'Data Base Rel'!R34","v":0},{"$f":"'Data Compare Rel'!S34-'Data Base Rel'!S34","v":0},{"$f":"'Data Compare Rel'!T34-'Data Base Rel'!T34","v":0},{"$f":"'Data Compare Rel'!U34-'Data Base Rel'!U34","v":0},{"$f":"'Data Compare Rel'!V34-'Data Base Rel'!V34","v":0},{"$f":"'Data Compare Rel'!W34-'Data Base Rel'!W34","v":0}]
[null,null,"Gas CCCT",{"$f":"'Data Compare Rel'!D35-'Data Base Rel'!D35","v":0},{"$f":"'Data Compare Rel'!E35-'Data Base Rel'!E35","v":0},{"$f":"'Data Compare Rel'!F35-'Data Base Rel'!F35","v":0},{"$f":"'Data Compare Rel'!G35-'Data Base Rel'!G35","v":0},{"$f":"'Data Compare Rel'!H35-'Data Base Rel'!H35","v":0},{"$f":"'Data Compare Rel'!I35-'Data Base Rel'!I35","v":0},{"$f":"'Data Compare Rel'!J35-'Data Base Rel'!J35","v":0},{"$f":"'Data Compare Rel'!K35-'Data Base Rel'!K35","v":0},{"$f":"'Data Compare Rel'!L35-'Data Base Rel'!L35","v":0},{"$f":"'Data Compare Rel'!M35-'Data Base Rel'!M35","v":0},{"$f":"'Data Compare Rel'!N35-'Data Base Rel'!N35","v":0},{"$f":"'Data Compare Rel'!O35-'Data Base Rel'!O35","v":0},{"$f":"'Data Compare Rel'!P35-'Data Base Rel'!P35","v":0},{"$f":"'Data Compare Rel'!Q35-'Data Base Rel'!Q35","v":0},{"$f":"'Data Compare Rel'!R35-'Data Base Rel'!R35","v":0},{"$f":"'Data Compare Rel'!S35-'Data Base Rel'!S35","v":0},{"$f":"'Data Compare Rel'!T35-'Data Base Rel'!T35","v":0},{"$f":"'Data Compare Rel'!U35-'Data Base Rel'!U35","v":0},{"$f":"'Data Compare Rel'!V35-'Data Base Rel'!V35","v":0},{"$f":"'Data Compare Rel'!W35-'Data Base Rel'!W35","v":0}]
[null,null,"Class 2 DSM",{"$f":"'Data Compare Rel'!D47-'Data Base Rel'!D47","v":0},{"$f":"'Data Compare Rel'!E47-'Data Base Rel'!E47","v":-1.6499999999999773},{"$f":"'Data Compare Rel'!F47-'Data Base Rel'!F47","v":0},{"$f":"'Data Compare Rel'!G47-'Data Base Rel'!G47","v":-4.4300000000000068},{"$f":"'Data Compare Rel'!H47-'Data Base Rel'!H47","v":-2.660000000000025},{"$f":"'Data Compare Rel'!I47-'Data Base Rel'!I47","v":-2.1599999999999966},{"$f":"'Data Compare Rel'!J47-'Data Base Rel'!J47","v":-0.1899999999999693},{"$f":"'Data Compare Rel'!K47-'Data Base Rel'!K47","v":-0.18000000000000682},{"$f":"'Data Compare Rel'!L47-'Data Base Rel'!L47","v":-1.8799999999999955},{"$f":"'Data Compare Rel'!M47-'Data Base Rel'!M47","v":-6.0000000000002274E-2},{"$f":"'Data Compare Rel'!N47-'Data Base Rel'!N47","v":-0.25},{"$f":"'Data Compare Rel'!O47-'Data Base Rel'!O47","v":2.7199999999999989},{"$f":"'Data Compare Rel'!P47-'Data Base Rel'!P47","v":-4.0000000000006253E-2},{"$f":"'Data Compare Rel'!Q47-'Data Base Rel'!Q47","v":-2.0100000000000193},{"$f":"'Data Compare Rel'!R47-'Data Base Rel'!R47","v":6.3700000000000045},{"$f":"'Data Compare Rel'!S47-'Data Base Rel'!S47","v":8.0000000000012506E-2},{"$f":"'Data Compare Rel'!T47-'Data Base Rel'!T47","v":0.42999999999999261},{"$f":"'Data Compare Rel'!U47-'Data Base Rel'!U47","v":3.7500000000000142},{"$f":"'Data Compare Rel'!V47-'Data Base Rel'!V47","v":3.0500000000000114},{"$f":"'Data Compare Rel'!W47-'Data Base Rel'!W47","v":4.029999999999994}]
[null,null,"Class 1 DSM",{"$f":"'Data Compare Rel'!D48-'Data Base Rel'!D48","v":0},{"$f":"'Data Compare Rel'!E48-'Data Base Rel'!E48","v":0},{"$f":"'Data Compare Rel'!F48-'Data Base Rel'!F48","v":0},{"$f":"'Data Compare Rel'!G48-'Data Base Rel'!G48","v":0},{"$f":"'Data Compare Rel'!H48-'Data Base Rel'!H48","v":0},{"$f":"'Data Compare Rel'!I48-'Data Base Rel'!I48","v":0},{"$f":"'Data Compare Rel'!J48-'Data Base Rel'!J48","v":0},{"$f":"'Data Compare Rel'!K48-'Data Base Rel'!K48","v":0},{"$f":"'Data Compare Rel'!L48-'Data Base Rel'!L48","v":0},{"$f":"'Data Compare Rel'!M48-'Data Base Rel'!M48","v":0},{"$f":"'Data Compare Rel'!N48-'Data Base Rel'!N48","v":-33.500999999999991},{"$f":"'Data Compare Rel'!O48-'Data Base Rel'!O48","v":25.989000000000004},{"$f":"'Data Compare Rel'!P48-'Data Base Rel'!P48","v":0},{"$f":"'Data Compare Rel'!Q48-'Data Base Rel'!Q48","v":7.5120000000000005},{"$f":"'Data Compare Rel'!R48-'Data Base Rel'!R48","v":0},{"$f":"'Data Compare Rel'!S48-'Data Base Rel'!S48","v":0},{"$f":"'Data Compare Rel'!T48-'Data Base Rel'!T48","v":-8.3350000000000009},{"$f":"'Data Compare Rel'!U48-'Data Base Rel'!U48","v":-3.6539999999999999},{"$f":"'Data Compare Rel'!V48-'Data Base Rel'!V48","v":-22.468000000000004},{"$f":"'Data Compare Rel'!W48-'Data Base Rel'!W48","v":-62.899000000000001}]
[null,null,"FOT",{"$f":"D45","v":-7.6999999999998181E-2},{"$f":"E45","v":9.9999999999909051E-2},0.56000000000000227,1.1999999999999886,1.7599999999999909,44.075000000000017,42.08,6.8000000000000114,-20.680000000000007,-57.029999999999973,-75.569999999999936,101.36999999999989,106.52999999999997,-61.379999999999882,2.3099999999999454,-18.990000000000009,-22.986999999999853,86.437000000000126,0.52500000000009095,-12.636999999999944]
[null,null,"Existing Cap Removed",{"$f":"('Data Compare Rel'!D5-'Data Base Rel'!D5)+(SUM('Data Compare Rel'!D18:D21)-SUM('Data Base Rel'!D18:D21))+('Data Compare Rel'!D37-'Data Base Rel'!D37)","v":0},{"$f":"('Data Compare Rel'!E5-'Data Base Rel'!E5)+(SUM('Data Compare Rel'!E18:E21)-SUM('Data Base Rel'!E18:E21))+('Data Compare Rel'!E37-'Data Base Rel'!E37)","v":0},{"$f":"('Data Compare Rel'!F5-'Data Base Rel'!F5)+(SUM('Data Compare Rel'!F18:F21)-SUM('Data Base Rel'!F18:F21))+('Data Compare Rel'!F37-'Data Base Rel'!F37)","v":0},{"$f":"('Data Compare Rel'!G5-'Data Base Rel'!G5)+(SUM('Data Compare Rel'!G18:G21)-SUM('Data Base Rel'!G18:G21))+('Data Compare Rel'!G37-'Data Base Rel'!G37)","v":0},{"$f":"('Data Compare Rel'!H5-'Data Base Rel'!H5)+(SUM('Data Compare Rel'!H18:H21)-SUM('Data Base Rel'!H18:H21))+('Data Compare Rel'!H37-'Data Base Rel'!H37)","v":0},{"$f":"('Data Compare Rel'!I5-'Data Base Rel'!I5)+(SUM('Data Compare Rel'!I18:I21)-SUM('Data Base Rel'!I18:I21))+('Data Compare Rel'!I37-'Data Base Rel'!I37)","v":0},{"$f":"('Data Compare Rel'!J5-'Data Base Rel'!J5)+(SUM('Data Compare Rel'!J18:J21)-SUM('Data Base Rel'!J18:J21))+('Data Compare Rel'!J37-'Data Base Rel'!J37)","v":0},{"$f":"('Data Compare Rel'!K5-'Data Base Rel'!K5)+(SUM('Data Compare Rel'!K18:K21)-SUM('Data Base Rel'!K18:K21))+('Data Compare Rel'!K37-'Data Base Rel'!K37)","v":0},{"$f":"('Data Compare Rel'!L5-'Data Base Rel'!L5)+(SUM('Data Compare Rel'!L18:L21)-SUM('Data Base Rel'!L18:L21))+('Data Compare Rel'!L37-'Data Base Rel'!L37)","v":0},{"$f":"('Data Compare Rel'!M5-'Data Base Rel'!M5)+(SUM('Data Compare Rel'!M18:M21)-SUM('Data Base Rel'!M18:M21))+('Data Compare Rel'!M37-'Data Base Rel'!M37)","v":0},{"$f":"('Data Compare Rel'!N5-'Data Base Rel'!N5)+(SUM('Data Compare Rel'!N18:N21)-SUM('Data Base Rel'!N18:N21))+('Data Compare Rel'!N37-'Data Base Rel'!N37)","v":0},{"$f":"('Data Compare Rel'!O5-'Data Base Rel'!O5)+(SUM('Data Compare Rel'!O18:O21)-SUM('Data Base Rel'!O18:O21))+('Data Compare Rel'!O37-'Data Base Rel'!O37)","v":0},{"$f":"('Data Compare Rel'!P5-'Data Base Rel'!P5)+(SUM('Data Compare Rel'!P18:P21)-SUM('Data Base Rel'!P18:P21))+('Data Compare Rel'!P37-'Data Base Rel'!P37)","v":0},{"$f":"('Data Compare Rel'!Q5-'Data Base Rel'!Q5)+(SUM('Data Compare Rel'!Q18:Q21)-SUM('Data Base Rel'!Q18:Q21))+('Data Compare Rel'!Q37-'Data Base Rel'!Q37)","v":0},{"$f":"('Data Compare Rel'!R5-'Data Base Rel'!R5)+(SUM('Data Compare Rel'!R18:R21)-SUM('Data Base Rel'!R18:R21))+('Data Compare Rel'!R37-'Data Base Rel'!R37)","v":0},{"$f":"('Data Compare Rel'!S5-'Data Base Rel'!S5)+(SUM('Data Compare Rel'!S18:S21)-SUM('Data Base Rel'!S18:S21))+('Data Compare Rel'!S37-'Data Base Rel'!S37)","v":0},{"$f":"('Data Compare Rel'!T5-'Data Base Rel'!T5)+(SUM('Data Compare Rel'!T18:T21)-SUM('Data Base Rel'!T18:T21))+('Data Compare Rel'!T37-'Data Base Rel'!T37)","v":0},{"$f":"('Data Compare Rel'!U5-'Data Base Rel'!U5)+(SUM('Data Compare Rel'!U18:U21)-SUM('Data Base Rel'!U18:U21))+('Data Compare Rel'!U37-'Data Base Rel'!U37)","v":0},{"$f":"('Data Compare Rel'!V5-'Data Base Rel'!V5)+(SUM('Data Compare Rel'!V18:V21)-SUM('Data Base Rel'!V18:V21))+('Data Compare Rel'!V37-'Data Base Rel'!V37)","v":0},{"$f":"('Data Compare Rel'!W5-'Data Base Rel'!W5)+(SUM('Data Compare Rel'!W18:W21)-SUM('Data Base Rel'!W18:W21))+('Data Compare Rel'!W37-'Data Base Rel'!W37)","v":0}]
[]
[null,null,"DR",6.9199999999999998E-2]
[]
[]
[null,null,"Replacement Portfolio","Avg","Nom. Lev. Cost"]
[null,null,"Wind",{"$f":"AVERAGE(H9:W9)","v":-95.075000000000173}]
[null,null,"Solar",0]
[null,null,"Wind+Bat",16.450000000000003]
[null,null,"Solar+Bat",35.387499999999932]
[null,null,"Battery",-13.125]
[null,null,"Pumped Storage",0]
[null,null,"Gas Peaker",{"$f":"AVERAGE(H19:W19)","v":-46.225000000000001}]
[null,null,"Gas CCCT",{"$f":"AVERAGE(H20:W20)","v":0}]
[null,null,"Class 2 DSM",{"$f":"AVERAGE(H44:W44)","v":-8.1968749999999773}]
[null,null,"Class 1 DSM",{"$f":"AVERAGE(H27:W27)","v":-12.541374999999997}]
[null,null,"FOT",{"$f":"AVERAGE(H31:W31)","v":7.6633125000000284}]
[null,null,"Coal Removed",{"$f":"AVERAGE(H5:W5)","v":0}]

{"sheet":"Delta Pre-reliability","index":2,"n_rows":48,"n_cols":30,"rows_kept":48,"cut":false,"hidden":false,"merged":[]}
[]
[]
[null,null,"Coal",null,null,null,null,null,null,null,null,null,null,null,null,null,null,null,null,null,null,null,null,null,null,null,null,null,null,"Pre-Reliability"]
[null,null,"Cumulative",2019,2020,2021,2022,2023,2024,2025,2026,2027,2028,2029,2030,2031,2032,2033,2034,2035,2036,2037,2038]
[null,null,"Coal Removed",{"$f":"'Data Compare Pre'!D8-'Data Base Pre'!D8","v":0},{"$f":"'Data Compare Pre'!E8-'Data Base Pre'!E8","v":0},{"$f":"'Data Compare Pre'!F8-'Data Base Pre'!F8","v":0},{"$f":"'Data Compare Pre'!G8-'Data Base Pre'!G8","v":0},{"$f":"'Data Compare Pre'!H8-'Data Base Pre'!H8","v":0},{"$f":"'Data Compare Pre'!I8-'Data Base Pre'!I8","v":0},{"$f":"'Data Compare Pre'!J8-'Data Base Pre'!J8","v":0},{"$f":"'Data Compare Pre'!K8-'Data Base Pre'!K8","v":0},{"$f":"'Data Compare Pre'!L8-'Data Base Pre'!L8","v":0},{"$f":"'Data Compare Pre'!M8-'Data Base Pre'!M8","v":0},{"$f":"'Data Compare Pre'!N8-'Data Base Pre'!N8","v":0},{"$f":"'Data Compare Pre'!O8-'Data Base Pre'!O8","v":0},{"$f":"'Data Compare Pre'!P8-'Data Base Pre'!P8","v":0},{"$f":"'Data Compare Pre'!Q8-'Data Base Pre'!Q8","v":0},{"$f":"'Data Compare Pre'!R8-'Data Base Pre'!R8","v":0},{"$f":"'Data Compare Pre'!S8-'Data Base Pre'!S8","v":0},{"$f":"'Data Compare Pre'!T8-'Data Base Pre'!T8","v":0},{"$f":"'Data Compare Pre'!U8-'Data Base Pre'!U8","v":0},{"$f":"'Data Compare Pre'!V8-'Data Base Pre'!V8","v":0},{"$f":"'Data Compare Pre'!W8-'Data Base Pre'!W8","v":0}]
[]
[null,null,"Renewable and Storage"]
[null,null,"Cumulative",2019,2020,2021,2022,2023,2024,2025,2026,2027,2028,2029,2030,2031,2032,2033,2034,2035,2036,2037,2038,null,"Wind","Solar","Battery"]
[null,null,"Wind",{"$f":"'Data Compare Pre'!D24-'Data Base Pre'!D24","v":0},{"$f":"'Data Compare Pre'!E24-'Data Base Pre'!E24","v":0},{"$f":"'Data Compare Pre'!F24-'Data Base Pre'!F24","v":0},{"$f":"'Data Compare Pre'!G24-'Data Base Pre'!G24","v":0},{"$f":"'Data Compare Pre'!H24-'Data Base Pre'!H24","v":-69.215999999999994},{"$f":"'Data Compare Pre'!I24-'Data Base Pre'!I24","v":-69.215999999999894},{"$f":"'Data Compare Pre'!J24-'Data Base Pre'!J24","v":-69.215999999999894},{"$f":"'Data Compare Pre'!K24-'Data Base Pre'!K24","v":-69.215999999999894},{"$f":"'Data Compare Pre'!L24-'Data Base Pre'!L24","v":-69.215999999999894},{"$f":"'Data Compare Pre'!M24-'Data Base Pre'!M24","v":-69.215999999999894},{"$f":"'Data Compare Pre'!N24-'Data Base Pre'!N24","v":-69.215999999999894},{"$f":"'Data Compare Pre'!O24-'Data Base Pre'!O24","v":-115.17999999999984},{"$f":"'Data Compare Pre'!P24-'Data Base Pre'!P24","v":-115.17999999999984},{"$f":"'Data Compare Pre'!Q24-'Data Base Pre'!Q24","v":-115.17999999999984},{"$f":"'Data Compare Pre'!R24-'Data Base Pre'!R24","v":-115.17999999999984},{"$f":"'Data Compare Pre'!S24-'Data Base Pre'!S24","v":-115.17999999999984},{"$f":"'Data Compare Pre'!T24-'Data Base Pre'!T24","v":-115.17999999999984},{"$f":"'Data Compare Pre'!U24-'Data Base Pre'!U24","v":-115.17999999999984},{"$f":"'Data Compare Pre'!V24-'Data Base Pre'!V24","v":-115.17999999999984},{"$f":"'Data Compare Pre'!W24-'Data Base Pre'!W24","v":-115.17999999999984},null,{"$f":"'Data Compare Pre'!Y24-'Data Base Pre'!Y24","v":-89.583999999999833},{"$f":"'Data Compare Pre'!Z24-'Data Base Pre'!Z24","v":-240.41699999999946},{"$f":"0.25*W11+0.25*W12+W13","v":-173.70524999999986}]
[null,null,"Solar",{"$f":"'Data Compare Pre'!D25-'Data Base Pre'!D25","v":0},{"$f":"'Data Compare Pre'!E25-'Data Base Pre'!E25","v":0},{"$f":"'Data Compare Pre'!F25-'Data Base Pre'!F25","v":0},{"$f":"'Data Compare Pre'!G25-'Data Base Pre'!G25","v":0},{"$f":"'Data Compare Pre'!H25-'Data Base Pre'!H25","v":0},{"$f":"'Data Compare Pre'!I25-'Data Base Pre'!I25","v":0},{"$f":"'Data Compare Pre'!J25-'Data Base Pre'!J25","v":0},{"$f":"'Data Compare Pre'!K25-'Data Base Pre'!K25","v":0},{"$f":"'Data Compare Pre'!L25-'Data Base Pre'!L25","v":0},{"$f":"'Data Compare Pre'!M25-'Data Base Pre'!M25","v":0},{"$f":"'Data Compare Pre'!N25-'Data Base Pre'!N25","v":0},{"$f":"'Data Compare Pre'!O25-'Data Base Pre'!O25","v":0},{"$f":"'Data Compare Pre'!P25-'Data Base Pre'!P25","v":0},{"$f":"'Data Compare Pre'!Q25-'Data Base Pre'!Q25","v":0},{"$f":"'Data Compare Pre'!R25-'Data Base Pre'!R25","v":0},{"$f":"'Data Compare Pre'!S25-'Data Base Pre'!S25","v":0},{"$f":"'Data Compare Pre'!T25-'Data Base Pre'!T25","v":0},{"$f":"'Data Compare Pre'!U25-'Data Base Pre'!U25","v":0},{"$f":"'Data Compare Pre'!V25-'Data Base Pre'!V25","v":0},{"$f":"'Data Compare Pre'!W25-'Data Base Pre'!W25","v":0}]
[null,null,"Wind+Bat",{"$f":"'Data Compare Pre'!D26-'Data Base Pre'!D26","v":0},{"$f":"'Data Compare Pre'!E26-'Data Base Pre'!E26","v":0},{"$f":"'Data Compare Pre'!F26-'Data Base Pre'!F26","v":0},{"$f":"'Data Compare Pre'!G26-'Data Base Pre'!G26","v":0},{"$f":"'Data Compare Pre'!H26-'Data Base Pre'!H26","v":0},{"$f":"'Data Compare Pre'!I26-'Data Base Pre'!I26","v":0},{"$f":"'Data Compare Pre'!J26-'Data Base Pre'!J26","v":0},{"$f":"'Data Compare Pre'!K26-'Data Base Pre'!K26","v":0},{"$f":"'Data Compare Pre'!L26-'Data Base Pre'!L26","v":0},{"$f":"'Data Compare Pre'!M26-'Data Base Pre'!M26","v":0},{"$f":"'Data Compare Pre'!N26-'Data Base Pre'!N26","v":-9.7910000000000004},{"$f":"'Data Compare Pre'!O26-'Data Base Pre'!O26","v":20.462},{"$f":"'Data Compare Pre'!P26-'Data Base Pre'!P26","v":20.462},{"$f":"'Data Compare Pre'!Q26-'Data Base Pre'!Q26","v":36.172999999999988},{"$f":"'Data Compare Pre'!R26-'Data Base Pre'!R26","v":36.172999999999988},{"$f":"'Data Compare Pre'!S26-'Data Base Pre'!S26","v":36.172999999999988},{"$f":"'Data Compare Pre'!T26-'Data Base Pre'!T26","v":36.172999999999988},{"$f":"'Data Compare Pre'!U26-'Data Base Pre'!U26","v":36.172999999999988},{"$f":"'Data Compare Pre'!V26-'Data Base Pre'!V26","v":25.595999999999989},{"$f":"'Data Compare Pre'!W26-'Data Base Pre'!W26","v":25.595999999999989}]
[null,null,"Solar+Bat",{"$f":"'Data Compare Pre'!D27-'Data Base Pre'!D27","v":0},{"$f":"'Data Compare Pre'!E27-'Data Base Pre'!E27","v":0},{"$f":"'Data Compare Pre'!F27-'Data Base Pre'!F27","v":-2.0999999999986585E-2},{"$f":"'Data Compare Pre'!G27-'Data Base Pre'!G27","v":-4.2000000000001592E-2},{"$f":"'Data Compare Pre'!H27-'Data Base Pre'!H27","v":69.35299999999998},{"$f":"'Data Compare Pre'!I27-'Data Base Pre'!I27","v":79.006000000000313},{"$f":"'Data Compare Pre'!J27-'Data Base Pre'!J27","v":79.006000000000313},{"$f":"'Data Compare Pre'!K27-'Data Base Pre'!K27","v":79.006000000000313},{"$f":"'Data Compare Pre'!L27-'Data Base Pre'!L27","v":79.006000000000313},{"$f":"'Data Compare Pre'!M27-'Data Base Pre'!M27","v":79.006000000000313},{"$f":"'Data Compare Pre'!N27-'Data Base Pre'!N27","v":79.006000000000313},{"$f":"'Data Compare Pre'!O27-'Data Base Pre'!O27","v":-420.99399999999969},{"$f":"'Data Compare Pre'!P27-'Data Base Pre'!P27","v":79.006000000000313},{"$f":"'Data Compare Pre'!Q27-'Data Base Pre'!Q27","v":554.00600000000031},{"$f":"'Data Compare Pre'!R27-'Data Base Pre'!R27","v":179.00600000000031},{"$f":"'Data Compare Pre'!S27-'Data Base Pre'!S27","v":179.00600000000031},{"$f":"'Data Compare Pre'!T27-'Data Base Pre'!T27","v":179.00600000000031},{"$f":"'Data Compare Pre'!U27-'Data Base Pre'!U27","v":-240.41699999999992},{"$f":"'Data Compare Pre'!V27-'Data Base Pre'!V27","v":-245.39300000000003},{"$f":"'Data Compare Pre'!W27-'Data Base Pre'!W27","v":-240.41699999999946}]
[null,null,"Battery",{"$f":"'Data Compare Pre'!D28-'Data Base Pre'!D28","v":0},{"$f":"'Data Compare Pre'!E28-'Data Base Pre'!E28","v":0},{"$f":"'Data Compare Pre'!F28-'Data Base Pre'!F28","v":0},{"$f":"'Data Compare Pre'!G28-'Data Base Pre'!G28","v":0},{"$f":"'Data Compare Pre'!H28-'Data Base Pre'!H28","v":0},{"$f":"'Data Compare Pre'!I28-'Data Base Pre'!I28","v":0},{"$f":"'Data Compare Pre'!J28-'Data Base Pre'!J28","v":0},{"$f":"'Data Compare Pre'!K28-'Data Base Pre'!K28","v":0},{"$f":"'Data Compare Pre'!L28-'Data Base Pre'!L28","v":0},{"$f":"'Data Compare Pre'!M28-'Data Base Pre'!M28","v":0},{"$f":"'Data Compare Pre'!N28-'Data Base Pre'!N28","v":0},{"$f":"'Data Compare Pre'!O28-'Data Base Pre'!O28","v":0},{"$f":"'Data Compare Pre'!P28-'Data Base Pre'!P28","v":0},{"$f":"'Data Compare Pre'!Q28-'Data Base Pre'!Q28","v":0},{"$f":"'Data Compare Pre'!R28-'Data Base Pre'!R28","v":0},{"$f":"'Data Compare Pre'!S28-'Data Base Pre'!S28","v":0},{"$f":"'Data Compare Pre'!T28-'Data Base Pre'!T28","v":0},{"$f":"'Data Compare Pre'!U28-'Data Base Pre'!U28","v":0},{"$f":"'Data Compare Pre'!V28-'Data Base Pre'!V28","v":0},{"$f":"'Data Compare Pre'!W28-'Data Base Pre'!W28","v":-120}]
[null,null,"Pumped Storage",{"$f":"'Data Compare Pre'!D29-'Data Base Pre'!D29","v":0},{"$f":"'Data Compare Pre'!E29-'Data Base Pre'!E29","v":0},{"$f":"'Data Compare Pre'!F29-'Data Base Pre'!F29","v":0},{"$f":"'Data Compare Pre'!G29-'Data Base Pre'!G29","v":0},{"$f":"'Data Compare Pre'!H29-'Data Base Pre'!H29","v":0},{"$f":"'Data Compare Pre'!I29-'Data Base Pre'!I29","v":0},{"$f":"'Data Compare Pre'!J29-'Data Base Pre'!J29","v":0},{"$f":"'Data Compare Pre'!K29-'Data Base Pre'!K29","v":0},{"$f":"'Data Compare Pre'!L29-'Data Base Pre'!L29","v":0},{"$f":"'Data Compare Pre'!M29-'Data Base Pre'!M29","v":0},{"$f":"'Data Compare Pre'!N29-'Data Base Pre'!N29","v":0},{"$f":"'Data Compare Pre'!O29-'Data Base Pre'!O29","v":0},{"$f":"'Data Compare Pre'!P29-'Data Base Pre'!P29","v":0},{"$f":"'Data Compare Pre'!Q29-'Data Base Pre'!Q29","v":0},{"$f":"'Data Compare Pre'!R29-'Data Base Pre'!R29","v":0},{"$f":"'Data Compare Pre'!S29-'Data Base Pre'!S29","v":0},{"$f":"'Data Compare Pre'!T29-'Data Base Pre'!T29","v":0},{"$f":"'Data Compare Pre'!U29-'Data Base Pre'!U29","v":0},{"$f":"'Data Compare Pre'!V29-'Data Base Pre'!V29","v":0},{"$f":"'Data Compare Pre'!W29-'Data Base Pre'!W29","v":0}]
[null,null,"Renewable Removed",{"$f":"'Data Compare Pre'!D30-'Data Base Pre'!D30","v":0},{"$f":"'Data Compare Pre'!E30-'Data Base Pre'!E30","v":0},{"$f":"'Data Compare Pre'!F30-'Data Base Pre'!F30","v":0},{"$f":"'Data Compare Pre'!G30-'Data Base Pre'!G30","v":0},{"$f":"'Data Compare Pre'!H30-'Data Base Pre'!H30","v":0},{"$f":"'Data Compare Pre'!I30-'Data Base Pre'!I30","v":0},{"$f":"'Data Compare Pre'!J30-'Data Base Pre'!J30","v":0},{"$f":"'Data Compare Pre'!K30-'Data Base Pre'!K30","v":0},{"$f":"'Data Compare Pre'!L30-'Data Base Pre'!L30","v":0},{"$f":"'Data Compare Pre'!M30-'Data Base Pre'!M30","v":0},{"$f":"'Data Compare Pre'!N30-'Data Base Pre'!N30","v":0},{"$f":"'Data Compare Pre'!O30-'Data Base Pre'!O30","v":0},{"$f":"'Data Compare Pre'!P30-'Data Base Pre'!P30","v":0},{"$f":"'Data Compare Pre'!Q30-'Data Base Pre'!Q30","v":0},{"$f":"'Data Compare Pre'!R30-'Data Base Pre'!R30","v":0},{"$f":"'Data Compare Pre'!S30-'Data Base Pre'!S30","v":0},{"$f":"'Data Compare Pre'!T30-'Data Base Pre'!T30","v":0},{"$f":"'Data Compare Pre'!U30-'Data Base Pre'!U30","v":0},{"$f":"'Data Compare Pre'!V30-'Data Base Pre'!V30","v":0},{"$f":"'Data Compare Pre'!W30-'Data Base Pre'!W30","v":0}]
[]
[null,null,"Gas"]
[null,null,"Cumulative",2019,2020,2021,2022,2023,2024,2025,2026,2027,2028,2029,2030,2031,2032,2033,2034,2035,2036,2037,2038]
[null,null,"Gas Peaker",{"$f":"'Data Compare Pre'!D40-'Data Base Pre'!D40","v":0},{"$f":"'Data Compare Pre'!E40-'Data Base Pre'!E40","v":0},{"$f":"'Data Compare Pre'!F40-'Data Base Pre'!F40","v":0},{"$f":"'Data Compare Pre'!G40-'Data Base Pre'!G40","v":0},{"$f":"'Data Compare Pre'!H40-'Data Base Pre'!H40","v":0},{"$f":"'Data Compare Pre'!I40-'Data Base Pre'!I40","v":0},{"$f":"'Data Compare Pre'!J40-'Data Base Pre'!J40","v":0},{"$f":"'Data Compare Pre'!K40-'Data Base Pre'!K40","v":0},{"$f":"'Data Compare Pre'!L40-'Data Base Pre'!L40","v":0},{"$f":"'Data Compare Pre'!M40-'Data Base Pre'!M40","v":0},{"$f":"'Data Compare Pre'!N40-'Data Base Pre'!N40","v":0},{"$f":"'Data Compare Pre'!O40-'Data Base Pre'!O40","v":-184.9},{"$f":"'Data Compare Pre'!P40-'Data Base Pre'!P40","v":-369.8},{"$f":"'Data Compare Pre'!Q40-'Data Base Pre'!Q40","v":-369.8},{"$f":"'Data Compare Pre'!R40-'Data Base Pre'!R40","v":-369.80000000000007},{"$f":"'Data Compare Pre'!S40-'Data Base Pre'!S40","v":-369.80000000000007},{"$f":"'Data Compare Pre'!T40-'Data Base Pre'!T40","v":-369.80000000000007},{"$f":"'Data Compare Pre'!U40-'Data Base Pre'!U40","v":-369.80000000000007},{"$f":"'Data Compare Pre'!V40-'Data Base Pre'!V40","v":-221.40000000000009},{"$f":"'Data Compare Pre'!W40-'Data Base Pre'!W40","v":0}]
[null,null,"Gas CCCT",{"$f":"'Data Compare Pre'!D41-'Data Base Pre'!D41","v":0},{"$f":"'Data Compare Pre'!E41-'Data Base Pre'!E41","v":0},{"$f":"'Data Compare Pre'!F41-'Data Base Pre'!F41","v":0},{"$f":"'Data Compare Pre'!G41-'Data Base Pre'!G41","v":0},{"$f":"'Data Compare Pre'!H41-'Data Base Pre'!H41","v":0},{"$f":"'Data Compare Pre'!I41-'Data Base Pre'!I41","v":0},{"$f":"'Data Compare Pre'!J41-'Data Base Pre'!J41","v":0},{"$f":"'Data Compare Pre'!K41-'Data Base Pre'!K41","v":0},{"$f":"'Data Compare Pre'!L41-'Data Base Pre'!L41","v":0},{"$f":"'Data Compare Pre'!M41-'Data Base Pre'!M41","v":0},{"$f":"'Data Compare Pre'!N41-'Data Base Pre'!N41","v":0},{"$f":"'Data Compare Pre'!O41-'Data Base Pre'!O41","v":0},{"$f":"'Data Compare Pre'!P41-'Data Base Pre'!P41","v":0},{"$f":"'Data Compare Pre'!Q41-'Data Base Pre'!Q41","v":0},{"$f":"'Data Compare Pre'!R41-'Data Base Pre'!R41","v":0},{"$f":"'Data Compare Pre'!S41-'Data Base Pre'!S41","v":0},{"$f":"'Data Compare Pre'!T41-'Data Base Pre'!T41","v":0},{"$f":"'Data Compare Pre'!U41-'Data Base Pre'!U41","v":0},{"$f":"'Data Compare Pre'!V41-'Data Base Pre'!V41","v":0},{"$f":"'Data Compare Pre'!W41-'Data Base Pre'!W41","v":0}]
[null,null,"Gas Conv.",{"$f":"'Data Compare Pre'!D42-'Data Base Pre'!D42","v":0},{"$f":"'Data Compare Pre'!E42-'Data Base Pre'!E42","v":0},{"$f":"'Data Compare Pre'!F42-'Data Base Pre'!F42","v":0},{"$f":"'Data Compare Pre'!G42-'Data Base Pre'!G42","v":0},{"$f":"'Data Compare Pre'!H42-'Data Base Pre'!H42","v":0},{"$f":"'Data Compare Pre'!I42-'Data Base Pre'!I42","v":0},{"$f":"'Data Compare Pre'!J42-'Data Base Pre'!J42","v":0},{"$f":"'Data Compare Pre'!K42-'Data Base Pre'!K42","v":0},{"$f":"'Data Compare Pre'!L42-'Data Base Pre'!L42","v":0},{"$f":"'Data Compare Pre'!M42-'Data Base Pre'!M42","v":0},{"$f":"'Data Compare Pre'!N42-'Data Base Pre'!N42","v":0},{"$f":"'Data Compare Pre'!O42-'Data Base Pre'!O42","v":0},{"$f":"'Data Compare Pre'!P42-'Data Base Pre'!P42","v":0},{"$f":"'Data Compare Pre'!Q42-'Data Base Pre'!Q42","v":0},{"$f":"'Data Compare Pre'!R42-'Data Base Pre'!R42","v":0},{"$f":"'Data Compare Pre'!S42-'Data Base Pre'!S42","v":0},{"$f":"'Data Compare Pre'!T42-'Data Base Pre'!T42","v":0},{"$f":"'Data Compare Pre'!U42-'Data Base Pre'!U42","v":0},{"$f":"'Data Compare Pre'!V42-'Data Base Pre'!V42","v":0},{"$f":"'Data Compare Pre'!W42-'Data Base Pre'!W42","v":0}]
[null,null,"Gas Removed",{"$f":"'Data Compare Pre'!D43-'Data Base Pre'!D43","v":0},{"$f":"'Data Compare Pre'!E43-'Data Base Pre'!E43","v":0},{"$f":"'Data Compare Pre'!F43-'Data Base Pre'!F43","v":0},{"$f":"'Data Compare Pre'!G43-'Data Base Pre'!G43","v":0},{"$f":"'Data Compare Pre'!H43-'Data Base Pre'!H43","v":0},{"$f":"'Data Compare Pre'!I43-'Data Base Pre'!I43","v":0},{"$f":"'Data Compare Pre'!J43-'Data Base Pre'!J43","v":0},{"$f":"'Data Compare Pre'!K43-'Data Base Pre'!K43","v":0},{"$f":"'Data Compare Pre'!L43-'Data Base Pre'!L43","v":0},{"$f":"'Data Compare Pre'!M43-'Data Base Pre'!M43","v":0},{"$f":"'Data Compare Pre'!N43-'Data Base Pre'!N43","v":0},{"$f":"'Data Compare Pre'!O43-'Data Base Pre'!O43","v":0},{"$f":"'Data Compare Pre'!P43-'Data Base Pre'!P43","v":0},{"$f":"'Data Compare Pre'!Q43-'Data Base Pre'!Q43","v":0},{"$f":"'Data Compare Pre'!R43-'Data Base Pre'!R43","v":0},{"$f":"'Data Compare Pre'!S43-'Data Base Pre'!S43","v":0},{"$f":"'Data Compare Pre'!T43-'Data Base Pre'!T43","v":0},{"$f":"'Data Compare Pre'!U43-'Data Base Pre'!U43","v":0},{"$f":"'Data Compare Pre'!V43-'Data Base Pre'!V43","v":0},{"$f":"'Data Compare Pre'!W43-'Data Base Pre'!W43","v":0}]
[]
[null,null,"Demand-Side Management"]
[null,null,"Cumulative",2019,2020,2021,2022,2023,2024,2025,2026,2027,2028,2029,2030,2031,2032,2033,2034,2035,2036,2037,2038]
[null,null,"Class 2 DSM",{"$f":"'Data Compare Pre'!D51-'Data Base Pre'!D51","v":0},{"$f":"'Data Compare Pre'!E51-'Data Base Pre'!E51","v":0},{"$f":"'Data Compare Pre'!F51-'Data Base Pre'!F51","v":0},{"$f":"'Data Compare Pre'!G51-'Data Base Pre'!G51","v":-1.1599999999999682},{"$f":"'Data Compare Pre'!H51-'Data Base Pre'!H51","v":-1.1599999999998545},{"$f":"'Data Compare Pre'!I51-'Data Base Pre'!I51","v":-3.279999999999859},{"$f":"'Data Compare Pre'!J51-'Data Base Pre'!J51","v":-3.279999999999859},{"$f":"'Data Compare Pre'!K51-'Data Base Pre'!K51","v":-7.779999999999859},{"$f":"'Data Compare Pre'!L51-'Data Base Pre'!L51","v":-14.639999999999873},{"$f":"'Data Compare Pre'!M51-'Data Base Pre'!M51","v":-17.900000000000091},{"$f":"'Data Compare Pre'!N51-'Data Base Pre'!N51","v":-17.900000000000091},{"$f":"'Data Compare Pre'!O51-'Data Base Pre'!O51","v":-17.900000000000091},{"$f":"'Data Compare Pre'!P51-'Data Base Pre'!P51","v":-20.7800000000002},{"$f":"'Data Compare Pre'!Q51-'Data Base Pre'!Q51","v":-20.7800000000002},{"$f":"'Data Compare Pre'!R51-'Data Base Pre'!R51","v":-20.7800000000002},{"$f":"'Data Compare Pre'!S51-'Data Base Pre'!S51","v":-21.1700000000003},{"$f":"'Data Compare Pre'!T51-'Data Base Pre'!T51","v":-21.480000000000473},{"$f":"'Data Compare Pre'!U51-'Data Base Pre'!U51","v":-21.480000000000246},{"$f":"'Data Compare Pre'!V51-'Data Base Pre'!V51","v":-21.480000000000018},{"$f":"'Data Compare Pre'!W51-'Data Base Pre'!W51","v":-21.480000000000018}]
[null,null,"Class 1 DSM",{"$f":"'Data Compare Pre'!D52-'Data Base Pre'!D52","v":0},{"$f":"'Data Compare Pre'!E52-'Data Base Pre'!E52","v":0},{"$f":"'Data Compare Pre'!F52-'Data Base Pre'!F52","v":0},{"$f":"'Data Compare Pre'!G52-'Data Base Pre'!G52","v":0},{"$f":"'Data Compare Pre'!H52-'Data Base Pre'!H52","v":0},{"$f":"'Data Compare Pre'!I52-'Data Base Pre'!I52","v":0},{"$f":"'Data Compare Pre'!J52-'Data Base Pre'!J52","v":0},{"$f":"'Data Compare Pre'!K52-'Data Base Pre'!K52","v":0},{"$f":"'Data Compare Pre'!L52-'Data Base Pre'!L52","v":0},{"$f":"'Data Compare Pre'!M52-'Data Base Pre'!M52","v":0},{"$f":"'Data Compare Pre'!N52-'Data Base Pre'!N52","v":-33.501000000000005},{"$f":"'Data Compare Pre'!O52-'Data Base Pre'!O52","v":-7.5120000000000005},{"$f":"'Data Compare Pre'!P52-'Data Base Pre'!P52","v":-7.5120000000000005},{"$f":"'Data Compare Pre'!Q52-'Data Base Pre'!Q52","v":0},{"$f":"'Data Compare Pre'!R52-'Data Base Pre'!R52","v":0},{"$f":"'Data Compare Pre'!S52-'Data Base Pre'!S52","v":0},{"$f":"'Data Compare Pre'!T52-'Data Base Pre'!T52","v":-8.3349999999999795},{"$f":"'Data Compare Pre'!U52-'Data Base Pre'!U52","v":-11.988999999999976},{"$f":"'Data Compare Pre'!V52-'Data Base Pre'!V52","v":-34.456999999999994},{"$f":"'Data Compare Pre'!W52-'Data Base Pre'!W52","v":-97.355999999999995}]
[]
[null,null,"FOTs"]
[null,null,"Incremental",2019,2020,2021,2022,2023,2024,2025,2026,2027,2028,2029,2030,2031,2032,2033,2034,2035,2036,2037,2038]
[null,null,"FOT",{"$f":"'Data Compare Pre'!D56-'Data Base Pre'!D56","v":-6.7999999999983629E-2},{"$f":"'Data Compare Pre'!E56-'Data Base Pre'!E56","v":0.11000000000012733},{"$f":"'Data Compare Pre'!F56-'Data Base Pre'!F56","v":0.53800000000001091},{"$f":"'Data Compare Pre'!G56-'Data Base Pre'!G56","v":1.20799999999997},{"$f":"'Data Compare Pre'!H56-'Data Base Pre'!H56","v":1.7900000000000205},{"$f":"'Data Compare Pre'!I56-'Data Base Pre'!I56","v":44.073000000000008},{"$f":"'Data Compare Pre'!J56-'Data Base Pre'!J56","v":42.076000000000022},{"$f":"'Data Compare Pre'!K56-'Data Base Pre'!K56","v":6.7950000000000159},{"$f":"'Data Compare Pre'!L56-'Data Base Pre'!L56","v":-20.681999999999988},{"$f":"'Data Compare Pre'!M56-'Data Base Pre'!M56","v":-57.038999999999987},{"$f":"'Data Compare Pre'!N56-'Data Base Pre'!N56","v":-75.567000000000007},{"$f":"'Data Compare Pre'!O56-'Data Base Pre'!O56","v":101.36500000000001},{"$f":"'Data Compare Pre'!P56-'Data Base Pre'!P56","v":106.53099999999995},{"$f":"'Data Compare Pre'!Q56-'Data Base Pre'!Q56","v":-61.372000000000071},{"$f":"'Data Compare Pre'!R56-'Data Base Pre'!R56","v":2.3020000000001346},{"$f":"'Data Compare Pre'!S56-'Data Base Pre'!S56","v":-18.985000000000127},{"$f":"'Data Compare Pre'!T56-'Data Base Pre'!T56","v":-23.014999999999873},{"$f":"'Data Compare Pre'!U56-'Data Base Pre'!U56","v":86.442999999999984},{"$f":"'Data Compare Pre'!V56-'Data Base Pre'!V56","v":0.53899999999998727},{"$f":"'Data Compare Pre'!W56-'Data Base Pre'!W56","v":-12.623000000000047}]
[]
[]
[null,null,null,2019,2020,2021,2022,2023,2024,2025,2026,2027,2028,2029,2030,2031,2032,2033,2034,2035,2036,2037,2038]
[null,null,"Coal Removed",{"$f":"D5","v":0},{"$f":"E5","v":0},0,0,0,0,0,0,0,0,0,0,0,0,0,0,0,0,0,0]
[null,null,"Wind",{"$f":"D9","v":0},0,0,0,-69.215999999999994,-69.215999999999894,-69.215999999999894,-69.215999999999894,-69.215999999999894,-69.215999999999894,-69.215999999999894,-115.17999999999984,-115.17999999999984,-115.17999999999984,-115.17999999999984,-115.17999999999984,-115.17999999999984,-115.17999999999984,-115.17999999999984,-115.17999999999984]
[null,null,"Solar",0,0,0,0,0,0,0,0,0,0,0,0,0,0,0,0,0,0,0,0]
[null,null,"Wind+Bat",0,0,0,0,0,0,0,0,0,0,-9.7910000000000004,20.462,20.462,36.172999999999988,36.172999999999988,36.172999999999988,36.172999999999988,36.172999999999988,25.595999999999989,25.595999999999989]
[null,null,"Solar+Bat",0,0,-2.0999999999986585E-2,-4.2000000000001592E-2,69.35299999999998,79.006000000000313,79.006000000000313,79.006000000000313,79.006000000000313,79.006000000000313,79.006000000000313,-420.99399999999969,79.006000000000313,554.00600000000031,179.00600000000031,179.00600000000031,179.00600000000031,-240.41699999999992,-245.39300000000003,-240.41699999999946]
[null,null,"Battery",0,0,0,0,0,0,0,0,0,0,0,0,0,0,0,0,0,0,0,-120]
[null,null,"Pumped Storage",0,0,0,0,0,0,0,0,0,0,0,0,0,0,0,0,0,0,0,0]
[null,null,"Gas",{"$f":"SUM(D19:D22)","v":0},{"$f":"SUM(E19:E22)","v":0},0,0,0,0,0,0,0,0,0,-184.9,-369.8,-369.8,-369.80000000000007,-369.80000000000007,-369.80000000000007,-369.80000000000007,-221.40000000000009,0]
[null,null,"Class 1 DSM",{"$f":"D27","v":0},{"$f":"E27","v":0},0,0,0,0,0,0,0,0,-33.501000000000005,-7.5120000000000005,-7.5120000000000005,0,0,0,-8.3349999999999795,-11.988999999999976,-34.456999999999994,-97.355999999999995]
[null,null,"Class 2 DSM",{"$f":"D26","v":0},{"$f":"E26","v":0},0,-1.1599999999999682,-1.1599999999998545,-3.279999999999859,-3.279999999999859,-7.779999999999859,-14.639999999999873,-17.900000000000091,-17.900000000000091,-17.900000000000091,-20.7800000000002,-20.7800000000002,-20.7800000000002,-21.1700000000003,-21.480000000000473,-21.480000000000246,-21.480000000000018,-21.480000000000018]
[null,null,"FOT",{"$f":"D31","v":-6.7999999999983629E-2},{"$f":"E31","v":0.11000000000012733},0.53800000000001091,1.20799999999997,1.7900000000000205,44.073000000000008,42.076000000000022,6.7950000000000159,-20.681999999999988,-57.038999999999987,-75.567000000000007,101.36500000000001,106.53099999999995,-61.372000000000071,2.3020000000001346,-18.985000000000127,-23.014999999999873,86.442999999999984,0.53899999999998727,-12.623000000000047]
[]
[]
[null,null,"Existing Capacity Removed",{"$f":"D5+D15+D22","v":0},{"$f":"E5+E15+E22","v":0},0,0,0,0,0,0,0,0,0,0,0,0,0,0,0,0,0,0]

{"sheet":"Data Base Rel","index":3,"n_rows":302,"n_cols":27,"rows_kept":302,"cut":false,"hidden":false,"merged":[]}
["P45CNW-",null,{"$f":"IF(IFERROR(SUM(A68:A302),\"Err\")=0,\"OK\",\"MAPPING ERRORS, left column below\")","v":"OK"},null,null,null,null,null,null,null,null,null,null,null,null,null,null,null,null,null,null,null,null,null,"Checks for","MAPPING ERRORS, left column below"]
[]
[null,null,"Coal"]
[null,null,"Incremental",2019,2020,2021,2022,2023,2024,2025,2026,2027,2028,2029,2030,2031,2032,2033,2034,2035,2036,2037,2038]
[null,null,"Coal Removed",{"$f":"SUMIF($A$69:$A$302,$C5,D$69:D$302)","v":0},-280,-387,0,0,-350.5,0,-439.3,-81.5,-903,-355.8,0,-76.599999999999994,0,0,0,0,0,-909,-702]
[]
[null,null,"Cumulative",2019,2020,2021,2022,2023,2024,2025,2026,2027,2028,2029,2030,2031,2032,2033,2034,2035,2036,2037,2038]
[null,null,"Coal Removed",{"$f":"D5","v":0},{"$f":"E5+D8","v":-280},{"$f":"F5+E8","v":-667},-667,-667,-1017.5,-1017.5,-1456.8,-1538.3,-2441.3000000000002,-2797.1000000000004,-2797.1000000000004,-2873.7000000000003,-2873.7000000000003,-2873.7000000000003,-2873.7000000000003,-2873.7000000000003,-2873.7000000000003,-3782.7000000000003,-4484.7000000000007]
[]
[null,null,"Renewable and Storage"]
[null,null,"Incremental",2019,2020,2021,2022,2023,2024,2025,2026,2027,2028,2029,2030,2031,2032,2033,2034,2035,2036,2037,2038]
[null,null,"Wind",{"$f":"SUMIF($A$69:$A$302,$C12,D$69:D$302)","v":0},0,0,0,69.2,1920,0,0,0,0,{"$f":"SUMIF($A$69:$A$302,$C12,N$69:N$302)","v":0},1039.5999999999999,0,0,0,0,0,0,0,0]
[null,null,"Solar",0,0,0,0,0,0,0,0,0,0,0,0,0,0,0,0,0,0,0,0]
[null,null,"Wind+Bat",0,0,0,0,0,0,0,0,0,0,9.8000000000000007,0,0,60.4,0,0,0,0,10.6,0]
[null,null,"Solar+Bat",0,0,159.19999999999999,63.8,3.4,2153.6,0,0,0,0,359.4,500,0,0,475,0,0,419.4,909,701.8]
[null,null,"Battery",0,0,0,0,0,0,0,0,0,180,435,0,30,120,0,0,0,0,0,600]
[null,null,"Pumped Storage",0,0,0,0,0,0,0,0,0,0,0,0,0,0,0,0,0,0,0,0]
[null,null,"Hydro Removed",0,-1.1000000000000001,-168.90000000000003,0,-0.7,-20.28,0,-1.4,0,-7.2,0,0,-6.4,0,0,-74.900000000000006,0,-1.2,0,0]
[null,null,"Wind Removed",0,-26.55,-16.8,-224,-0.2,-41,0,-64.5,-3,0,-93.4,-149.1,-200.2,-65,-200.9,-80,0,-70,-90,0]
[null,null,"Solar Removed",0,0,0,0,-0.5,-0.52,0,0,0,-2,0,0,-67,-48.9,0,0,-35.9,-209.10000000000002,-1024.2,-10.9]
[null,null,"Other Removed",0,0,0,0,0,0,0,0,0,0,0,0,0,0,0,-0.90700000000000003,0,0,0,-32.1]
[]
[null,null,"Cumulative",2019,2020,2021,2022,2023,2024,2025,2026,2027,2028,2029,2030,2031,2032,2033,2034,2035,2036,2037,2038,null,"Wind","Solar","Battery"]
[null,null,"Wind",{"$f":"D12","v":0},{"$f":"D24+E12","v":0},0,0,69.2,1989.2,1989.2,1989.2,1989.2,1989.2,1989.2,3028.8,3028.8,3028.8,3028.8,3028.8,3028.8,3028.8,3028.8,3028.8,null,{"$f":"W24+SUM(D19:W19)+W26","v":1784.95},{"$f":"W25+SUM(D20:W20)+W27","v":4345.58},{"$f":"0.25*W26+0.25*W27+W28","v":2821.3500000000004}]
[null,null,"Solar",0,{"$f":"D25+E13","v":0},0,0,0,0,0,0,0,0,0,0,0,0,0,0,0,0,0,0]
[null,null,"Wind+Bat",0,{"$f":"D26+E14","v":0},0,0,0,0,0,0,0,0,9.8000000000000007,9.8000000000000007,9.8000000000000007,70.2,70.2,70.2,70.2,70.2,80.8,80.8]
[null,null,"Solar+Bat",0,{"$f":"D27+E15","v":0},159.19999999999999,223,226.4,2380,2380,2380,2380,2380,2739.4,3239.4,3239.4,3239.4,3714.4,3714.4,3714.4,4133.8,5042.8,5744.6]
[null,null,"Battery",0,{"$f":"D28+E16","v":0},0,0,0,0,0,0,0,180,615,615,645,765,765,765,765,765,765,1365]
[null,null,"Pumped Storage",0,{"$f":"D29+E17","v":0},0,0,0,0,0,0,0,0,0,0,0,0,0,0,0,0,0,0]
[null,null,"Renewable Removed",{"$f":"D19+D20+D18+D21","v":0},{"$f":"E19+E20+E18+E21+D30","v":-27.650000000000002},{"$f":"F19+F20+F18+F21+E30","v":-213.35000000000005},-437.35,-438.75,-500.55,-500.55,-566.45000000000005,-569.45000000000005,-578.65000000000009,-672.05000000000007,-821.15000000000009,-1094.75,-1208.6500000000001,-1409.5500000000002,-1565.3570000000002,-1601.2570000000003,-1881.5570000000002,-2995.7570000000005,-3038.7570000000005]
[]
[null,null,"Gas"]
[null,null,"Incremental",2019,2020,2021,2022,2023,2024,2025,2026,2027,2028,2029,2030,2031,2032,2033,2034,2035,2036,2037,2038]
[null,null,"Gas Peaker",{"$f":"SUMIF($A$69:$A$302,$C34,D$69:D$302)","v":0},0,0,0,0,0,0,184.9,0,0,{"$f":"SUMIF($A$69:$A$302,$C34,N$69:N$302)","v":0},369.8,0,0,0,0,0,0,812.6,0]
[null,null,"Gas CCCT",0,0,0,0,0,0,0,0,0,0,0,0,0,0,0,0,0,0,505.2,0]
[null,null,"Gas Conv.",0,247,0,0,0,0,0,0,0,0,0,-247,0,0,0,0,0,0,0,0]
[null,null,"Gas Removed",0,0,0,0,0,0,0,0,0,0,0,0,0,0,-356.30000000000007,0,0,0,-237,0]
[]
[null,null,"Cumulative",2019,2020,2021,2022,2023,2024,2025,2026,2027,2028,2029,2030,2031,2032,2033,2034,2035,2036,2037,2038]
[null,null,"Gas Peaker",{"$f":"D34","v":0},{"$f":"D40+E34","v":0},{"$f":"E40+F34","v":0},0,0,0,0,184.9,184.9,184.9,184.9,554.70000000000005,554.70000000000005,554.70000000000005,554.70000000000005,554.70000000000005,554.70000000000005,554.70000000000005,1367.3000000000002,1367.3000000000002]
[null,null,"Gas CCCT",{"$f":"D35","v":0},{"$f":"D41+E35","v":0},{"$f":"E41+F35","v":0},0,0,0,0,0,0,0,0,0,0,0,0,0,0,0,505.2,505.2]
[null,null,"Gas Conv.",{"$f":"D36","v":0},{"$f":"D42+E36","v":247},{"$f":"E42+F36","v":247},247,247,247,247,247,247,247,247,0,0,0,0,0,0,0,0,0]
[null,null,"Gas Removed",{"$f":"D37","v":0},{"$f":"D43+E37","v":0},0,0,0,0,0,0,0,0,0,0,0,0,-356.30000000000007,-356.30000000000007,-356.30000000000007,-356.30000000000007,-593.30000000000007,-593.30000000000007]
[]
[null,null,"Demand-Side Management"]
[null,null,"Incremental",2019,2020,2021,2022,2023,2024,2025,2026,2027,2028,2029,2030,2031,2032,2033,2034,2035,2036,2037,2038]
[null,null,"Class 2 DSM",{"$f":"SUMIF($A$69:$A$302,$C47,D$69:D$302)","v":126},132.06,132.69000000000003,142.58000000000001,146.74000000000004,151.06,147.19,144.01000000000002,143.26000000000002,137.82,{"$f":"SUMIF($A$69:$A$302,$C47,N$69:N$302)","v":126.4},120.44,113.54,110.14000000000001,99.42,81.789999999999992,77.370000000000019,65.28,58.099999999999994,59.230000000000011]
[null,null,"Class 1 DSM",4.0599999999999996,0,7.0039999999999996,0,18.11,0,8.2110000000000003,7.1660000000000004,0,0,132.71099999999998,8.2140000000000004,0,11.995000000000001,0,0,15.343,3.6539999999999999,59.272000000000006,168.649]
[]
[null,null,"Cumulative",2019,2020,2021,2022,2023,2024,2025,2026,2027,2028,2029,2030,2031,2032,2033,2034,2035,2036,2037,2038]
[null,null,"Class 2 DSM",{"$f":"D47","v":126},{"$f":"D51+E47","v":258.06},390.75,533.33000000000004,680.07,831.13000000000011,978.32000000000016,1122.3300000000002,1265.5900000000001,1403.41,1529.8100000000002,1650.2500000000002,1763.7900000000002,1873.9300000000003,1973.3500000000004,2055.1400000000003,2132.5100000000002,2197.7900000000004,2255.8900000000003,2315.1200000000003]
[null,null,"Class 1 DSM",{"$f":"D48","v":4.0599999999999996},4.0599999999999996,11.064,11.064,29.173999999999999,29.173999999999999,37.384999999999998,44.551000000000002,44.551000000000002,44.551000000000002,177.262,185.476,185.476,197.471,197.471,197.471,212.81399999999999,216.46799999999999,275.74,444.38900000000001]
[]
[null,null,"FOTs"]
[null,null,"Incremental",2019,2020,2021,2022,2023,2024,2025,2026,2027,2028,2029,2030,2031,2032,2033,2034,2035,2036,2037,2038]
[null,null,"FOT",{"$f":"SUMIF($A$69:$A$302,$C56,D$69:D$302)","v":997.76199999999994},719.45,493,502.68,497.88,130.94999999999999,126.44500000000001,191.24,264,1162.54,{"$f":"SUMIF($A$69:$A$302,$C56,N$69:N$302)","v":1375},1273.6300000000001,1248.79,1281.31,1372.69,1375,1374.4749999999999,1276.5999999999999,1374.4749999999999,1375]
[null,null,"Winter FOT",151.44499999999999,130.95999999999998,268.48,303.32,314,44.274999999999999,50.8,52.575000000000003,99.65,231.56,222.2,172.97000000000003,191.99,128.03,62.76,0,35.4,0,0,0]
[]
[null,null,"Removed Capacity",{"$f":"D8+D30+D43","v":0},{"$f":"E8+E30+E43","v":-307.64999999999998},-880.35,-1104.3499999999999,-1105.75,-1518.05,-1518.05,-2023.25,-2107.75,-3019.9500000000003,-3469.1500000000005,-3618.2500000000005,-3968.4500000000003,-4082.3500000000004,-4639.55,-4795.3570000000009,-4831.2570000000005,-5111.5570000000007,-7371.7570000000005,-8116.7570000000014]
[]
[]
[]
[]
[null,"Study Name: I19-P45CNW-MMR  (09-22-19 1006 AM)"]
[null,null,null,""]
[null,null,null,"Capacity (MW)"]
[null,null,"Resource",2019,2020,2021,2022,2023,2024,2025,2026,2027,2028,2029,2030,2031,2032,2033,2034,2035,2036,2037,2038]
[{"$f":"IF(AND(B68<>\"West\",OR(A67=\"Winter FOT\",A67=\"Done\")),\"Done\",VLOOKUP(C68,'Resource Map'!$B$3:$C$509,2,FALSE))","v":"-"},"East","Existing Plant Retirements and PPA Termination"]
[{"$f":"IF(AND(B69<>\"West\",OR(A68=\"Winter FOT\",A68=\"Done\")),\"Done\",VLOOKUP(C69,'Resource Map'!$B$3:$C$509,2,FALSE))","v":"Coal Removed"},null,"Craig 1  (Coal Early Retirement/Conversions)",0,0,0,0,0,0,0,-82.3,0,0,0,0,0,0,0,0,0,0,0,0]
[{"$f":"IF(AND(B70<>\"West\",OR(A69=\"Winter FOT\",A69=\"Done\")),\"Done\",VLOOKUP(C70,'Resource Map'!$B$3:$C$509,2,FALSE))","v":"Coal Removed"},null,"Craig 2  (Coal Early Retirement/Conversions)",0,0,0,0,0,0,0,0,-81.5,0,0,0,0,0,0,0,0,0,0,0]
[{"$f":"IF(AND(B71<>\"West\",OR(A70=\"Winter FOT\",A70=\"Done\")),\"Done\",VLOOKUP(C71,'Resource Map'!$B$3:$C$509,2,FALSE))","v":"Coal Removed"},null,"Hayden 1",0,0,0,0,0,0,0,0,0,0,0,0,-43.9,0,0,0,0,0,0,0]
[{"$f":"IF(AND(B72<>\"West\",OR(A71=\"Winter FOT\",A71=\"Done\")),\"Done\",VLOOKUP(C72,'Resource Map'!$B$3:$C$509,2,FALSE))","v":"Coal Removed"},null,"Hayden 2",0,0,0,0,0,0,0,0,0,0,0,0,-32.700000000000003,0,0,0,0,0,0,0]
[{"$f":"IF(AND(B73<>\"West\",OR(A72=\"Winter FOT\",A72=\"Done\")),\"Done\",VLOOKUP(C73,'Resource Map'!$B$3:$C$509,2,FALSE))","v":"Coal Removed"},null,"Huntington 1",0,0,0,0,0,0,0,0,0,0,0,0,0,0,0,0,0,0,-459,0]
[{"$f":"IF(AND(B74<>\"West\",OR(A73=\"Winter FOT\",A73=\"Done\")),\"Done\",VLOOKUP(C74,'Resource Map'!$B$3:$C$509,2,FALSE))","v":"Coal Removed"},null,"Huntington 2",0,0,0,0,0,0,0,0,0,0,0,0,0,0,0,0,0,0,-450,0]
[{"$f":"IF(AND(B75<>\"West\",OR(A74=\"Winter FOT\",A74=\"Done\")),\"Done\",VLOOKUP(C75,'Resource Map'!$B$3:$C$509,2,FALSE))","v":"Coal Removed"},null,"Colstrip 3  (Coal Early Retirement/Conversions)",0,0,0,0,0,0,0,0,0,-74,0,0,0,0,0,0,0,0,0,0]
[{"$f":"IF(AND(B76<>\"West\",OR(A75=\"Winter FOT\",A75=\"Done\")),\"Done\",VLOOKUP(C76,'Resource Map'!$B$3:$C$509,2,FALSE))","v":"Coal Removed"},null,"Colstrip 4  (Coal Early Retirement/Conversions)",0,0,0,0,0,0,0,0,0,-74,0,0,0,0,0,0,0,0,0,0]
[{"$f":"IF(AND(B77<>\"West\",OR(A76=\"Winter FOT\",A76=\"Done\")),\"Done\",VLOOKUP(C77,'Resource Map'!$B$3:$C$509,2,FALSE))","v":"Coal Removed"},null,"Cholla 4  (Coal Early Retirement/Conversions)",0,0,-387,0,0,0,0,0,0,0,0,0,0,0,0,0,0,0,0,0]
[{"$f":"IF(AND(B78<>\"West\",OR(A77=\"Winter FOT\",A77=\"Done\")),\"Done\",VLOOKUP(C78,'Resource Map'!$B$3:$C$509,2,FALSE))","v":"Coal Removed"},null,"DaveJohnston 1",0,0,0,0,0,0,0,0,0,-99,0,0,0,0,0,0,0,0,0,0]
[{"$f":"IF(AND(B79<>\"West\",OR(A78=\"Winter FOT\",A78=\"Done\")),\"Done\",VLOOKUP(C79,'Resource Map'!$B$3:$C$509,2,FALSE))","v":"Coal Removed"},null,"DaveJohnston 2",0,0,0,0,0,0,0,0,0,-106,0,0,0,0,0,0,0,0,0,0]
[{"$f":"IF(AND(B80<>\"West\",OR(A79=\"Winter FOT\",A79=\"Done\")),\"Done\",VLOOKUP(C80,'Resource Map'!$B$3:$C$509,2,FALSE))","v":"Coal Removed"},null,"DaveJohnston 3",0,0,0,0,0,0,0,0,0,-220,0,0,0,0,0,0,0,0,0,0]
[{"$f":"IF(AND(B81<>\"West\",OR(A80=\"Winter FOT\",A80=\"Done\")),\"Done\",VLOOKUP(C81,'Resource Map'!$B$3:$C$509,2,FALSE))","v":"Coal Removed"},null,"DaveJohnston 4",0,0,0,0,0,0,0,0,0,-330,0,0,0,0,0,0,0,0,0,0]
[{"$f":"IF(AND(B82<>\"West\",OR(A81=\"Winter FOT\",A81=\"Done\")),\"Done\",VLOOKUP(C82,'Resource Map'!$B$3:$C$509,2,FALSE))","v":"Coal Removed"},null,"Naughton 1  (Coal Early Retirement/Conversions)",0,0,0,0,0,0,0,-156,0,0,0,0,0,0,0,0,0,0,0,0]
[{"$f":"IF(AND(B83<>\"West\",OR(A82=\"Winter FOT\",A82=\"Done\")),\"Done\",VLOOKUP(C83,'Resource Map'!$B$3:$C$509,2,FALSE))","v":"Coal Removed"},null,"Naughton 2  (Coal Early Retirement/Conversions)",0,0,0,0,0,0,0,-201,0,0,0,0,0,0,0,0,0,0,0,0]
[{"$f":"IF(AND(B84<>\"West\",OR(A83=\"Winter FOT\",A83=\"Done\")),\"Done\",VLOOKUP(C84,'Resource Map'!$B$3:$C$509,2,FALSE))","v":"Coal Removed"},null,"Naughton 3  (Coal Early Retirement/Conversions)",0,-280,0,0,0,0,0,0,0,0,0,0,0,0,0,0,0,0,0,0]
[{"$f":"IF(AND(B85<>\"West\",OR(A84=\"Winter FOT\",A84=\"Done\")),\"Done\",VLOOKUP(C85,'Resource Map'!$B$3:$C$509,2,FALSE))","v":"Gas Removed"},null,"Gadsby 1-6",0,0,0,0,0,0,0,0,0,0,0,0,0,0,-356.30000000000007,0,0,0,0,0]
[{"$f":"IF(AND(B86<>\"West\",OR(A85=\"Winter FOT\",A85=\"Done\")),\"Done\",VLOOKUP(C86,'Resource Map'!$B$3:$C$509,2,FALSE))","v":"Hydro Removed"},null,"Retire - Hydro",0,0,0,0,0,-20.28,0,0,0,0,0,0,0,0,0,0,0,0,0,0]
[{"$f":"IF(AND(B87<>\"West\",OR(A86=\"Winter FOT\",A86=\"Done\")),\"Done\",VLOOKUP(C87,'Resource Map'!$B$3:$C$509,2,FALSE))","v":"Wind Removed"},null,"Retire - Wind",0,0,0,0,0,0,0,0,0,0,0,-40.200000000000003,0,0,0,0,0,0,0,0]
[{"$f":"IF(AND(B88<>\"West\",OR(A87=\"Winter FOT\",A87=\"Done\")),\"Done\",VLOOKUP(C88,'Resource Map'!$B$3:$C$509,2,FALSE))","v":"Wind Removed"},null,"Expire - Wind PPA",0,-26.55,-16.8,-49,-0.2,0,0,-64.5,-3,0,-18.899999999999999,-99,-200.2,-45,-180.9,-80,0,-60,-80,0]
[{"$f":"IF(AND(B89<>\"West\",OR(A88=\"Winter FOT\",A88=\"Done\")),\"Done\",VLOOKUP(C89,'Resource Map'!$B$3:$C$509,2,FALSE))","v":"Solar Removed"},null,"Expire - Solar PPA",0,0,0,0,-0.5,-0.52,0,0,0,0,0,0,0,0,0,0,-35.1,-94.100000000000009,-849,0]
[{"$f":"IF(AND(B90<>\"West\",OR(A89=\"Winter FOT\",A89=\"Done\")),\"Done\",VLOOKUP(C90,'Resource Map'!$B$3:$C$509,2,FALSE))","v":"Other Removed"},null,"Retire - Other",0,0,0,0,0,0,0,0,0,0,0,0,0,0,0,-0.90700000000000003,0,0,0,-32.1]
[{"$f":"IF(AND(B91<>\"West\",OR(A90=\"Winter FOT\",A90=\"Done\")),\"Done\",VLOOKUP(C91,'Resource Map'!$B$3:$C$509,2,FALSE))","v":"Gas Conv."},null,"Coal Ret_WY - Gas RePower",0,247,0,0,0,0,0,0,0,0,0,-247,0,0,0,0,0,0,0,0]
[{"$f":"IF(AND(B92<>\"West\",OR(A91=\"Winter FOT\",A91=\"Done\")),\"Done\",VLOOKUP(C92,'Resource Map'!$B$3:$C$509,2,FALSE))","v":"-"},null,"Expansion Resources"]
[{"$f":"IF(AND(B93<>\"West\",OR(A92=\"Winter FOT\",A92=\"Done\")),\"Done\",VLOOKUP(C93,'Resource Map'!$B$3:$C$509,2,FALSE))","v":"Gas CCCT"},null,"CCCT - DJohns - J 1x1",0,0,0,0,0,0,0,0,0,0,0,0,0,0,0,0,0,0,505.2,0]
[{"$f":"IF(AND(B94<>\"West\",OR(A93=\"Winter FOT\",A93=\"Done\")),\"Done\",VLOOKUP(C94,'Resource Map'!$B$3:$C$509,2,FALSE))","v":"-"},null,"Total CCCT",0,0,0,0,0,0,0,0,0,0,0,0,0,0,0,0,0,0,505.2,0]
[{"$f":"IF(AND(B95<>\"West\",OR(A94=\"Winter FOT\",A94=\"Done\")),\"Done\",VLOOKUP(C95,'Resource Map'!$B$3:$C$509,2,FALSE))","v":"Gas Peaker"},null,"SCCT Frame NTN",0,0,0,0,0,0,0,184.9,0,0,0,369.8,0,0,0,0,0,0,0,0]
[{"$f":"IF(AND(B96<>\"West\",OR(A95=\"Winter FOT\",A95=\"Done\")),\"Done\",VLOOKUP(C96,'Resource Map'!$B$3:$C$509,2,FALSE))","v":"Gas Peaker"},null,"SCCT Frame WYSW",0,0,0,0,0,0,0,0,0,0,0,0,0,0,0,0,0,0,369.8,0]
[{"$f":"IF(AND(B97<>\"West\",OR(A96=\"Winter FOT\",A96=\"Done\")),\"Done\",VLOOKUP(C97,'Resource Map'!$B$3:$C$509,2,FALSE))","v":"-"},null,"Total SCCT",0,0,0,0,0,0,0,184.9,0,0,0,369.8,0,0,0,0,0,0,369.8,0]
[{"$f":"IF(AND(B98<>\"West\",OR(A97=\"Winter FOT\",A97=\"Done\")),\"Done\",VLOOKUP(C98,'Resource Map'!$B$3:$C$509,2,FALSE))","v":"Wind"},null,"Wind, GO",0,0,0,0,0,0,0,0,0,0,0,1039.5999999999999,0,0,0,0,0,0,0,0]
[{"$f":"IF(AND(B99<>\"West\",OR(A98=\"Winter FOT\",A98=\"Done\")),\"Done\",VLOOKUP(C99,'Resource Map'!$B$3:$C$509,2,FALSE))","v":"Wind"},null,"Wind, UT",0,0,0,0,69.2,0,0,0,0,0,0,0,0,0,0,0,0,0,0,0]
[{"$f":"IF(AND(B100<>\"West\",OR(A99=\"Winter FOT\",A99=\"Done\")),\"Done\",VLOOKUP(C100,'Resource Map'!$B$3:$C$509,2,FALSE))","v":"Wind"},null,"Wind, WYAE",0,0,0,0,0,1920,0,0,0,0,0,0,0,0,0,0,0,0,0,0]
[{"$f":"IF(AND(B101<>\"West\",OR(A100=\"Winter FOT\",A100=\"Done\")),\"Done\",VLOOKUP(C101,'Resource Map'!$B$3:$C$509,2,FALSE))","v":"Wind+Bat"},null,"Wind+Storage, GO",0,0,0,0,0,0,0,0,0,0,0,0,0,60.4,0,0,0,0,0,0]
[{"$f":"IF(AND(B102<>\"West\",OR(A101=\"Winter FOT\",A101=\"Done\")),\"Done\",VLOOKUP(C102,'Resource Map'!$B$3:$C$509,2,FALSE))","v":"-"},null,"Total Wind",0,0,0,0,69.2,1920,0,0,0,0,0,1039.5999999999999,0,60.4,0,0,0,0,0,0]
[{"$f":"IF(AND(B103<>\"West\",OR(A102=\"Winter FOT\",A102=\"Done\")),\"Done\",VLOOKUP(C103,'Resource Map'!$B$3:$C$509,2,FALSE))","v":"Solar+Bat"},null,"Utility Solar+Storage - PV - Utah-S",0,0,0,0,0,230.8,0,0,0,0,0,500,0,0,0,0,0,0,0,0]
[{"$f":"IF(AND(B104<>\"West\",OR(A103=\"Winter FOT\",A103=\"Done\")),\"Done\",VLOOKUP(C104,'Resource Map'!$B$3:$C$509,2,FALSE))","v":"Solar+Bat"},null,"Utility Solar+Storage - PV - Huntington",0,0,0,0,0,0,0,0,0,0,0,0,0,0,0,0,0,0,909,0]
[{"$f":"IF(AND(B105<>\"West\",OR(A104=\"Winter FOT\",A104=\"Done\")),\"Done\",VLOOKUP(C105,'Resource Map'!$B$3:$C$509,2,FALSE))","v":"Solar+Bat"},null,"Utility Solar+Storage - PV - Utah-N",0,0,159.19999999999999,63.8,3.4,673.6,0,0,0,0,0,0,0,0,0,0,0,0,0,0]
[{"$f":"IF(AND(B106<>\"West\",OR(A105=\"Winter FOT\",A105=\"Done\")),\"Done\",VLOOKUP(C106,'Resource Map'!$B$3:$C$509,2,FALSE))","v":"-"},null,"Total Solar",0,0,159.19999999999999,63.8,3.4,904.40000000000009,0,0,0,0,0,500,0,0,0,0,0,0,909,0]
[{"$f":"IF(AND(B107<>\"West\",OR(A106=\"Winter FOT\",A106=\"Done\")),\"Done\",VLOOKUP(C107,'Resource Map'!$B$3:$C$509,2,FALSE))","v":"Class 1 DSM"},null,"Demand Response, ID-Irrigate",0,0,0,0,0,0,0,0,0,0,0,0,0,5.1520000000000001,0,0,0,3.6539999999999999,0,1.7889999999999999]
[{"$f":"IF(AND(B108<>\"West\",OR(A107=\"Winter FOT\",A107=\"Done\")),\"Done\",VLOOKUP(C108,'Resource Map'!$B$3:$C$509,2,FALSE))","v":"Class 1 DSM"},null,"Demand Response, UT-Cool/WH",4.0599999999999996,0,7.0039999999999996,0,9.8580000000000005,0,0,7.1660000000000004,0,0,6.6929999999999996,0,0,6.843,0,0,7.008,0,0,7.2370000000000001]
[{"$f":"IF(AND(B109<>\"West\",OR(A108=\"Winter FOT\",A108=\"Done\")),\"Done\",VLOOKUP(C109,'Resource Map'!$B$3:$C$509,2,FALSE))","v":"Class 1 DSM"},null,"Demand Response, UT-3rd Party Contracts",0,0,0,0,0,0,0,0,0,0,0,0,0,0,0,0,0,0,0,76.707999999999998]
[{"$f":"IF(AND(B110<>\"West\",OR(A109=\"Winter FOT\",A109=\"Done\")),\"Done\",VLOOKUP(C110,'Resource Map'!$B$3:$C$509,2,FALSE))","v":"Class 1 DSM"},null,"Demand Response, UT-Irrigate",0,0,0,0,0,0,0,0,0,0,0,0,0,0,0,0,0,0,0,1.927]
[{"$f":"IF(AND(B111<>\"West\",OR(A110=\"Winter FOT\",A110=\"Done\")),\"Done\",VLOOKUP(C111,'Resource Map'!$B$3:$C$509,2,FALSE))","v":"Class 1 DSM"},null,"Demand Response, UT-Thermostat",0,0,0,0,0,0,0,0,0,0,116.655,8.2140000000000004,0,0,0,0,8.3350000000000009,0,0,5.1180000000000003]
[{"$f":"IF(AND(B112<>\"West\",OR(A111=\"Winter FOT\",A111=\"Done\")),\"Done\",VLOOKUP(C112,'Resource Map'!$B$3:$C$509,2,FALSE))","v":"Class 1 DSM"},null,"Demand Response, WY-Cool/WH",0,0,0,0,0,0,0,0,0,0,0,0,0,0,0,0,0,0,0,5.2249999999999996]
[{"$f":"IF(AND(B113<>\"West\",OR(A112=\"Winter FOT\",A112=\"Done\")),\"Done\",VLOOKUP(C113,'Resource Map'!$B$3:$C$509,2,FALSE))","v":"Class 1 DSM"},null,"Demand Response, WY-3rd Party Contracts",0,0,0,0,0,0,0,0,0,0,0,0,0,0,0,0,0,0,0,37.33]
[{"$f":"IF(AND(B114<>\"West\",OR(A113=\"Winter FOT\",A113=\"Done\")),\"Done\",VLOOKUP(C114,'Resource Map'!$B$3:$C$509,2,FALSE))","v":"Class 1 DSM"},null,"Demand Response, WY-Irrigate",0,0,0,0,0,0,0,0,0,0,0,0,0,0,0,0,0,0,1.7569999999999999,0]
[{"$f":"IF(AND(B115<>\"West\",OR(A114=\"Winter FOT\",A114=\"Done\")),\"Done\",VLOOKUP(C115,'Resource Map'!$B$3:$C$509,2,FALSE))","v":"Class 1 DSM"},null,"Demand Response, WY-Thermostat",0,0,0,0,0,0,0,0,0,0,0,0,0,0,0,0,0,0,5.4930000000000003,1.212]
[{"$f":"IF(AND(B116<>\"West\",OR(A115=\"Winter FOT\",A115=\"Done\")),\"Done\",VLOOKUP(C116,'Resource Map'!$B$3:$C$509,2,FALSE))","v":"Class 1 DSM"},null,"Demand Response, UT-Ancillary Services",0,0,0,0,8.2520000000000007,0,5.2530000000000001,0,0,0,0,0,0,0,0,0,0,0,3.2410000000000001,0]
[{"$f":"IF(AND(B117<>\"West\",OR(A116=\"Winter FOT\",A116=\"Done\")),\"Done\",VLOOKUP(C117,'Resource Map'!$B$3:$C$509,2,FALSE))","v":"Class 1 DSM"},null,"Demand Response, WY-Ancillary Services",0,0,0,0,0,0,2.9580000000000002,0,0,0,0,0,0,0,0,0,0,0,0,0]
[{"$f":"IF(AND(B118<>\"West\",OR(A117=\"Winter FOT\",A117=\"Done\")),\"Done\",VLOOKUP(C118,'Resource Map'!$B$3:$C$509,2,FALSE))","v":"-"},null,"Demand Response Total",4.0599999999999996,0,7.0039999999999996,0,18.11,0,8.2110000000000003,7.1660000000000004,0,0,123.348,8.2140000000000004,0,11.995000000000001,0,0,15.343,3.6539999999999999,10.491,136.54599999999999]
[{"$f":"IF(AND(B119<>\"West\",OR(A118=\"Winter FOT\",A118=\"Done\")),\"Done\",VLOOKUP(C119,'Resource Map'!$B$3:$C$509,2,FALSE))","v":"Class 2 DSM"},null,"Energy Efficiency, ID",6,6.2000000000000011,6.32,6.6,7.48,7.3599999999999994,7.3000000000000007,7.39,7.25,7.09,6.8200000000000012,6.39,6.1,6.0500000000000007,5.48,4.42,4.0200000000000005,3.2700000000000005,2.7800000000000002,2.89]
[{"$f":"IF(AND(B120<>\"West\",OR(A119=\"Winter FOT\",A119=\"Done\")),\"Done\",VLOOKUP(C120,'Resource Map'!$B$3:$C$509,2,FALSE))","v":"Class 2 DSM"},null,"Energy Efficiency, UT",58,67.100000000000009,67.2,67.5,68.800000000000011,68.2,67.100000000000009,64.600000000000009,64.800000000000011,62.300000000000004,57,55.800000000000004,52.300000000000004,51.7,48,35.9,32.4,24.6,21.599999999999998,23.400000000000002]
[{"$f":"IF(AND(B121<>\"West\",OR(A120=\"Winter FOT\",A120=\"Done\")),\"Done\",VLOOKUP(C121,'Resource Map'!$B$3:$C$509,2,FALSE))","v":"Class 2 DSM"},null,"Energy Efficiency, WY",10,10.17,10.990000000000002,13.86,15.380000000000003,16.16,16.47,17.7,17.61,17.39,16.12,14.82,13.13,12.290000000000001,11.110000000000001,8.7899999999999991,8.35,6.9200000000000008,5.19,5.33]
[{"$f":"IF(AND(B122<>\"West\",OR(A121=\"Winter FOT\",A121=\"Done\")),\"Done\",VLOOKUP(C122,'Resource Map'!$B$3:$C$509,2,FALSE))","v":"-"},null,"Energy Efficiency Total",74,83.470000000000013,84.510000000000019,87.96,91.660000000000025,91.72,90.87,89.690000000000012,89.660000000000011,86.78,79.94,77.010000000000005,71.53,70.040000000000006,64.59,49.11,44.77,34.79,29.57,31.620000000000005]
[{"$f":"IF(AND(B123<>\"West\",OR(A122=\"Winter FOT\",A122=\"Done\")),\"Done\",VLOOKUP(C123,'Resource Map'!$B$3:$C$509,2,FALSE))","v":"Battery"},null,"Battery Storage - Utah-S",0,0,0,0,0,0,0,0,0,0,0,0,0,0,0,0,0,0,0,195]
[{"$f":"IF(AND(B124<>\"West\",OR(A123=\"Winter FOT\",A123=\"Done\")),\"Done\",VLOOKUP(C124,'Resource Map'!$B$3:$C$509,2,FALSE))","v":"Battery"},null,"Battery Storage - WYSW",0,0,0,0,0,0,0,0,0,0,0,0,0,0,0,0,0,0,0,15]
[{"$f":"IF(AND(B125<>\"West\",OR(A124=\"Winter FOT\",A124=\"Done\")),\"Done\",VLOOKUP(C125,'Resource Map'!$B$3:$C$509,2,FALSE))","v":"Battery"},null,"Battery Storage - Idaho",0,0,0,0,0,0,0,0,0,0,0,0,30,0,0,0,0,0,0,150]
[{"$f":"IF(AND(B126<>\"West\",OR(A125=\"Winter FOT\",A125=\"Done\")),\"Done\",VLOOKUP(C126,'Resource Map'!$B$3:$C$509,2,FALSE))","v":"FOT"},null,"FOT East - Summer",0,0,0,0,0,0,0,0,0,87.54,300,198.63,173.79,206.31,297.69,300,300,300,300,300]
[{"$f":"IF(AND(B127<>\"West\",OR(A126=\"Winter FOT\",A126=\"Done\")),\"Done\",VLOOKUP(C127,'Resource Map'!$B$3:$C$509,2,FALSE))","v":"-"},"West","Existing Plant Retirements and PPA Termination"]
[{"$f":"IF(AND(B128<>\"West\",OR(A127=\"Winter FOT\",A127=\"Done\")),\"Done\",VLOOKUP(C128,'Resource Map'!$B$3:$C$509,2,FALSE))","v":"Coal Removed"},null,"JimBridger 1  (Coal Early Retirement/Conversions)",0,0,0,0,0,-350.5,0,0,0,0,0,0,0,0,0,0,0,0,0,0]
[{"$f":"IF(AND(B129<>\"West\",OR(A128=\"Winter FOT\",A128=\"Done\")),\"Done\",VLOOKUP(C129,'Resource Map'!$B$3:$C$509,2,FALSE))","v":"Coal Removed"},null,"JimBridger 2  (Coal Early Retirement/Conversions)",0,0,0,0,0,0,0,0,0,0,-355.8,0,0,0,0,0,0,0,0,0]
[{"$f":"IF(AND(B130<>\"West\",OR(A129=\"Winter FOT\",A129=\"Done\")),\"Done\",VLOOKUP(C130,'Resource Map'!$B$3:$C$509,2,FALSE))","v":"Coal Removed"},null,"JimBridger 3",0,0,0,0,0,0,0,0,0,0,0,0,0,0,0,0,0,0,0,-348.7]
[{"$f":"IF(AND(B131<>\"West\",OR(A130=\"Winter FOT\",A130=\"Done\")),\"Done\",VLOOKUP(C131,'Resource Map'!$B$3:$C$509,2,FALSE))","v":"Coal Removed"},null,"JimBridger 4",0,0,0,0,0,0,0,0,0,0,0,0,0,0,0,0,0,0,0,-353.3]
[{"$f":"IF(AND(B132<>\"West\",OR(A131=\"Winter FOT\",A131=\"Done\")),\"Done\",VLOOKUP(C132,'Resource Map'!$B$3:$C$509,2,FALSE))","v":"Gas Removed"},null,"Hermiston",0,0,0,0,0,0,0,0,0,0,0,0,0,0,0,0,0,0,-237,0]
[{"$f":"IF(AND(B133<>\"West\",OR(A132=\"Winter FOT\",A132=\"Done\")),\"Done\",VLOOKUP(C133,'Resource Map'!$B$3:$C$509,2,FALSE))","v":"Hydro Removed"},null,"Retire - Hydro",0,-1.1000000000000001,-168.90000000000003,0,-0.7,0,0,-1.4,0,-7.2,0,0,-6.4,0,0,-74.900000000000006,0,-1.2,0,0]
[{"$f":"IF(AND(B134<>\"West\",OR(A133=\"Winter FOT\",A133=\"Done\")),\"Done\",VLOOKUP(C134,'Resource Map'!$B$3:$C$509,2,FALSE))","v":"Wind Removed"},null,"Expire - Wind PPA",0,0,0,-175,0,-41,0,0,0,0,-74.5,-9.9,0,-20,-20,0,0,-10,-10,0]
[{"$f":"IF(AND(B135<>\"West\",OR(A134=\"Winter FOT\",A134=\"Done\")),\"Done\",VLOOKUP(C135,'Resource Map'!$B$3:$C$509,2,FALSE))","v":"Solar Removed"},null,"Expire - Solar PPA",0,0,0,0,0,0,0,0,0,-2,0,0,-67,-48.9,0,0,-0.8,-115,-175.20000000000002,-10.9]
[{"$f":"IF(AND(B136<>\"West\",OR(A135=\"Winter FOT\",A135=\"Done\")),\"Done\",VLOOKUP(C136,'Resource Map'!$B$3:$C$509,2,FALSE))","v":"-"},null,"Expansion Resources"]
[{"$f":"IF(AND(B137<>\"West\",OR(A136=\"Winter FOT\",A136=\"Done\")),\"Done\",VLOOKUP(C137,'Resource Map'!$B$3:$C$509,2,FALSE))","v":"Gas Peaker"},null,"SCCT Frame WV",0,0,0,0,0,0,0,0,0,0,0,0,0,0,0,0,0,0,442.8,0]
[{"$f":"IF(AND(B138<>\"West\",OR(A137=\"Winter FOT\",A137=\"Done\")),\"Done\",VLOOKUP(C138,'Resource Map'!$B$3:$C$509,2,FALSE))","v":"-"},null,"Total SCCT",0,0,0,0,0,0,0,0,0,0,0,0,0,0,0,0,0,0,442.8,0]
[{"$f":"IF(AND(B139<>\"West\",OR(A138=\"Winter FOT\",A138=\"Done\")),\"Done\",VLOOKUP(C139,'Resource Map'!$B$3:$C$509,2,FALSE))","v":"Wind+Bat"},null,"Wind+Storage, YK",0,0,0,0,0,0,0,0,0,0,9.8000000000000007,0,0,0,0,0,0,0,10.6,0]
[{"$f":"IF(AND(B140<>\"West\",OR(A139=\"Winter FOT\",A139=\"Done\")),\"Done\",VLOOKUP(C140,'Resource Map'!$B$3:$C$509,2,FALSE))","v":"-"},null,"Total Wind",0,0,0,0,0,0,0,0,0,0,9.8000000000000007,0,0,0,0,0,0,0,10.6,0]
[{"$f":"IF(AND(B141<>\"West\",OR(A140=\"Winter FOT\",A140=\"Done\")),\"Done\",VLOOKUP(C141,'Resource Map'!$B$3:$C$509,2,FALSE))","v":"Solar+Bat"},null,"Utility Solar+Storage - PV - Jbridger",0,0,0,0,0,354,0,0,0,0,359.4,0,0,0,0,0,0,0,0,701.8]
[{"$f":"IF(AND(B142<>\"West\",OR(A141=\"Winter FOT\",A141=\"Done\")),\"Done\",VLOOKUP(C142,'Resource Map'!$B$3:$C$509,2,FALSE))","v":"Solar+Bat"},null,"Utility Solar+Storage - PV - S-Oregon",0,0,0,0,0,500,0,0,0,0,0,0,0,0,475,0,0,0,0,0]
[{"$f":"IF(AND(B143<>\"West\",OR(A142=\"Winter FOT\",A142=\"Done\")),\"Done\",VLOOKUP(C143,'Resource Map'!$B$3:$C$509,2,FALSE))","v":"Solar+Bat"},null,"Utility Solar+Storage - PV - Yakima",0,0,0,0,0,395.2,0,0,0,0,0,0,0,0,0,0,0,419.4,0,0]
[{"$f":"IF(AND(B144<>\"West\",OR(A143=\"Winter FOT\",A143=\"Done\")),\"Done\",VLOOKUP(C144,'Resource Map'!$B$3:$C$509,2,FALSE))","v":"-"},null,"Total Solar",0,0,0,0,0,1249.2,0,0,0,0,359.4,0,0,0,475,0,0,419.4,0,701.8]
[{"$f":"IF(AND(B145<>\"West\",OR(A144=\"Winter FOT\",A144=\"Done\")),\"Done\",VLOOKUP(C145,'Resource Map'!$B$3:$C$509,2,FALSE))","v":"Class 1 DSM"},null,"Demand Response, OR-Ancillary Services",0,0,0,0,0,0,0,0,0,0,7.5119999999999996,0,0,0,0,0,0,0,0,0]
[{"$f":"IF(AND(B146<>\"West\",OR(A145=\"Winter FOT\",A145=\"Done\")),\"Done\",VLOOKUP(C146,'Resource Map'!$B$3:$C$509,2,FALSE))","v":"Class 1 DSM"},null,"Demand Response, WA-Ancillary Services",0,0,0,0,0,0,0,0,0,0,1.851,0,0,0,0,0,0,0,0,0]
[{"$f":"IF(AND(B147<>\"West\",OR(A146=\"Winter FOT\",A146=\"Done\")),\"Done\",VLOOKUP(C147,'Resource Map'!$B$3:$C$509,2,FALSE))","v":"Class 1 DSM"},null,"Demand Response, CA-Cool/WH",0,0,0,0,0,0,0,0,0,0,0,0,0,0,0,0,0,0,0,1.53]
[{"$f":"IF(AND(B148<>\"West\",OR(A147=\"Winter FOT\",A147=\"Done\")),\"Done\",VLOOKUP(C148,'Resource Map'!$B$3:$C$509,2,FALSE))","v":"Class 1 DSM"},null,"Demand Response, CA-3rd Party Contracts",0,0,0,0,0,0,0,0,0,0,0,0,0,0,0,0,0,0,0,1.103]
[{"$f":"IF(AND(B149<>\"West\",OR(A148=\"Winter FOT\",A148=\"Done\")),\"Done\",VLOOKUP(C149,'Resource Map'!$B$3:$C$509,2,FALSE))","v":"Class 1 DSM"},null,"Demand Response, CA-Irrigate",0,0,0,0,0,0,0,0,0,0,0,0,0,0,0,0,0,0,4.7750000000000004,0]
[{"$f":"IF(AND(B150<>\"West\",OR(A149=\"Winter FOT\",A149=\"Done\")),\"Done\",VLOOKUP(C150,'Resource Map'!$B$3:$C$509,2,FALSE))","v":"Class 1 DSM"},null,"Demand Response, CA-Thermostat",0,0,0,0,0,0,0,0,0,0,0,0,0,0,0,0,0,0,5.8010000000000002,0]
[{"$f":"IF(AND(B151<>\"West\",OR(A150=\"Winter FOT\",A150=\"Done\")),\"Done\",VLOOKUP(C151,'Resource Map'!$B$3:$C$509,2,FALSE))","v":"Class 1 DSM"},null,"Demand Response, OR-3rd Party Contracts",0,0,0,0,0,0,0,0,0,0,0,0,0,0,0,0,0,0,0,10.881]
[{"$f":"IF(AND(B152<>\"West\",OR(A151=\"Winter FOT\",A151=\"Done\")),\"Done\",VLOOKUP(C152,'Resource Map'!$B$3:$C$509,2,FALSE))","v":"Class 1 DSM"},null,"Demand Response, OR-Irrigate",0,0,0,0,0,0,0,0,0,0,0,0,0,0,0,0,0,0,13.268000000000001,0]
[{"$f":"IF(AND(B153<>\"West\",OR(A152=\"Winter FOT\",A152=\"Done\")),\"Done\",VLOOKUP(C153,'Resource Map'!$B$3:$C$509,2,FALSE))","v":"Class 1 DSM"},null,"Demand Response, WA-Cool/WH",0,0,0,0,0,0,0,0,0,0,0,0,0,0,0,0,0,0,0,7.681]
[{"$f":"IF(AND(B154<>\"West\",OR(A153=\"Winter FOT\",A153=\"Done\")),\"Done\",VLOOKUP(C154,'Resource Map'!$B$3:$C$509,2,FALSE))","v":"Class 1 DSM"},null,"Demand Response, WA-3rd Party Contracts",0,0,0,0,0,0,0,0,0,0,0,0,0,0,0,0,0,0,0,10.907999999999999]
[{"$f":"IF(AND(B155<>\"West\",OR(A154=\"Winter FOT\",A154=\"Done\")),\"Done\",VLOOKUP(C155,'Resource Map'!$B$3:$C$509,2,FALSE))","v":"Class 1 DSM"},null,"Demand Response, WA-Irrigate",0,0,0,0,0,0,0,0,0,0,0,0,0,0,0,0,0,0,8.3060000000000009,0]
[{"$f":"IF(AND(B156<>\"West\",OR(A155=\"Winter FOT\",A155=\"Done\")),\"Done\",VLOOKUP(C156,'Resource Map'!$B$3:$C$509,2,FALSE))","v":"Class 1 DSM"},null,"Demand Response, WA-Thermostat",0,0,0,0,0,0,0,0,0,0,0,0,0,0,0,0,0,0,16.631,0]
[{"$f":"IF(AND(B157<>\"West\",OR(A156=\"Winter FOT\",A156=\"Done\")),\"Done\",VLOOKUP(C157,'Resource Map'!$B$3:$C$509,2,FALSE))","v":"-"},null,"Demand Response  Total",0,0,0,0,0,0,0,0,0,0,9.3629999999999995,0,0,0,0,0,0,0,48.781000000000006,32.103000000000002]
[{"$f":"IF(AND(B158<>\"West\",OR(A157=\"Winter FOT\",A157=\"Done\")),\"Done\",VLOOKUP(C158,'Resource Map'!$B$3:$C$509,2,FALSE))","v":"Class 2 DSM"},null,"Energy Efficiency, CA",1,1.6400000000000001,1.53,1.62,1.8499999999999999,1.83,2.02,2.0300000000000002,2.0099999999999998,2.0900000000000003,2.08,1.9500000000000002,1.9200000000000002,1.84,1.6600000000000001,1.3,1.4100000000000001,1.17,0.98000000000000009,0.85]
[{"$f":"IF(AND(B159<>\"West\",OR(A158=\"Winter FOT\",A158=\"Done\")),\"Done\",VLOOKUP(C159,'Resource Map'!$B$3:$C$509,2,FALSE))","v":"Class 2 DSM"},null,"Energy Efficiency, OR",40,37,36.5,41.7,41.4,45.6,42.7,41.100000000000009,40.500000000000014,38.200000000000003,34.6,32.099999999999994,31.299999999999997,30.1,25.5,25.5,25.300000000000004,24.6,23.5,22.700000000000003]
[{"$f":"IF(AND(B160<>\"West\",OR(A159=\"Winter FOT\",A159=\"Done\")),\"Done\",VLOOKUP(C160,'Resource Map'!$B$3:$C$509,2,FALSE))","v":"Class 2 DSM"},null,"Energy Efficiency, WA",11,9.9499999999999993,10.15,11.299999999999999,11.830000000000002,11.909999999999998,11.6,11.189999999999998,11.089999999999998,10.749999999999998,9.7799999999999994,9.3800000000000026,8.7900000000000009,8.1599999999999984,7.6700000000000008,5.8800000000000017,5.8899999999999988,4.7200000000000015,4.0500000000000007,4.0599999999999996]
[{"$f":"IF(AND(B161<>\"West\",OR(A160=\"Winter FOT\",A160=\"Done\")),\"Done\",VLOOKUP(C161,'Resource Map'!$B$3:$C$509,2,FALSE))","v":"-"},null,"Energy Efficiency  Total",52,48.59,48.18,54.62,55.08,59.339999999999996,56.320000000000007,54.320000000000007,53.600000000000009,51.040000000000006,46.46,43.43,42.01,40.1,34.83,32.68,32.6,30.490000000000006,28.53,27.610000000000003]
[{"$f":"IF(AND(B162<>\"West\",OR(A161=\"Winter FOT\",A161=\"Done\")),\"Done\",VLOOKUP(C162,'Resource Map'!$B$3:$C$509,2,FALSE))","v":"Battery"},null,"Battery Storage - S-Oregon",0,0,0,0,0,0,0,0,0,0,210,0,0,60,0,0,0,0,0,180]
[{"$f":"IF(AND(B163<>\"West\",OR(A162=\"Winter FOT\",A162=\"Done\")),\"Done\",VLOOKUP(C163,'Resource Map'!$B$3:$C$509,2,FALSE))","v":"Battery"},null,"Battery Storage - Willamette Valley",0,0,0,0,0,0,0,0,0,75,45,0,0,0,0,0,0,0,0,0]
[{"$f":"IF(AND(B164<>\"West\",OR(A163=\"Winter FOT\",A163=\"Done\")),\"Done\",VLOOKUP(C164,'Resource Map'!$B$3:$C$509,2,FALSE))","v":"Battery"},null,"Battery Storage - Portland NC",0,0,0,0,0,0,0,0,0,0,105,0,0,0,0,0,0,0,0,0]
[{"$f":"IF(AND(B165<>\"West\",OR(A164=\"Winter FOT\",A164=\"Done\")),\"Done\",VLOOKUP(C165,'Resource Map'!$B$3:$C$509,2,FALSE))","v":"Battery"},null,"Battery Storage - Walla Walla",0,0,0,0,0,0,0,0,0,0,75,0,0,60,0,0,0,0,0,60]
[{"$f":"IF(AND(B166<>\"West\",OR(A165=\"Winter FOT\",A165=\"Done\")),\"Done\",VLOOKUP(C166,'Resource Map'!$B$3:$C$509,2,FALSE))","v":"Battery"},null,"Battery Storage - Yakima",0,0,0,0,0,0,0,0,0,105,0,0,0,0,0,0,0,0,0,0]
[{"$f":"IF(AND(B167<>\"West\",OR(A166=\"Winter FOT\",A166=\"Done\")),\"Done\",VLOOKUP(C167,'Resource Map'!$B$3:$C$509,2,FALSE))","v":"FOT"},null,"FOT West - Summer",997.76199999999994,719.45,493,502.68,497.88,130.94999999999999,126.44500000000001,191.24,264,1075,1075,1075,1075,1075,1075,1075,1074.4749999999999,976.6,1074.4749999999999,1075]
[{"$f":"IF(AND(B168<>\"West\",OR(A167=\"Winter FOT\",A167=\"Done\")),\"Done\",VLOOKUP(C168,'Resource Map'!$B$3:$C$509,2,FALSE))","v":"Winter FOT"},null,"FOT West - Winter",151.44499999999999,130.95999999999998,268.48,303.32,314,44.274999999999999,50.8,52.575000000000003,99.65,231.56,222.2,172.97000000000003,191.99,128.03,62.76,0,35.4,0,0,0]
[{"$f":"IF(AND(B169<>\"West\",OR(A168=\"Winter FOT\",A168=\"Done\")),\"Done\",VLOOKUP(C169,'Resource Map'!$B$3:$C$509,2,FALSE))","v":"Done"}]
[{"$f":"IF(AND(B170<>\"West\",OR(A169=\"Winter FOT\",A169=\"Done\")),\"Done\",VLOOKUP(C170,'Resource Map'!$B$3:$C$509,2,FALSE))","v":"Done"}]
[{"$f":"IF(AND(B171<>\"West\",OR(A170=\"Winter FOT\",A170=\"Done\")),\"Done\",VLOOKUP(C171,'Resource Map'!$B$3:$C$509,2,FALSE))","v":"Done"}]
[{"$f":"IF(AND(B172<>\"West\",OR(A171=\"Winter FOT\",A171=\"Done\")),\"Done\",VLOOKUP(C172,'Resource Map'!$B$3:$C$509,2,FALSE))","v":"Done"}]
[{"$f":"IF(AND(B173<>\"West\",OR(A172=\"Winter FOT\",A172=\"Done\")),\"Done\",VLOOKUP(C173,'Resource Map'!$B$3:$C$509,2,FALSE))","v":"Done"}]
[{"$f":"IF(AND(B174<>\"West\",OR(A173=\"Winter FOT\",A173=\"Done\")),\"Done\",VLOOKUP(C174,'Resource Map'!$B$3:$C$509,2,FALSE))","v":"Done"}]
[{"$f":"IF(AND(B175<>\"West\",OR(A174=\"Winter FOT\",A174=\"Done\")),\"Done\",VLOOKUP(C175,'Resource Map'!$B$3:$C$509,2,FALSE))","v":"Done"}]
[{"$f":"IF(AND(B176<>\"West\",OR(A175=\"Winter FOT\",A175=\"Done\")),\"Done\",VLOOKUP(C176,'Resource Map'!$B$3:$C$509,2,FALSE))","v":"Done"}]
[{"$f":"IF(AND(B177<>\"West\",OR(A176=\"Winter FOT\",A176=\"Done\")),\"Done\",VLOOKUP(C177,'Resource Map'!$B$3:$C$509,2,FALSE))","v":"Done"}]
[{"$f":"IF(AND(B178<>\"West\",OR(A177=\"Winter FOT\",A177=\"Done\")),\"Done\",VLOOKUP(C178,'Resource Map'!$B$3:$C$509,2,FALSE))","v":"Done"}]
[{"$f":"IF(AND(B179<>\"West\",OR(A178=\"Winter FOT\",A178=\"Done\")),\"Done\",VLOOKUP(C179,'Resource Map'!$B$3:$C$509,2,FALSE))","v":"Done"}]
[{"$f":"IF(AND(B180<>\"West\",OR(A179=\"Winter FOT\",A179=\"Done\")),\"Done\",VLOOKUP(C180,'Resource Map'!$B$3:$C$509,2,FALSE))","v":"Done"}]
[{"$f":"IF(AND(B181<>\"West\",OR(A180=\"Winter FOT\",A180=\"Done\")),\"Done\",VLOOKUP(C181,'Resource Map'!$B$3:$C$509,2,FALSE))","v":"Done"}]
[{"$f":"IF(AND(B182<>\"West\",OR(A181=\"Winter FOT\",A181=\"Done\")),\"Done\",VLOOKUP(C182,'Resource Map'!$B$3:$C$509,2,FALSE))","v":"Done"}]
[{"$f":"IF(AND(B183<>\"West\",OR(A182=\"Winter FOT\",A182=\"Done\")),\"Done\",VLOOKUP(C183,'Resource Map'!$B$3:$C$509,2,FALSE))","v":"Done"}]
[{"$f":"IF(AND(B184<>\"West\",OR(A183=\"Winter FOT\",A183=\"Done\")),\"Done\",VLOOKUP(C184,'Resource Map'!$B$3:$C$509,2,FALSE))","v":"Done"}]
[{"$f":"IF(AND(B185<>\"West\",OR(A184=\"Winter FOT\",A184=\"Done\")),\"Done\",VLOOKUP(C185,'Resource Map'!$B$3:$C$509,2,FALSE))","v":"Done"}]
[{"$f":"IF(AND(B186<>\"West\",OR(A185=\"Winter FOT\",A185=\"Done\")),\"Done\",VLOOKUP(C186,'Resource Map'!$B$3:$C$509,2,FALSE))","v":"Done"}]
[{"$f":"IF(AND(B187<>\"West\",OR(A186=\"Winter FOT\",A186=\"Done\")),\"Done\",VLOOKUP(C187,'Resource Map'!$B$3:$C$509,2,FALSE))","v":"Done"}]
[{"$f":"IF(AND(B188<>\"West\",OR(A187=\"Winter FOT\",A187=\"Done\")),\"Done\",VLOOKUP(C188,'Resource Map'!$B$3:$C$509,2,FALSE))","v":"Done"}]
[{"$f":"IF(AND(B189<>\"West\",OR(A188=\"Winter FOT\",A188=\"Done\")),\"Done\",VLOOKUP(C189,'Resource Map'!$B$3:$C$509,2,FALSE))","v":"Done"}]
[{"$f":"IF(AND(B190<>\"West\",OR(A189=\"Winter FOT\",A189=\"Done\")),\"Done\",VLOOKUP(C190,'Resource Map'!$B$3:$C$509,2,FALSE))","v":"Done"}]
[{"$f":"IF(AND(B191<>\"West\",OR(A190=\"Winter FOT\",A190=\"Done\")),\"Done\",VLOOKUP(C191,'Resource Map'!$B$3:$C$509,2,FALSE))","v":"Done"}]
[{"$f":"IF(AND(B192<>\"West\",OR(A191=\"Winter FOT\",A191=\"Done\")),\"Done\",VLOOKUP(C192,'Resource Map'!$B$3:$C$509,2,FALSE))","v":"Done"}]
[{"$f":"IF(AND(B193<>\"West\",OR(A192=\"Winter FOT\",A192=\"Done\")),\"Done\",VLOOKUP(C193,'Resource Map'!$B$3:$C$509,2,FALSE))","v":"Done"}]
[{"$f":"IF(AND(B194<>\"West\",OR(A193=\"Winter FOT\",A193=\"Done\")),\"Done\",VLOOKUP(C194,'Resource Map'!$B$3:$C$509,2,FALSE))","v":"Done"}]
[{"$f":"IF(AND(B195<>\"West\",OR(A194=\"Winter FOT\",A194=\"Done\")),\"Done\",VLOOKUP(C195,'Resource Map'!$B$3:$C$509,2,FALSE))","v":"Done"}]
[{"$f":"IF(AND(B196<>\"West\",OR(A195=\"Winter FOT\",A195=\"Done\")),\"Done\",VLOOKUP(C196,'Resource Map'!$B$3:$C$509,2,FALSE))","v":"Done"}]
[{"$f":"IF(AND(B197<>\"West\",OR(A196=\"Winter FOT\",A196=\"Done\")),\"Done\",VLOOKUP(C197,'Resource Map'!$B$3:$C$509,2,FALSE))","v":"Done"}]
[{"$f":"IF(AND(B198<>\"West\",OR(A197=\"Winter FOT\",A197=\"Done\")),\"Done\",VLOOKUP(C198,'Resource Map'!$B$3:$C$509,2,FALSE))","v":"Done"}]
[{"$f":"IF(AND(B199<>\"West\",OR(A198=\"Winter FOT\",A198=\"Done\")),\"Done\",VLOOKUP(C199,'Resource Map'!$B$3:$C$509,2,FALSE))","v":"Done"}]
[{"$f":"IF(AND(B200<>\"West\",OR(A199=\"Winter FOT\",A199=\"Done\")),\"Done\",VLOOKUP(C200,'Resource Map'!$B$3:$C$509,2,FALSE))","v":"Done"}]
[{"$f":"IF(AND(B201<>\"West\",OR(A200=\"Winter FOT\",A200=\"Done\")),\"Done\",VLOOKUP(C201,'Resource Map'!$B$3:$C$509,2,FALSE))","v":"Done"}]
[{"$f":"IF(AND(B202<>\"West\",OR(A201=\"Winter FOT\",A201=\"Done\")),\"Done\",VLOOKUP(C202,'Resource Map'!$B$3:$C$509,2,FALSE))","v":"Done"}]
[{"$f":"IF(AND(B203<>\"West\",OR(A202=\"Winter FOT\",A202=\"Done\")),\"Done\",VLOOKUP(C203,'Resource Map'!$B$3:$C$509,2,FALSE))","v":"Done"}]
[{"$f":"IF(AND(B204<>\"West\",OR(A203=\"Winter FOT\",A203=\"Done\")),\"Done\",VLOOKUP(C204,'Resource Map'!$B$3:$C$509,2,FALSE))","v":"Done"}]
[{"$f":"IF(AND(B205<>\"West\",OR(A204=\"Winter FOT\",A204=\"Done\")),\"Done\",VLOOKUP(C205,'Resource Map'!$B$3:$C$509,2,FALSE))","v":"Done"}]
[{"$f":"IF(AND(B206<>\"West\",OR(A205=\"Winter FOT\",A205=\"Done\")),\"Done\",VLOOKUP(C206,'Resource Map'!$B$3:$C$509,2,FALSE))","v":"Done"}]
[{"$f":"IF(AND(B207<>\"West\",OR(A206=\"Winter FOT\",A206=\"Done\")),\"Done\",VLOOKUP(C207,'Resource Map'!$B$3:$C$509,2,FALSE))","v":"Done"}]
[{"$f":"IF(AND(B208<>\"West\",OR(A207=\"Winter FOT\",A207=\"Done\")),\"Done\",VLOOKUP(C208,'Resource Map'!$B$3:$C$509,2,FALSE))","v":"Done"}]
[{"$f":"IF(AND(B209<>\"West\",OR(A208=\"Winter FOT\",A208=\"Done\")),\"Done\",VLOOKUP(C209,'Resource Map'!$B$3:$C$509,2,FALSE))","v":"Done"}]
[{"$f":"IF(AND(B210<>\"West\",OR(A209=\"Winter FOT\",A209=\"Done\")),\"Done\",VLOOKUP(C210,'Resource Map'!$B$3:$C$509,2,FALSE))","v":"Done"}]
[{"$f":"IF(AND(B211<>\"West\",OR(A210=\"Winter FOT\",A210=\"Done\")),\"Done\",VLOOKUP(C211,'Resource Map'!$B$3:$C$509,2,FALSE))","v":"Done"}]
[{"$f":"IF(AND(B212<>\"West\",OR(A211=\"Winter FOT\",A211=\"Done\")),\"Done\",VLOOKUP(C212,'Resource Map'!$B$3:$C$509,2,FALSE))","v":"Done"}]
[{"$f":"IF(AND(B213<>\"West\",OR(A212=\"Winter FOT\",A212=\"Done\")),\"Done\",VLOOKUP(C213,'Resource Map'!$B$3:$C$509,2,FALSE))","v":"Done"}]
[{"$f":"IF(AND(B214<>\"West\",OR(A213=\"Winter FOT\",A213=\"Done\")),\"Done\",VLOOKUP(C214,'Resource Map'!$B$3:$C$509,2,FALSE))","v":"Done"}]
[{"$f":"IF(AND(B215<>\"West\",OR(A214=\"Winter FOT\",A214=\"Done\")),\"Done\",VLOOKUP(C215,'Resource Map'!$B$3:$C$509,2,FALSE))","v":"Done"}]
[{"$f":"IF(AND(B216<>\"West\",OR(A215=\"Winter FOT\",A215=\"Done\")),\"Done\",VLOOKUP(C216,'Resource Map'!$B$3:$C$509,2,FALSE))","v":"Done"}]
[{"$f":"IF(AND(B217<>\"West\",OR(A216=\"Winter FOT\",A216=\"Done\")),\"Done\",VLOOKUP(C217,'Resource Map'!$B$3:$C$509,2,FALSE))","v":"Done"}]
[{"$f":"IF(AND(B218<>\"West\",OR(A217=\"Winter FOT\",A217=\"Done\")),\"Done\",VLOOKUP(C218,'Resource Map'!$B$3:$C$509,2,FALSE))","v":"Done"}]
[{"$f":"IF(AND(B219<>\"West\",OR(A218=\"Winter FOT\",A218=\"Done\")),\"Done\",VLOOKUP(C219,'Resource Map'!$B$3:$C$509,2,FALSE))","v":"Done"}]
[{"$f":"IF(AND(B220<>\"West\",OR(A219=\"Winter FOT\",A219=\"Done\")),\"Done\",VLOOKUP(C220,'Resource Map'!$B$3:$C$509,2,FALSE))","v":"Done"}]
[{"$f":"IF(AND(B221<>\"West\",OR(A220=\"Winter FOT\",A220=\"Done\")),\"Done\",VLOOKUP(C221,'Resource Map'!$B$3:$C$509,2,FALSE))","v":"Done"}]
[{"$f":"IF(AND(B222<>\"West\",OR(A221=\"Winter FOT\",A221=\"Done\")),\"Done\",VLOOKUP(C222,'Resource Map'!$B$3:$C$509,2,FALSE))","v":"Done"}]
[{"$f":"IF(AND(B223<>\"West\",OR(A222=\"Winter FOT\",A222=\"Done\")),\"Done\",VLOOKUP(C223,'Resource Map'!$B$3:$C$509,2,FALSE))","v":"Done"}]
[{"$f":"IF(AND(B224<>\"West\",OR(A223=\"Winter FOT\",A223=\"Done\")),\"Done\",VLOOKUP(C224,'Resource Map'!$B$3:$C$509,2,FALSE))","v":"Done"}]
[{"$f":"IF(AND(B225<>\"West\",OR(A224=\"Winter FOT\",A224=\"Done\")),\"Done\",VLOOKUP(C225,'Resource Map'!$B$3:$C$509,2,FALSE))","v":"Done"}]
[{"$f":"IF(AND(B226<>\"West\",OR(A225=\"Winter FOT\",A225=\"Done\")),\"Done\",VLOOKUP(C226,'Resource Map'!$B$3:$C$509,2,FALSE))","v":"Done"}]
[{"$f":"IF(AND(B227<>\"West\",OR(A226=\"Winter FOT\",A226=\"Done\")),\"Done\",VLOOKUP(C227,'Resource Map'!$B$3:$C$509,2,FALSE))","v":"Done"}]
[{"$f":"IF(AND(B228<>\"West\",OR(A227=\"Winter FOT\",A227=\"Done\")),\"Done\",VLOOKUP(C228,'Resource Map'!$B$3:$C$509,2,FALSE))","v":"Done"}]
[{"$f":"IF(AND(B229<>\"West\",OR(A228=\"Winter FOT\",A228=\"Done\")),\"Done\",VLOOKUP(C229,'Resource Map'!$B$3:$C$509,2,FALSE))","v":"Done"}]
[{"$f":"IF(AND(B230<>\"West\",OR(A229=\"Winter FOT\",A229=\"Done\")),\"Done\",VLOOKUP(C230,'Resource Map'!$B$3:$C$509,2,FALSE))","v":"Done"}]
[{"$f":"IF(AND(B231<>\"West\",OR(A230=\"Winter FOT\",A230=\"Done\")),\"Done\",VLOOKUP(C231,'Resource Map'!$B$3:$C$509,2,FALSE))","v":"Done"}]
[{"$f":"IF(AND(B232<>\"West\",OR(A231=\"Winter FOT\",A231=\"Done\")),\"Done\",VLOOKUP(C232,'Resource Map'!$B$3:$C$509,2,FALSE))","v":"Done"}]
[{"$f":"IF(AND(B233<>\"West\",OR(A232=\"Winter FOT\",A232=\"Done\")),\"Done\",VLOOKUP(C233,'Resource Map'!$B$3:$C$509,2,FALSE))","v":"Done"}]
[{"$f":"IF(AND(B234<>\"West\",OR(A233=\"Winter FOT\",A233=\"Done\")),\"Done\",VLOOKUP(C234,'Resource Map'!$B$3:$C$509,2,FALSE))","v":"Done"}]
[{"$f":"IF(AND(B235<>\"West\",OR(A234=\"Winter FOT\",A234=\"Done\")),\"Done\",VLOOKUP(C235,'Resource Map'!$B$3:$C$509,2,FALSE))","v":"Done"}]
[{"$f":"IF(AND(B236<>\"West\",OR(A235=\"Winter FOT\",A235=\"Done\")),\"Done\",VLOOKUP(C236,'Resource Map'!$B$3:$C$509,2,FALSE))","v":"Done"}]
[{"$f":"IF(AND(B237<>\"West\",OR(A236=\"Winter FOT\",A236=\"Done\")),\"Done\",VLOOKUP(C237,'Resource Map'!$B$3:$C$509,2,FALSE))","v":"Done"}]
[{"$f":"IF(AND(B238<>\"West\",OR(A237=\"Winter FOT\",A237=\"Done\")),\"Done\",VLOOKUP(C238,'Resource Map'!$B$3:$C$509,2,FALSE))","v":"Done"}]
[{"$f":"IF(AND(B239<>\"West\",OR(A238=\"Winter FOT\",A238=\"Done\")),\"Done\",VLOOKUP(C239,'Resource Map'!$B$3:$C$509,2,FALSE))","v":"Done"}]
[{"$f":"IF(AND(B240<>\"West\",OR(A239=\"Winter FOT\",A239=\"Done\")),\"Done\",VLOOKUP(C240,'Resource Map'!$B$3:$C$509,2,FALSE))","v":"Done"}]
[{"$f":"IF(AND(B241<>\"West\",OR(A240=\"Winter FOT\",A240=\"Done\")),\"Done\",VLOOKUP(C241,'Resource Map'!$B$3:$C$509,2,FALSE))","v":"Done"}]
[{"$f":"IF(AND(B242<>\"West\",OR(A241=\"Winter FOT\",A241=\"Done\")),\"Done\",VLOOKUP(C242,'Resource Map'!$B$3:$C$509,2,FALSE))","v":"Done"}]
[{"$f":"IF(AND(B243<>\"West\",OR(A242=\"Winter FOT\",A242=\"Done\")),\"Done\",VLOOKUP(C243,'Resource Map'!$B$3:$C$509,2,FALSE))","v":"Done"}]
[{"$f":"IF(AND(B244<>\"West\",OR(A243=\"Winter FOT\",A243=\"Done\")),\"Done\",VLOOKUP(C244,'Resource Map'!$B$3:$C$509,2,FALSE))","v":"Done"}]
[{"$f":"IF(AND(B245<>\"West\",OR(A244=\"Winter FOT\",A244=\"Done\")),\"Done\",VLOOKUP(C245,'Resource Map'!$B$3:$C$509,2,FALSE))","v":"Done"}]
[{"$f":"IF(AND(B246<>\"West\",OR(A245=\"Winter FOT\",A245=\"Done\")),\"Done\",VLOOKUP(C246,'Resource Map'!$B$3:$C$509,2,FALSE))","v":"Done"}]
[{"$f":"IF(AND(B247<>\"West\",OR(A246=\"Winter FOT\",A246=\"Done\")),\"Done\",VLOOKUP(C247,'Resource Map'!$B$3:$C$509,2,FALSE))","v":"Done"}]
[{"$f":"IF(AND(B248<>\"West\",OR(A247=\"Winter FOT\",A247=\"Done\")),\"Done\",VLOOKUP(C248,'Resource Map'!$B$3:$C$509,2,FALSE))","v":"Done"}]
[{"$f":"IF(AND(B249<>\"West\",OR(A248=\"Winter FOT\",A248=\"Done\")),\"Done\",VLOOKUP(C249,'Resource Map'!$B$3:$C$509,2,FALSE))","v":"Done"}]
[{"$f":"IF(AND(B250<>\"West\",OR(A249=\"Winter FOT\",A249=\"Done\")),\"Done\",VLOOKUP(C250,'Resource Map'!$B$3:$C$509,2,FALSE))","v":"Done"}]
[{"$f":"IF(AND(B251<>\"West\",OR(A250=\"Winter FOT\",A250=\"Done\")),\"Done\",VLOOKUP(C251,'Resource Map'!$B$3:$C$509,2,FALSE))","v":"Done"}]
[{"$f":"IF(AND(B252<>\"West\",OR(A251=\"Winter FOT\",A251=\"Done\")),\"Done\",VLOOKUP(C252,'Resource Map'!$B$3:$C$509,2,FALSE))","v":"Done"}]
[{"$f":"IF(AND(B253<>\"West\",OR(A252=\"Winter FOT\",A252=\"Done\")),\"Done\",VLOOKUP(C253,'Resource Map'!$B$3:$C$509,2,FALSE))","v":"Done"}]
[{"$f":"IF(AND(B254<>\"West\",OR(A253=\"Winter FOT\",A253=\"Done\")),\"Done\",VLOOKUP(C254,'Resource Map'!$B$3:$C$509,2,FALSE))","v":"Done"}]
[{"$f":"IF(AND(B255<>\"West\",OR(A254=\"Winter FOT\",A254=\"Done\")),\"Done\",VLOOKUP(C255,'Resource Map'!$B$3:$C$509,2,FALSE))","v":"Done"}]
[{"$f":"IF(AND(B256<>\"West\",OR(A255=\"Winter FOT\",A255=\"Done\")),\"Done\",VLOOKUP(C256,'Resource Map'!$B$3:$C$509,2,FALSE))","v":"Done"}]
[{"$f":"IF(AND(B257<>\"West\",OR(A256=\"Winter FOT\",A256=\"Done\")),\"Done\",VLOOKUP(C257,'Resource Map'!$B$3:$C$509,2,FALSE))","v":"Done"}]
[{"$f":"IF(AND(B258<>\"West\",OR(A257=\"Winter FOT\",A257=\"Done\")),\"Done\",VLOOKUP(C258,'Resource Map'!$B$3:$C$509,2,FALSE))","v":"Done"}]
[{"$f":"IF(AND(B259<>\"West\",OR(A258=\"Winter FOT\",A258=\"Done\")),\"Done\",VLOOKUP(C259,'Resource Map'!$B$3:$C$509,2,FALSE))","v":"Done"}]
[{"$f":"IF(AND(B260<>\"West\",OR(A259=\"Winter FOT\",A259=\"Done\")),\"Done\",VLOOKUP(C260,'Resource Map'!$B$3:$C$509,2,FALSE))","v":"Done"}]
[{"$f":"IF(AND(B261<>\"West\",OR(A260=\"Winter FOT\",A260=\"Done\")),\"Done\",VLOOKUP(C261,'Resource Map'!$B$3:$C$509,2,FALSE))","v":"Done"}]
[{"$f":"IF(AND(B262<>\"West\",OR(A261=\"Winter FOT\",A261=\"Done\")),\"Done\",VLOOKUP(C262,'Resource Map'!$B$3:$C$509,2,FALSE))","v":"Done"}]
[{"$f":"IF(AND(B263<>\"West\",OR(A262=\"Winter FOT\",A262=\"Done\")),\"Done\",VLOOKUP(C263,'Resource Map'!$B$3:$C$509,2,FALSE))","v":"Done"}]
[{"$f":"IF(AND(B264<>\"West\",OR(A263=\"Winter FOT\",A263=\"Done\")),\"Done\",VLOOKUP(C264,'Resource Map'!$B$3:$C$509,2,FALSE))","v":"Done"}]
[{"$f":"IF(AND(B265<>\"West\",OR(A264=\"Winter FOT\",A264=\"Done\")),\"Done\",VLOOKUP(C265,'Resource Map'!$B$3:$C$509,2,FALSE))","v":"Done"}]
[{"$f":"IF(AND(B266<>\"West\",OR(A265=\"Winter FOT\",A265=\"Done\")),\"Done\",VLOOKUP(C266,'Resource Map'!$B$3:$C$509,2,FALSE))","v":"Done"}]
[{"$f":"IF(AND(B267<>\"West\",OR(A266=\"Winter FOT\",A266=\"Done\")),\"Done\",VLOOKUP(C267,'Resource Map'!$B$3:$C$509,2,FALSE))","v":"Done"}]
[{"$f":"IF(AND(B268<>\"West\",OR(A267=\"Winter FOT\",A267=\"Done\")),\"Done\",VLOOKUP(C268,'Resource Map'!$B$3:$C$509,2,FALSE))","v":"Done"}]
[{"$f":"IF(AND(B269<>\"West\",OR(A268=\"Winter FOT\",A268=\"Done\")),\"Done\",VLOOKUP(C269,'Resource Map'!$B$3:$C$509,2,FALSE))","v":"Done"}]
[{"$f":"IF(AND(B270<>\"West\",OR(A269=\"Winter FOT\",A269=\"Done\")),\"Done\",VLOOKUP(C270,'Resource Map'!$B$3:$C$509,2,FALSE))","v":"Done"}]
[{"$f":"IF(AND(B271<>\"West\",OR(A270=\"Winter FOT\",A270=\"Done\")),\"Done\",VLOOKUP(C271,'Resource Map'!$B$3:$C$509,2,FALSE))","v":"Done"}]
[{"$f":"IF(AND(B272<>\"West\",OR(A271=\"Winter FOT\",A271=\"Done\")),\"Done\",VLOOKUP(C272,'Resource Map'!$B$3:$C$509,2,FALSE))","v":"Done"}]
[{"$f":"IF(AND(B273<>\"West\",OR(A272=\"Winter FOT\",A272=\"Done\")),\"Done\",VLOOKUP(C273,'Resource Map'!$B$3:$C$509,2,FALSE))","v":"Done"}]
[{"$f":"IF(AND(B274<>\"West\",OR(A273=\"Winter FOT\",A273=\"Done\")),\"Done\",VLOOKUP(C274,'Resource Map'!$B$3:$C$509,2,FALSE))","v":"Done"}]
[{"$f":"IF(AND(B275<>\"West\",OR(A274=\"Winter FOT\",A274=\"Done\")),\"Done\",VLOOKUP(C275,'Resource Map'!$B$3:$C$509,2,FALSE))","v":"Done"}]
[{"$f":"IF(AND(B276<>\"West\",OR(A275=\"Winter FOT\",A275=\"Done\")),\"Done\",VLOOKUP(C276,'Resource Map'!$B$3:$C$509,2,FALSE))","v":"Done"}]
[{"$f":"IF(AND(B277<>\"West\",OR(A276=\"Winter FOT\",A276=\"Done\")),\"Done\",VLOOKUP(C277,'Resource Map'!$B$3:$C$509,2,FALSE))","v":"Done"}]
[{"$f":"IF(AND(B278<>\"West\",OR(A277=\"Winter FOT\",A277=\"Done\")),\"Done\",VLOOKUP(C278,'Resource Map'!$B$3:$C$509,2,FALSE))","v":"Done"}]
[{"$f":"IF(AND(B279<>\"West\",OR(A278=\"Winter FOT\",A278=\"Done\")),\"Done\",VLOOKUP(C279,'Resource Map'!$B$3:$C$509,2,FALSE))","v":"Done"}]
[{"$f":"IF(AND(B280<>\"West\",OR(A279=\"Winter FOT\",A279=\"Done\")),\"Done\",VLOOKUP(C280,'Resource Map'!$B$3:$C$509,2,FALSE))","v":"Done"}]
[{"$f":"IF(AND(B281<>\"West\",OR(A280=\"Winter FOT\",A280=\"Done\")),\"Done\",VLOOKUP(C281,'Resource Map'!$B$3:$C$509,2,FALSE))","v":"Done"}]
[{"$f":"IF(AND(B282<>\"West\",OR(A281=\"Winter FOT\",A281=\"Done\")),\"Done\",VLOOKUP(C282,'Resource Map'!$B$3:$C$509,2,FALSE))","v":"Done"}]
[{"$f":"IF(AND(B283<>\"West\",OR(A282=\"Winter FOT\",A282=\"Done\")),\"Done\",VLOOKUP(C283,'Resource Map'!$B$3:$C$509,2,FALSE))","v":"Done"}]
[{"$f":"IF(AND(B284<>\"West\",OR(A283=\"Winter FOT\",A283=\"Done\")),\"Done\",VLOOKUP(C284,'Resource Map'!$B$3:$C$509,2,FALSE))","v":"Done"}]
[{"$f":"IF(AND(B285<>\"West\",OR(A284=\"Winter FOT\",A284=\"Done\")),\"Done\",VLOOKUP(C285,'Resource Map'!$B$3:$C$509,2,FALSE))","v":"Done"}]
[{"$f":"IF(AND(B286<>\"West\",OR(A285=\"Winter FOT\",A285=\"Done\")),\"Done\",VLOOKUP(C286,'Resource Map'!$B$3:$C$509,2,FALSE))","v":"Done"}]
[{"$f":"IF(AND(B287<>\"West\",OR(A286=\"Winter FOT\",A286=\"Done\")),\"Done\",VLOOKUP(C287,'Resource Map'!$B$3:$C$509,2,FALSE))","v":"Done"}]
[{"$f":"IF(AND(B288<>\"West\",OR(A287=\"Winter FOT\",A287=\"Done\")),\"Done\",VLOOKUP(C288,'Resource Map'!$B$3:$C$509,2,FALSE))","v":"Done"}]
[{"$f":"IF(AND(B289<>\"West\",OR(A288=\"Winter FOT\",A288=\"Done\")),\"Done\",VLOOKUP(C289,'Resource Map'!$B$3:$C$509,2,FALSE))","v":"Done"}]
[{"$f":"IF(AND(B290<>\"West\",OR(A289=\"Winter FOT\",A289=\"Done\")),\"Done\",VLOOKUP(C290,'Resource Map'!$B$3:$C$509,2,FALSE))","v":"Done"}]
[{"$f":"IF(AND(B291<>\"West\",OR(A290=\"Winter FOT\",A290=\"Done\")),\"Done\",VLOOKUP(C291,'Resource Map'!$B$3:$C$509,2,FALSE))","v":"Done"}]
[{"$f":"IF(AND(B292<>\"West\",OR(A291=\"Winter FOT\",A291=\"Done\")),\"Done\",VLOOKUP(C292,'Resource Map'!$B$3:$C$509,2,FALSE))","v":"Done"}]
[{"$f":"IF(AND(B293<>\"West\",OR(A292=\"Winter FOT\",A292=\"Done\")),\"Done\",VLOOKUP(C293,'Resource Map'!$B$3:$C$509,2,FALSE))","v":"Done"}]
[{"$f":"IF(AND(B294<>\"West\",OR(A293=\"Winter FOT\",A293=\"Done\")),\"Done\",VLOOKUP(C294,'Resource Map'!$B$3:$C$509,2,FALSE))","v":"Done"}]
[{"$f":"IF(AND(B295<>\"West\",OR(A294=\"Winter FOT\",A294=\"Done\")),\"Done\",VLOOKUP(C295,'Resource Map'!$B$3:$C$509,2,FALSE))","v":"Done"}]
[{"$f":"IF(AND(B296<>\"West\",OR(A295=\"Winter FOT\",A295=\"Done\")),\"Done\",VLOOKUP(C296,'Resource Map'!$B$3:$C$509,2,FALSE))","v":"Done"}]
[{"$f":"IF(AND(B297<>\"West\",OR(A296=\"Winter FOT\",A296=\"Done\")),\"Done\",VLOOKUP(C297,'Resource Map'!$B$3:$C$509,2,FALSE))","v":"Done"}]
[{"$f":"IF(AND(B298<>\"West\",OR(A297=\"Winter FOT\",A297=\"Done\")),\"Done\",VLOOKUP(C298,'Resource Map'!$B$3:$C$509,2,FALSE))","v":"Done"}]
[{"$f":"IF(AND(B299<>\"West\",OR(A298=\"Winter FOT\",A298=\"Done\")),\"Done\",VLOOKUP(C299,'Resource Map'!$B$3:$C$509,2,FALSE))","v":"Done"}]
[{"$f":"IF(AND(B300<>\"West\",OR(A299=\"Winter FOT\",A299=\"Done\")),\"Done\",VLOOKUP(C300,'Resource Map'!$B$3:$C$509,2,FALSE))","v":"Done"}]
[{"$f":"IF(AND(B301<>\"West\",OR(A300=\"Winter FOT\",A300=\"Done\")),\"Done\",VLOOKUP(C301,'Resource Map'!$B$3:$C$509,2,FALSE))","v":"Done"}]
[{"$f":"IF(AND(B302<>\"West\",OR(A301=\"Winter FOT\",A301=\"Done\")),\"Done\",VLOOKUP(C302,'Resource Map'!$B$3:$C$509,2,FALSE))","v":"Done"}]

{"sheet":"Data Base Pre","index":4,"n_rows":302,"n_cols":27,"rows_kept":302,"cut":false,"hidden":false,"merged":[]}
["P45CNW-",null,{"$f":"IF(IFERROR(SUM(A68:A302),\"Err\")=0,\"OK\",\"MAPPING ERRORS, left column below\")","v":"OK"},null,null,null,null,null,null,null,null,null,null,null,null,null,null,null,null,null,null,null,null,null,"Checks for","MAPPING ERRORS, left column below"]
[]
[null,null,"Coal"]
[null,null,"Incremental",2019,2020,2021,2022,2023,2024,2025,2026,2027,2028,2029,2030,2031,2032,2033,2034,2035,2036,2037,2038]
[null,null,"Coal Removed",{"$f":"SUMIF($A$69:$A$302,$C5,D$69:D$302)","v":0},-280,-387,0,0,-350.5,0,-439.3,-81.5,-903,-355.8,0,-76.599999999999994,0,0,0,0,0,-909,-702]
[]
[null,null,"Cumulative",2019,2020,2021,2022,2023,2024,2025,2026,2027,2028,2029,2030,2031,2032,2033,2034,2035,2036,2037,2038]
[null,null,"Coal Removed",{"$f":"D5","v":0},{"$f":"E5+D8","v":-280},{"$f":"F5+E8","v":-667},-667,-667,-1017.5,-1017.5,-1456.8,-1538.3,-2441.3000000000002,-2797.1000000000004,-2797.1000000000004,-2873.7000000000003,-2873.7000000000003,-2873.7000000000003,-2873.7000000000003,-2873.7000000000003,-2873.7000000000003,-3782.7000000000003,-4484.7000000000007]
[]
[null,null,"Renewable and Storage"]
[null,null,"Incremental",2019,2020,2021,2022,2023,2024,2025,2026,2027,2028,2029,2030,2031,2032,2033,2034,2035,2036,2037,2038]
[null,null,"Wind",{"$f":"SUMIF($A$69:$A$302,$C12,D$69:D$302)","v":0},0,0,0,69.215999999999994,1920,0,0,0,0,{"$f":"SUMIF($A$69:$A$302,$C12,N$69:N$302)","v":0},1039.5160000000001,0,0,0,0,0,0,0,0]
[null,null,"Solar",0,0,0,0,0,0,0,0,0,0,0,0,0,0,0,0,0,0,0,0]
[null,null,"Wind+Bat",0,0,0,0,0,0,0,0,0,0,9.7910000000000004,0,0,60.484000000000002,0,0,0,0,10.577,0]
[null,null,"Solar+Bat",0,0,159.255,63.768000000000001,3.43,2153.54,0,0,0,0,359.3,500,0,0,475,0,0,419.423,909,701.7]
[null,null,"Battery",0,0,0,0,0,0,0,0,0,0,0,0,0,0,0,0,0,0,0,450]
[null,null,"Pumped Storage",0,0,0,0,0,0,0,0,0,0,0,0,0,0,0,0,0,0,0,0]
[null,null,"Hydro Removed",0,-1.1000000000000001,-168.90000000000003,0,-0.7,-20.28,0,-1.4,0,-7.2,0,0,-6.4,0,0,-74.900000000000006,0,-1.2,0,0]
[null,null,"Wind Removed",0,-26.55,-16.8,-224,-0.2,-41,0,-64.5,-3,0,-93.4,-149.1,-200.2,-65,-200.9,-80,0,-70,-90,0]
[null,null,"Solar Removed",0,0,0,0,-0.5,-0.52,0,0,0,-2,0,0,-67,-48.9,0,0,-35.9,-209.10000000000002,-1024.2,-10.9]
[null,null,"Other Removed",0,0,0,0,0,0,0,0,0,0,0,0,0,0,0,-0.90700000000000003,0,0,0,-32.1]
[]
[null,null,"Cumulative",2019,2020,2021,2022,2023,2024,2025,2026,2027,2028,2029,2030,2031,2032,2033,2034,2035,2036,2037,2038,null,"Wind","Solar","Battery"]
[null,null,"Wind",{"$f":"D12","v":0},{"$f":"D24+E12","v":0},0,0,69.215999999999994,1989.2159999999999,1989.2159999999999,1989.2159999999999,1989.2159999999999,1989.2159999999999,1989.2159999999999,3028.732,3028.732,3028.732,3028.732,3028.732,3028.732,3028.732,3028.732,3028.732,null,{"$f":"W24+SUM(D19:W19)+W26","v":1784.934},{"$f":"W25+SUM(D20:W20)+W27","v":4345.3959999999997},{"$f":"0.25*W26+0.25*W27+W28","v":1906.317}]
[null,null,"Solar",0,0,0,0,0,0,0,0,0,0,0,0,0,0,0,0,0,0,0,0]
[null,null,"Wind+Bat",0,0,0,0,0,0,0,0,0,0,9.7910000000000004,9.7910000000000004,9.7910000000000004,70.275000000000006,70.275000000000006,70.275000000000006,70.275000000000006,70.275000000000006,80.852000000000004,80.852000000000004]
[null,null,"Solar+Bat",0,0,159.255,223.023,226.453,2379.9929999999999,2379.9929999999999,2379.9929999999999,2379.9929999999999,2379.9929999999999,2739.2930000000001,3239.2930000000001,3239.2930000000001,3239.2930000000001,3714.2930000000001,3714.2930000000001,3714.2930000000001,4133.7160000000003,5042.7160000000003,5744.4160000000002]
[null,null,"Battery",0,0,0,0,0,0,0,0,0,0,0,0,0,0,0,0,0,0,0,450]
[null,null,"Pumped Storage",0,0,0,0,0,0,0,0,0,0,0,0,0,0,0,0,0,0,0,0]
[null,null,"Renewable Removed",{"$f":"D19+D20+D18+D21","v":0},{"$f":"E19+E20+E18+E21+D30","v":-27.650000000000002},{"$f":"F19+F20+F18+F21+E30","v":-213.35000000000005},-437.35,-438.75,-500.55,-500.55,-566.45000000000005,-569.45000000000005,-578.65000000000009,-672.05000000000007,-821.15000000000009,-1094.75,-1208.6500000000001,-1409.5500000000002,-1565.3570000000002,-1601.2570000000003,-1881.5570000000002,-2995.7570000000005,-3038.7570000000005]
[]
[null,null,"Gas"]
[null,null,"Incremental",2019,2020,2021,2022,2023,2024,2025,2026,2027,2028,2029,2030,2031,2032,2033,2034,2035,2036,2037,2038]
[null,null,"Gas Peaker",{"$f":"SUMIF($A$69:$A$302,$C34,D$69:D$302)","v":0},0,0,0,0,0,0,0,0,0,{"$f":"SUMIF($A$69:$A$302,$C34,N$69:N$302)","v":0},184.9,184.9,0,184.9,0,0,0,812.6,0]
[null,null,"Gas CCCT",0,0,0,0,0,0,0,0,0,0,0,0,0,0,0,0,0,0,505.2,0]
[null,null,"Gas Conv.",0,247,0,0,0,0,0,0,0,0,0,-247,0,0,0,0,0,0,0,0]
[null,null,"Gas Removed",0,0,0,0,0,0,0,0,0,0,0,0,0,0,-356.30000000000007,0,0,0,-237,0]
[]
[null,null,"Cumulative",2019,2020,2021,2022,2023,2024,2025,2026,2027,2028,2029,2030,2031,2032,2033,2034,2035,2036,2037,2038]
[null,null,"Gas Peaker",{"$f":"D34","v":0},{"$f":"D40+E34","v":0},{"$f":"E40+F34","v":0},0,0,0,0,0,0,0,0,184.9,369.8,369.8,554.70000000000005,554.70000000000005,554.70000000000005,554.70000000000005,1367.3000000000002,1367.3000000000002]
[null,null,"Gas CCCT",{"$f":"D35","v":0},{"$f":"D41+E35","v":0},{"$f":"E41+F35","v":0},0,0,0,0,0,0,0,0,0,0,0,0,0,0,0,505.2,505.2]
[null,null,"Gas Conv.",{"$f":"D36","v":0},{"$f":"D42+E36","v":247},{"$f":"E42+F36","v":247},247,247,247,247,247,247,247,247,0,0,0,0,0,0,0,0,0]
[null,null,"Gas Removed",{"$f":"D37","v":0},{"$f":"D43+E37","v":0},0,0,0,0,0,0,0,0,0,0,0,0,-356.30000000000007,-356.30000000000007,-356.30000000000007,-356.30000000000007,-593.30000000000007,-593.30000000000007]
[]
[null,null,"Demand-Side Management"]
[null,null,"Incremental",2019,2020,2021,2022,2023,2024,2025,2026,2027,2028,2029,2030,2031,2032,2033,2034,2035,2036,2037,2038]
[null,null,"Class 2 DSM",{"$f":"SUMIF($A$69:$A$302,$C47,D$69:D$302)","v":126},118.47,118.78000000000002,126.02000000000001,135.81,135.37,132.22,133.09,134.22999999999999,131.66,{"$f":"SUMIF($A$69:$A$302,$C47,N$69:N$302)","v":120.13999999999999},115.35,111.44999999999999,105.9,100.11000000000001,81.99,76.410000000000011,65.45,58.58,60.77]
[null,null,"Class 1 DSM",4.0599999999999996,0,7.0039999999999996,0,18.11,0,8.2110000000000003,7.1660000000000004,0,0,132.71099999999998,8.2140000000000004,0,11.995000000000001,0,0,15.343,3.6539999999999999,59.272000000000006,168.649]
[]
[null,null,"Cumulative",2019,2020,2021,2022,2023,2024,2025,2026,2027,2028,2029,2030,2031,2032,2033,2034,2035,2036,2037,2038]
[null,null,"Class 2 DSM",{"$f":"D47","v":126},{"$f":"D51+E47","v":244.47},363.25,489.27,625.07999999999993,760.44999999999993,892.67,1025.76,1159.99,1291.6500000000001,1411.79,1527.1399999999999,1638.59,1744.49,1844.6,1926.59,2003,2068.4499999999998,2127.0299999999997,2187.7999999999997]
[null,null,"Class 1 DSM",{"$f":"D48","v":4.0599999999999996},4.0599999999999996,11.064,11.064,29.173999999999999,29.173999999999999,37.384999999999998,44.551000000000002,44.551000000000002,44.551000000000002,177.262,185.476,185.476,197.471,197.471,197.471,212.81399999999999,216.46799999999999,275.74,444.38900000000001]
[]
[null,null,"FOTs"]
[null,null,"Incremental",2019,2020,2021,2022,2023,2024,2025,2026,2027,2028,2029,2030,2031,2032,2033,2034,2035,2036,2037,2038]
[null,null,"FOT",{"$f":"SUMIF($A$69:$A$302,$C56,D$69:D$302)","v":997.75299999999993},719.44499999999994,493.005,502.68700000000001,497.86799999999999,130.953,126.44,191.25299999999999,263.99099999999999,1162.5450000000001,1375,1273.635,1248.7930000000001,1281.308,1372.6979999999999,1375,1374.4879999999998,1276.605,1374.461,1375]
[null,null,"Winter FOT",151.43799999999999,130.95499999999998,268.49199999999996,303.31600000000003,314.00799999999998,44.277000000000001,50.792999999999999,52.579000000000001,99.66,231.57400000000001,222.184,172.96600000000001,191.97699999999998,128.005,62.75,0,35.381999999999998,0,0,0]
[]
[null,null,"Removed Capacity",{"$f":"D8+D30+D43","v":0},{"$f":"E8+E30+E43","v":-307.64999999999998},-880.35,-1104.3499999999999,-1105.75,-1518.05,-1518.05,-2023.25,-2107.75,-3019.9500000000003,-3469.1500000000005,-3618.2500000000005,-3968.4500000000003,-4082.3500000000004,-4639.55,-4795.3570000000009,-4831.2570000000005,-5111.5570000000007,-7371.7570000000005,-8116.7570000000014]
[]
[]
[]
[]
[null,"Study Name: I19-P45CNW-MM  (09-19-19 0628 PM)"]
[null,null,null,""]
[null,null,null,"Capacity (MW)"]
[null,null,"Resource",2019,2020,2021,2022,2023,2024,2025,2026,2027,2028,2029,2030,2031,2032,2033,2034,2035,2036,2037,2038]
[{"$f":"IF(AND(B68<>\"West\",OR(A67=\"Winter FOT\",A67=\"Done\")),\"Done\",VLOOKUP(C68,'Resource Map'!$B$3:$C$509,2,FALSE))","v":"-"},"East","Existing Plant Retirements and PPA Termination"]
[{"$f":"IF(AND(B69<>\"West\",OR(A68=\"Winter FOT\",A68=\"Done\")),\"Done\",VLOOKUP(C69,'Resource Map'!$B$3:$C$509,2,FALSE))","v":"Coal Removed"},null,"Craig 1  (Coal Early Retirement/Conversions)",0,0,0,0,0,0,0,-82.3,0,0,0,0,0,0,0,0,0,0,0,0]
[{"$f":"IF(AND(B70<>\"West\",OR(A69=\"Winter FOT\",A69=\"Done\")),\"Done\",VLOOKUP(C70,'Resource Map'!$B$3:$C$509,2,FALSE))","v":"Coal Removed"},null,"Craig 2  (Coal Early Retirement/Conversions)",0,0,0,0,0,0,0,0,-81.5,0,0,0,0,0,0,0,0,0,0,0]
[{"$f":"IF(AND(B71<>\"West\",OR(A70=\"Winter FOT\",A70=\"Done\")),\"Done\",VLOOKUP(C71,'Resource Map'!$B$3:$C$509,2,FALSE))","v":"Coal Removed"},null,"Hayden 1",0,0,0,0,0,0,0,0,0,0,0,0,-43.9,0,0,0,0,0,0,0]
[{"$f":"IF(AND(B72<>\"West\",OR(A71=\"Winter FOT\",A71=\"Done\")),\"Done\",VLOOKUP(C72,'Resource Map'!$B$3:$C$509,2,FALSE))","v":"Coal Removed"},null,"Hayden 2",0,0,0,0,0,0,0,0,0,0,0,0,-32.700000000000003,0,0,0,0,0,0,0]
[{"$f":"IF(AND(B73<>\"West\",OR(A72=\"Winter FOT\",A72=\"Done\")),\"Done\",VLOOKUP(C73,'Resource Map'!$B$3:$C$509,2,FALSE))","v":"Coal Removed"},null,"Huntington 1",0,0,0,0,0,0,0,0,0,0,0,0,0,0,0,0,0,0,-459,0]
[{"$f":"IF(AND(B74<>\"West\",OR(A73=\"Winter FOT\",A73=\"Done\")),\"Done\",VLOOKUP(C74,'Resource Map'!$B$3:$C$509,2,FALSE))","v":"Coal Removed"},null,"Huntington 2",0,0,0,0,0,0,0,0,0,0,0,0,0,0,0,0,0,0,-450,0]
[{"$f":"IF(AND(B75<>\"West\",OR(A74=\"Winter FOT\",A74=\"Done\")),\"Done\",VLOOKUP(C75,'Resource Map'!$B$3:$C$509,2,FALSE))","v":"Coal Removed"},null,"Colstrip 3  (Coal Early Retirement/Conversions)",0,0,0,0,0,0,0,0,0,-74,0,0,0,0,0,0,0,0,0,0]
[{"$f":"IF(AND(B76<>\"West\",OR(A75=\"Winter FOT\",A75=\"Done\")),\"Done\",VLOOKUP(C76,'Resource Map'!$B$3:$C$509,2,FALSE))","v":"Coal Removed"},null,"Colstrip 4  (Coal Early Retirement/Conversions)",0,0,0,0,0,0,0,0,0,-74,0,0,0,0,0,0,0,0,0,0]
[{"$f":"IF(AND(B77<>\"West\",OR(A76=\"Winter FOT\",A76=\"Done\")),\"Done\",VLOOKUP(C77,'Resource Map'!$B$3:$C$509,2,FALSE))","v":"Coal Removed"},null,"Cholla 4  (Coal Early Retirement/Conversions)",0,0,-387,0,0,0,0,0,0,0,0,0,0,0,0,0,0,0,0,0]
[{"$f":"IF(AND(B78<>\"West\",OR(A77=\"Winter FOT\",A77=\"Done\")),\"Done\",VLOOKUP(C78,'Resource Map'!$B$3:$C$509,2,FALSE))","v":"Coal Removed"},null,"DaveJohnston 1",0,0,0,0,0,0,0,0,0,-99,0,0,0,0,0,0,0,0,0,0]
[{"$f":"IF(AND(B79<>\"West\",OR(A78=\"Winter FOT\",A78=\"Done\")),\"Done\",VLOOKUP(C79,'Resource Map'!$B$3:$C$509,2,FALSE))","v":"Coal Removed"},null,"DaveJohnston 2",0,0,0,0,0,0,0,0,0,-106,0,0,0,0,0,0,0,0,0,0]
[{"$f":"IF(AND(B80<>\"West\",OR(A79=\"Winter FOT\",A79=\"Done\")),\"Done\",VLOOKUP(C80,'Resource Map'!$B$3:$C$509,2,FALSE))","v":"Coal Removed"},null,"DaveJohnston 3",0,0,0,0,0,0,0,0,0,-220,0,0,0,0,0,0,0,0,0,0]
[{"$f":"IF(AND(B81<>\"West\",OR(A80=\"Winter FOT\",A80=\"Done\")),\"Done\",VLOOKUP(C81,'Resource Map'!$B$3:$C$509,2,FALSE))","v":"Coal Removed"},null,"DaveJohnston 4",0,0,0,0,0,0,0,0,0,-330,0,0,0,0,0,0,0,0,0,0]
[{"$f":"IF(AND(B82<>\"West\",OR(A81=\"Winter FOT\",A81=\"Done\")),\"Done\",VLOOKUP(C82,'Resource Map'!$B$3:$C$509,2,FALSE))","v":"Coal Removed"},null,"Naughton 1  (Coal Early Retirement/Conversions)",0,0,0,0,0,0,0,-156,0,0,0,0,0,0,0,0,0,0,0,0]
[{"$f":"IF(AND(B83<>\"West\",OR(A82=\"Winter FOT\",A82=\"Done\")),\"Done\",VLOOKUP(C83,'Resource Map'!$B$3:$C$509,2,FALSE))","v":"Coal Removed"},null,"Naughton 2  (Coal Early Retirement/Conversions)",0,0,0,0,0,0,0,-201,0,0,0,0,0,0,0,0,0,0,0,0]
[{"$f":"IF(AND(B84<>\"West\",OR(A83=\"Winter FOT\",A83=\"Done\")),\"Done\",VLOOKUP(C84,'Resource Map'!$B$3:$C$509,2,FALSE))","v":"Coal Removed"},null,"Naughton 3  (Coal Early Retirement/Conversions)",0,-280,0,0,0,0,0,0,0,0,0,0,0,0,0,0,0,0,0,0]
[{"$f":"IF(AND(B85<>\"West\",OR(A84=\"Winter FOT\",A84=\"Done\")),\"Done\",VLOOKUP(C85,'Resource Map'!$B$3:$C$509,2,FALSE))","v":"Gas Removed"},null,"Gadsby 1-6",0,0,0,0,0,0,0,0,0,0,0,0,0,0,-356.30000000000007,0,0,0,0,0]
[{"$f":"IF(AND(B86<>\"West\",OR(A85=\"Winter FOT\",A85=\"Done\")),\"Done\",VLOOKUP(C86,'Resource Map'!$B$3:$C$509,2,FALSE))","v":"Hydro Removed"},null,"Retire - Hydro",0,0,0,0,0,-20.28,0,0,0,0,0,0,0,0,0,0,0,0,0,0]
[{"$f":"IF(AND(B87<>\"West\",OR(A86=\"Winter FOT\",A86=\"Done\")),\"Done\",VLOOKUP(C87,'Resource Map'!$B$3:$C$509,2,FALSE))","v":"Wind Removed"},null,"Retire - Wind",0,0,0,0,0,0,0,0,0,0,0,-40.200000000000003,0,0,0,0,0,0,0,0]
[{"$f":"IF(AND(B88<>\"West\",OR(A87=\"Winter FOT\",A87=\"Done\")),\"Done\",VLOOKUP(C88,'Resource Map'!$B$3:$C$509,2,FALSE))","v":"Wind Removed"},null,"Expire - Wind PPA",0,-26.55,-16.8,-49,-0.2,0,0,-64.5,-3,0,-18.899999999999999,-99,-200.2,-45,-180.9,-80,0,-60,-80,0]
[{"$f":"IF(AND(B89<>\"West\",OR(A88=\"Winter FOT\",A88=\"Done\")),\"Done\",VLOOKUP(C89,'Resource Map'!$B$3:$C$509,2,FALSE))","v":"Solar Removed"},null,"Expire - Solar PPA",0,0,0,0,-0.5,-0.52,0,0,0,0,0,0,0,0,0,0,-35.1,-94.100000000000009,-849,0]
[{"$f":"IF(AND(B90<>\"West\",OR(A89=\"Winter FOT\",A89=\"Done\")),\"Done\",VLOOKUP(C90,'Resource Map'!$B$3:$C$509,2,FALSE))","v":"Other Removed"},null,"Retire - Other",0,0,0,0,0,0,0,0,0,0,0,0,0,0,0,-0.90700000000000003,0,0,0,-32.1]
[{"$f":"IF(AND(B91<>\"West\",OR(A90=\"Winter FOT\",A90=\"Done\")),\"Done\",VLOOKUP(C91,'Resource Map'!$B$3:$C$509,2,FALSE))","v":"Gas Conv."},null,"Coal Ret_WY - Gas RePower",0,247,0,0,0,0,0,0,0,0,0,-247,0,0,0,0,0,0,0,0]
[{"$f":"IF(AND(B92<>\"West\",OR(A91=\"Winter FOT\",A91=\"Done\")),\"Done\",VLOOKUP(C92,'Resource Map'!$B$3:$C$509,2,FALSE))","v":"-"},null,"Expansion Resources"]
[{"$f":"IF(AND(B93<>\"West\",OR(A92=\"Winter FOT\",A92=\"Done\")),\"Done\",VLOOKUP(C93,'Resource Map'!$B$3:$C$509,2,FALSE))","v":"Gas CCCT"},null,"CCCT - DJohns - J 1x1",0,0,0,0,0,0,0,0,0,0,0,0,0,0,0,0,0,0,505.2,0]
[{"$f":"IF(AND(B94<>\"West\",OR(A93=\"Winter FOT\",A93=\"Done\")),\"Done\",VLOOKUP(C94,'Resource Map'!$B$3:$C$509,2,FALSE))","v":"-"},null,"Total CCCT",0,0,0,0,0,0,0,0,0,0,0,0,0,0,0,0,0,0,505.2,0]
[{"$f":"IF(AND(B95<>\"West\",OR(A94=\"Winter FOT\",A94=\"Done\")),\"Done\",VLOOKUP(C95,'Resource Map'!$B$3:$C$509,2,FALSE))","v":"Gas Peaker"},null,"SCCT Frame NTN",0,0,0,0,0,0,0,0,0,0,0,184.9,184.9,0,184.9,0,0,0,0,0]
[{"$f":"IF(AND(B96<>\"West\",OR(A95=\"Winter FOT\",A95=\"Done\")),\"Done\",VLOOKUP(C96,'Resource Map'!$B$3:$C$509,2,FALSE))","v":"Gas Peaker"},null,"SCCT Frame WYSW",0,0,0,0,0,0,0,0,0,0,0,0,0,0,0,0,0,0,369.8,0]
[{"$f":"IF(AND(B97<>\"West\",OR(A96=\"Winter FOT\",A96=\"Done\")),\"Done\",VLOOKUP(C97,'Resource Map'!$B$3:$C$509,2,FALSE))","v":"-"},null,"Total SCCT",0,0,0,0,0,0,0,0,0,0,0,184.9,184.9,0,184.9,0,0,0,369.8,0]
[{"$f":"IF(AND(B98<>\"West\",OR(A97=\"Winter FOT\",A97=\"Done\")),\"Done\",VLOOKUP(C98,'Resource Map'!$B$3:$C$509,2,FALSE))","v":"Wind"},null,"Wind, GO",0,0,0,0,0,0,0,0,0,0,0,1039.5160000000001,0,0,0,0,0,0,0,0]
[{"$f":"IF(AND(B99<>\"West\",OR(A98=\"Winter FOT\",A98=\"Done\")),\"Done\",VLOOKUP(C99,'Resource Map'!$B$3:$C$509,2,FALSE))","v":"Wind"},null,"Wind, UT",0,0,0,0,69.215999999999994,0,0,0,0,0,0,0,0,0,0,0,0,0,0,0]
[{"$f":"IF(AND(B100<>\"West\",OR(A99=\"Winter FOT\",A99=\"Done\")),\"Done\",VLOOKUP(C100,'Resource Map'!$B$3:$C$509,2,FALSE))","v":"Wind"},null,"Wind, WYAE",0,0,0,0,0,1920,0,0,0,0,0,0,0,0,0,0,0,0,0,0]
[{"$f":"IF(AND(B101<>\"West\",OR(A100=\"Winter FOT\",A100=\"Done\")),\"Done\",VLOOKUP(C101,'Resource Map'!$B$3:$C$509,2,FALSE))","v":"Wind+Bat"},null,"Wind+Storage, GO",0,0,0,0,0,0,0,0,0,0,0,0,0,60.484000000000002,0,0,0,0,0,0]
[{"$f":"IF(AND(B102<>\"West\",OR(A101=\"Winter FOT\",A101=\"Done\")),\"Done\",VLOOKUP(C102,'Resource Map'!$B$3:$C$509,2,FALSE))","v":"-"},null,"Total Wind",0,0,0,0,69.215999999999994,1920,0,0,0,0,0,1039.5160000000001,0,60.484000000000002,0,0,0,0,0,0]
[{"$f":"IF(AND(B103<>\"West\",OR(A102=\"Winter FOT\",A102=\"Done\")),\"Done\",VLOOKUP(C103,'Resource Map'!$B$3:$C$509,2,FALSE))","v":"Solar+Bat"},null,"Utility Solar+Storage - PV - Utah-S",0,0,0,0,0,230.78399999999999,0,0,0,0,0,500,0,0,0,0,0,0,0,0]
[{"$f":"IF(AND(B104<>\"West\",OR(A103=\"Winter FOT\",A103=\"Done\")),\"Done\",VLOOKUP(C104,'Resource Map'!$B$3:$C$509,2,FALSE))","v":"Solar+Bat"},null,"Utility Solar+Storage - PV - Huntington",0,0,0,0,0,0,0,0,0,0,0,0,0,0,0,0,0,0,909,0]
[{"$f":"IF(AND(B105<>\"West\",OR(A104=\"Winter FOT\",A104=\"Done\")),\"Done\",VLOOKUP(C105,'Resource Map'!$B$3:$C$509,2,FALSE))","v":"Solar+Bat"},null,"Utility Solar+Storage - PV - Utah-N",0,0,159.255,63.768000000000001,3.43,673.54700000000003,0,0,0,0,0,0,0,0,0,0,0,0,0,0]
[{"$f":"IF(AND(B106<>\"West\",OR(A105=\"Winter FOT\",A105=\"Done\")),\"Done\",VLOOKUP(C106,'Resource Map'!$B$3:$C$509,2,FALSE))","v":"-"},null,"Total Solar",0,0,159.255,63.768000000000001,3.43,904.33100000000002,0,0,0,0,0,500,0,0,0,0,0,0,909,0]
[{"$f":"IF(AND(B107<>\"West\",OR(A106=\"Winter FOT\",A106=\"Done\")),\"Done\",VLOOKUP(C107,'Resource Map'!$B$3:$C$509,2,FALSE))","v":"Class 1 DSM"},null,"Demand Response, ID-Irrigate",0,0,0,0,0,0,0,0,0,0,0,0,0,5.1520000000000001,0,0,0,3.6539999999999999,0,1.7889999999999999]
[{"$f":"IF(AND(B108<>\"West\",OR(A107=\"Winter FOT\",A107=\"Done\")),\"Done\",VLOOKUP(C108,'Resource Map'!$B$3:$C$509,2,FALSE))","v":"Class 1 DSM"},null,"Demand Response, UT-Cool/WH",4.0599999999999996,0,7.0039999999999996,0,9.8580000000000005,0,0,7.1660000000000004,0,0,6.6929999999999996,0,0,6.843,0,0,7.008,0,0,7.2370000000000001]
[{"$f":"IF(AND(B109<>\"West\",OR(A108=\"Winter FOT\",A108=\"Done\")),\"Done\",VLOOKUP(C109,'Resource Map'!$B$3:$C$509,2,FALSE))","v":"Class 1 DSM"},null,"Demand Response, UT-3rd Party Contracts",0,0,0,0,0,0,0,0,0,0,0,0,0,0,0,0,0,0,0,76.707999999999998]
[{"$f":"IF(AND(B110<>\"West\",OR(A109=\"Winter FOT\",A109=\"Done\")),\"Done\",VLOOKUP(C110,'Resource Map'!$B$3:$C$509,2,FALSE))","v":"Class 1 DSM"},null,"Demand Response, UT-Irrigate",0,0,0,0,0,0,0,0,0,0,0,0,0,0,0,0,0,0,0,1.927]
[{"$f":"IF(AND(B111<>\"West\",OR(A110=\"Winter FOT\",A110=\"Done\")),\"Done\",VLOOKUP(C111,'Resource Map'!$B$3:$C$509,2,FALSE))","v":"Class 1 DSM"},null,"Demand Response, UT-Thermostat",0,0,0,0,0,0,0,0,0,0,116.655,8.2140000000000004,0,0,0,0,8.3350000000000009,0,0,5.1180000000000003]
[{"$f":"IF(AND(B112<>\"West\",OR(A111=\"Winter FOT\",A111=\"Done\")),\"Done\",VLOOKUP(C112,'Resource Map'!$B$3:$C$509,2,FALSE))","v":"Class 1 DSM"},null,"Demand Response, WY-Cool/WH",0,0,0,0,0,0,0,0,0,0,0,0,0,0,0,0,0,0,0,5.2249999999999996]
[{"$f":"IF(AND(B113<>\"West\",OR(A112=\"Winter FOT\",A112=\"Done\")),\"Done\",VLOOKUP(C113,'Resource Map'!$B$3:$C$509,2,FALSE))","v":"Class 1 DSM"},null,"Demand Response, WY-3rd Party Contracts",0,0,0,0,0,0,0,0,0,0,0,0,0,0,0,0,0,0,0,37.33]
[{"$f":"IF(AND(B114<>\"West\",OR(A113=\"Winter FOT\",A113=\"Done\")),\"Done\",VLOOKUP(C114,'Resource Map'!$B$3:$C$509,2,FALSE))","v":"Class 1 DSM"},null,"Demand Response, WY-Irrigate",0,0,0,0,0,0,0,0,0,0,0,0,0,0,0,0,0,0,1.7569999999999999,0]
[{"$f":"IF(AND(B115<>\"West\",OR(A114=\"Winter FOT\",A114=\"Done\")),\"Done\",VLOOKUP(C115,'Resource Map'!$B$3:$C$509,2,FALSE))","v":"Class 1 DSM"},null,"Demand Response, WY-Thermostat",0,0,0,0,0,0,0,0,0,0,0,0,0,0,0,0,0,0,5.4930000000000003,1.212]
[{"$f":"IF(AND(B116<>\"West\",OR(A115=\"Winter FOT\",A115=\"Done\")),\"Done\",VLOOKUP(C116,'Resource Map'!$B$3:$C$509,2,FALSE))","v":"Class 1 DSM"},null,"Demand Response, UT-Ancillary Services",0,0,0,0,8.2520000000000007,0,5.2530000000000001,0,0,0,0,0,0,0,0,0,0,0,3.2410000000000001,0]
[{"$f":"IF(AND(B117<>\"West\",OR(A116=\"Winter FOT\",A116=\"Done\")),\"Done\",VLOOKUP(C117,'Resource Map'!$B$3:$C$509,2,FALSE))","v":"Class 1 DSM"},null,"Demand Response, WY-Ancillary Services",0,0,0,0,0,0,2.9580000000000002,0,0,0,0,0,0,0,0,0,0,0,0,0]
[{"$f":"IF(AND(B118<>\"West\",OR(A117=\"Winter FOT\",A117=\"Done\")),\"Done\",VLOOKUP(C118,'Resource Map'!$B$3:$C$509,2,FALSE))","v":"-"},null,"Demand Response Total",4.0599999999999996,0,7.0039999999999996,0,18.11,0,8.2110000000000003,7.1660000000000004,0,0,123.348,8.2140000000000004,0,11.995000000000001,0,0,15.343,3.6539999999999999,10.491,136.54599999999999]
[{"$f":"IF(AND(B119<>\"West\",OR(A118=\"Winter FOT\",A118=\"Done\")),\"Done\",VLOOKUP(C119,'Resource Map'!$B$3:$C$509,2,FALSE))","v":"Class 2 DSM"},null,"Energy Efficiency, ID",6,5.25,5.3400000000000007,6.6,7.03,6.92,6.89,6.84,7.07,6.92,6.45,6.23,6.1,5.86,5.58,4.42,4.0200000000000005,3.2700000000000005,2.9600000000000004,2.98]
[{"$f":"IF(AND(B120<>\"West\",OR(A119=\"Winter FOT\",A119=\"Done\")),\"Done\",VLOOKUP(C120,'Resource Map'!$B$3:$C$509,2,FALSE))","v":"Class 2 DSM"},null,"Energy Efficiency, UT",58,60.5,60.300000000000011,60.4,68.800000000000011,66.300000000000011,65,62.5,59.400000000000006,59.2,54.2,53.2,52.300000000000004,49.900000000000006,48.7,35.9,32.4,24.6,21.9,25.100000000000005]
[{"$f":"IF(AND(B121<>\"West\",OR(A120=\"Winter FOT\",A120=\"Done\")),\"Done\",VLOOKUP(C121,'Resource Map'!$B$3:$C$509,2,FALSE))","v":"Class 2 DSM"},null,"Energy Efficiency, WY",10,10.17,10.990000000000002,12.010000000000002,13.330000000000002,16.16,16.47,16.670000000000002,16.57,16.84,15.350000000000001,14.44,13.13,12.05,11.21,8.99,8.35,7.0900000000000007,5.19,5.33]
[{"$f":"IF(AND(B122<>\"West\",OR(A121=\"Winter FOT\",A121=\"Done\")),\"Done\",VLOOKUP(C122,'Resource Map'!$B$3:$C$509,2,FALSE))","v":"-"},null,"Energy Efficiency Total",74,75.92,76.630000000000024,79.010000000000005,89.160000000000011,89.38000000000001,88.36,86.01,83.039999999999992,82.960000000000008,76,73.87,71.53,67.81,65.490000000000009,49.31,44.77,34.96,30.05,33.410000000000004]
[{"$f":"IF(AND(B123<>\"West\",OR(A122=\"Winter FOT\",A122=\"Done\")),\"Done\",VLOOKUP(C123,'Resource Map'!$B$3:$C$509,2,FALSE))","v":"Battery"},null,"Battery Storage - Idaho",0,0,0,0,0,0,0,0,0,0,0,0,0,0,0,0,0,0,0,255]
[{"$f":"IF(AND(B124<>\"West\",OR(A123=\"Winter FOT\",A123=\"Done\")),\"Done\",VLOOKUP(C124,'Resource Map'!$B$3:$C$509,2,FALSE))","v":"FOT"},null,"FOT East - Summer",0,0,0,0,0,0,0,0,0,87.545000000000002,300,198.63499999999999,173.79300000000001,206.30799999999999,297.69799999999998,300,300,300,300,300]
[{"$f":"IF(AND(B125<>\"West\",OR(A124=\"Winter FOT\",A124=\"Done\")),\"Done\",VLOOKUP(C125,'Resource Map'!$B$3:$C$509,2,FALSE))","v":"-"},"West","Existing Plant Retirements and PPA Termination"]
[{"$f":"IF(AND(B126<>\"West\",OR(A125=\"Winter FOT\",A125=\"Done\")),\"Done\",VLOOKUP(C126,'Resource Map'!$B$3:$C$509,2,FALSE))","v":"Coal Removed"},null,"JimBridger 1  (Coal Early Retirement/Conversions)",0,0,0,0,0,-350.5,0,0,0,0,0,0,0,0,0,0,0,0,0,0]
[{"$f":"IF(AND(B127<>\"West\",OR(A126=\"Winter FOT\",A126=\"Done\")),\"Done\",VLOOKUP(C127,'Resource Map'!$B$3:$C$509,2,FALSE))","v":"Coal Removed"},null,"JimBridger 2  (Coal Early Retirement/Conversions)",0,0,0,0,0,0,0,0,0,0,-355.8,0,0,0,0,0,0,0,0,0]
[{"$f":"IF(AND(B128<>\"West\",OR(A127=\"Winter FOT\",A127=\"Done\")),\"Done\",VLOOKUP(C128,'Resource Map'!$B$3:$C$509,2,FALSE))","v":"Coal Removed"},null,"JimBridger 3",0,0,0,0,0,0,0,0,0,0,0,0,0,0,0,0,0,0,0,-348.7]
[{"$f":"IF(AND(B129<>\"West\",OR(A128=\"Winter FOT\",A128=\"Done\")),\"Done\",VLOOKUP(C129,'Resource Map'!$B$3:$C$509,2,FALSE))","v":"Coal Removed"},null,"JimBridger 4",0,0,0,0,0,0,0,0,0,0,0,0,0,0,0,0,0,0,0,-353.3]
[{"$f":"IF(AND(B130<>\"West\",OR(A129=\"Winter FOT\",A129=\"Done\")),\"Done\",VLOOKUP(C130,'Resource Map'!$B$3:$C$509,2,FALSE))","v":"Gas Removed"},null,"Hermiston",0,0,0,0,0,0,0,0,0,0,0,0,0,0,0,0,0,0,-237,0]
[{"$f":"IF(AND(B131<>\"West\",OR(A130=\"Winter FOT\",A130=\"Done\")),\"Done\",VLOOKUP(C131,'Resource Map'!$B$3:$C$509,2,FALSE))","v":"Hydro Removed"},null,"Retire - Hydro",0,-1.1000000000000001,-168.90000000000003,0,-0.7,0,0,-1.4,0,-7.2,0,0,-6.4,0,0,-74.900000000000006,0,-1.2,0,0]
[{"$f":"IF(AND(B132<>\"West\",OR(A131=\"Winter FOT\",A131=\"Done\")),\"Done\",VLOOKUP(C132,'Resource Map'!$B$3:$C$509,2,FALSE))","v":"Wind Removed"},null,"Expire - Wind PPA",0,0,0,-175,0,-41,0,0,0,0,-74.5,-9.9,0,-20,-20,0,0,-10,-10,0]
[{"$f":"IF(AND(B133<>\"West\",OR(A132=\"Winter FOT\",A132=\"Done\")),\"Done\",VLOOKUP(C133,'Resource Map'!$B$3:$C$509,2,FALSE))","v":"Solar Removed"},null,"Expire - Solar PPA",0,0,0,0,0,0,0,0,0,-2,0,0,-67,-48.9,0,0,-0.8,-115,-175.20000000000002,-10.9]
[{"$f":"IF(AND(B134<>\"West\",OR(A133=\"Winter FOT\",A133=\"Done\")),\"Done\",VLOOKUP(C134,'Resource Map'!$B$3:$C$509,2,FALSE))","v":"-"},null,"Expansion Resources"]
[{"$f":"IF(AND(B135<>\"West\",OR(A134=\"Winter FOT\",A134=\"Done\")),\"Done\",VLOOKUP(C135,'Resource Map'!$B$3:$C$509,2,FALSE))","v":"Gas Peaker"},null,"SCCT Frame WV",0,0,0,0,0,0,0,0,0,0,0,0,0,0,0,0,0,0,442.8,0]
[{"$f":"IF(AND(B136<>\"West\",OR(A135=\"Winter FOT\",A135=\"Done\")),\"Done\",VLOOKUP(C136,'Resource Map'!$B$3:$C$509,2,FALSE))","v":"-"},null,"Total SCCT",0,0,0,0,0,0,0,0,0,0,0,0,0,0,0,0,0,0,442.8,0]
[{"$f":"IF(AND(B137<>\"West\",OR(A136=\"Winter FOT\",A136=\"Done\")),\"Done\",VLOOKUP(C137,'Resource Map'!$B$3:$C$509,2,FALSE))","v":"Wind+Bat"},null,"Wind+Storage, YK",0,0,0,0,0,0,0,0,0,0,9.7910000000000004,0,0,0,0,0,0,0,10.577,0]
[{"$f":"IF(AND(B138<>\"West\",OR(A137=\"Winter FOT\",A137=\"Done\")),\"Done\",VLOOKUP(C138,'Resource Map'!$B$3:$C$509,2,FALSE))","v":"-"},null,"Total Wind",0,0,0,0,0,0,0,0,0,0,9.7910000000000004,0,0,0,0,0,0,0,10.577,0]
[{"$f":"IF(AND(B139<>\"West\",OR(A138=\"Winter FOT\",A138=\"Done\")),\"Done\",VLOOKUP(C139,'Resource Map'!$B$3:$C$509,2,FALSE))","v":"Solar+Bat"},null,"Utility Solar+Storage - PV - Jbridger",0,0,0,0,0,354,0,0,0,0,359.3,0,0,0,0,0,0,0,0,701.7]
[{"$f":"IF(AND(B140<>\"West\",OR(A139=\"Winter FOT\",A139=\"Done\")),\"Done\",VLOOKUP(C140,'Resource Map'!$B$3:$C$509,2,FALSE))","v":"Solar+Bat"},null,"Utility Solar+Storage - PV - S-Oregon",0,0,0,0,0,500,0,0,0,0,0,0,0,0,475,0,0,0,0,0]
[{"$f":"IF(AND(B141<>\"West\",OR(A140=\"Winter FOT\",A140=\"Done\")),\"Done\",VLOOKUP(C141,'Resource Map'!$B$3:$C$509,2,FALSE))","v":"Solar+Bat"},null,"Utility Solar+Storage - PV - Yakima",0,0,0,0,0,395.209,0,0,0,0,0,0,0,0,0,0,0,419.423,0,0]
[{"$f":"IF(AND(B142<>\"West\",OR(A141=\"Winter FOT\",A141=\"Done\")),\"Done\",VLOOKUP(C142,'Resource Map'!$B$3:$C$509,2,FALSE))","v":"-"},null,"Total Solar",0,0,0,0,0,1249.2090000000001,0,0,0,0,359.3,0,0,0,475,0,0,419.423,0,701.7]
[{"$f":"IF(AND(B143<>\"West\",OR(A142=\"Winter FOT\",A142=\"Done\")),\"Done\",VLOOKUP(C143,'Resource Map'!$B$3:$C$509,2,FALSE))","v":"Class 1 DSM"},null,"Demand Response, OR-Ancillary Services",0,0,0,0,0,0,0,0,0,0,7.5119999999999996,0,0,0,0,0,0,0,0,0]
[{"$f":"IF(AND(B144<>\"West\",OR(A143=\"Winter FOT\",A143=\"Done\")),\"Done\",VLOOKUP(C144,'Resource Map'!$B$3:$C$509,2,FALSE))","v":"Class 1 DSM"},null,"Demand Response, WA-Ancillary Services",0,0,0,0,0,0,0,0,0,0,1.851,0,0,0,0,0,0,0,0,0]
[{"$f":"IF(AND(B145<>\"West\",OR(A144=\"Winter FOT\",A144=\"Done\")),\"Done\",VLOOKUP(C145,'Resource Map'!$B$3:$C$509,2,FALSE))","v":"Class 1 DSM"},null,"Demand Response, CA-Cool/WH",0,0,0,0,0,0,0,0,0,0,0,0,0,0,0,0,0,0,0,1.53]
[{"$f":"IF(AND(B146<>\"West\",OR(A145=\"Winter FOT\",A145=\"Done\")),\"Done\",VLOOKUP(C146,'Resource Map'!$B$3:$C$509,2,FALSE))","v":"Class 1 DSM"},null,"Demand Response, CA-3rd Party Contracts",0,0,0,0,0,0,0,0,0,0,0,0,0,0,0,0,0,0,0,1.103]
[{"$f":"IF(AND(B147<>\"West\",OR(A146=\"Winter FOT\",A146=\"Done\")),\"Done\",VLOOKUP(C147,'Resource Map'!$B$3:$C$509,2,FALSE))","v":"Class 1 DSM"},null,"Demand Response, CA-Irrigate",0,0,0,0,0,0,0,0,0,0,0,0,0,0,0,0,0,0,4.7750000000000004,0]
[{"$f":"IF(AND(B148<>\"West\",OR(A147=\"Winter FOT\",A147=\"Done\")),\"Done\",VLOOKUP(C148,'Resource Map'!$B$3:$C$509,2,FALSE))","v":"Class 1 DSM"},null,"Demand Response, CA-Thermostat",0,0,0,0,0,0,0,0,0,0,0,0,0,0,0,0,0,0,5.8010000000000002,0]
[{"$f":"IF(AND(B149<>\"West\",OR(A148=\"Winter FOT\",A148=\"Done\")),\"Done\",VLOOKUP(C149,'Resource Map'!$B$3:$C$509,2,FALSE))","v":"Class 1 DSM"},null,"Demand Response, OR-3rd Party Contracts",0,0,0,0,0,0,0,0,0,0,0,0,0,0,0,0,0,0,0,10.881]
[{"$f":"IF(AND(B150<>\"West\",OR(A149=\"Winter FOT\",A149=\"Done\")),\"Done\",VLOOKUP(C150,'Resource Map'!$B$3:$C$509,2,FALSE))","v":"Class 1 DSM"},null,"Demand Response, OR-Irrigate",0,0,0,0,0,0,0,0,0,0,0,0,0,0,0,0,0,0,13.268000000000001,0]
[{"$f":"IF(AND(B151<>\"West\",OR(A150=\"Winter FOT\",A150=\"Done\")),\"Done\",VLOOKUP(C151,'Resource Map'!$B$3:$C$509,2,FALSE))","v":"Class 1 DSM"},null,"Demand Response, WA-Cool/WH",0,0,0,0,0,0,0,0,0,0,0,0,0,0,0,0,0,0,0,7.681]
[{"$f":"IF(AND(B152<>\"West\",OR(A151=\"Winter FOT\",A151=\"Done\")),\"Done\",VLOOKUP(C152,'Resource Map'!$B$3:$C$509,2,FALSE))","v":"Class 1 DSM"},null,"Demand Response, WA-3rd Party Contracts",0,0,0,0,0,0,0,0,0,0,0,0,0,0,0,0,0,0,0,10.907999999999999]
[{"$f":"IF(AND(B153<>\"West\",OR(A152=\"Winter FOT\",A152=\"Done\")),\"Done\",VLOOKUP(C153,'Resource Map'!$B$3:$C$509,2,FALSE))","v":"Class 1 DSM"},null,"Demand Response, WA-Irrigate",0,0,0,0,0,0,0,0,0,0,0,0,0,0,0,0,0,0,8.3060000000000009,0]
[{"$f":"IF(AND(B154<>\"West\",OR(A153=\"Winter FOT\",A153=\"Done\")),\"Done\",VLOOKUP(C154,'Resource Map'!$B$3:$C$509,2,FALSE))","v":"Class 1 DSM"},null,"Demand Response, WA-Thermostat",0,0,0,0,0,0,0,0,0,0,0,0,0,0,0,0,0,0,16.631,0]
[{"$f":"IF(AND(B155<>\"West\",OR(A154=\"Winter FOT\",A154=\"Done\")),\"Done\",VLOOKUP(C155,'Resource Map'!$B$3:$C$509,2,FALSE))","v":"-"},null,"Demand Response  Total",0,0,0,0,0,0,0,0,0,0,9.3629999999999995,0,0,0,0,0,0,0,48.781000000000006,32.103000000000002]
[{"$f":"IF(AND(B156<>\"West\",OR(A155=\"Winter FOT\",A155=\"Done\")),\"Done\",VLOOKUP(C156,'Resource Map'!$B$3:$C$509,2,FALSE))","v":"Class 2 DSM"},null,"Energy Efficiency, CA",1,1.5,1.41,1.62,1.74,1.73,1.7599999999999998,1.81,1.88,1.92,1.8900000000000001,1.8800000000000003,1.8800000000000001,1.76,1.6600000000000001,1.3,1.4100000000000001,1.17,0.98000000000000009,0.83000000000000007]
[{"$f":"IF(AND(B157<>\"West\",OR(A156=\"Winter FOT\",A156=\"Done\")),\"Done\",VLOOKUP(C157,'Resource Map'!$B$3:$C$509,2,FALSE))","v":"Class 2 DSM"},null,"Energy Efficiency, OR",40,31.800000000000004,31.3,35.700000000000003,34,33.5,31.3,34.800000000000004,38.800000000000011,36.5,32.9,30.599999999999998,29.6,28.5,25.5,25.5,24.400000000000002,24.6,23.5,22.700000000000003]
[{"$f":"IF(AND(B158<>\"West\",OR(A157=\"Winter FOT\",A157=\"Done\")),\"Done\",VLOOKUP(C158,'Resource Map'!$B$3:$C$509,2,FALSE))","v":"Class 2 DSM"},null,"Energy Efficiency, WA",11,9.2500000000000018,9.4400000000000013,9.69,10.910000000000002,10.76,10.799999999999999,10.469999999999999,10.51,10.279999999999998,9.35,9.0000000000000018,8.44,7.8299999999999992,7.4600000000000017,5.8800000000000017,5.83,4.7200000000000015,4.0500000000000007,3.83]
[{"$f":"IF(AND(B159<>\"West\",OR(A158=\"Winter FOT\",A158=\"Done\")),\"Done\",VLOOKUP(C159,'Resource Map'!$B$3:$C$509,2,FALSE))","v":"-"},null,"Energy Efficiency  Total",52,42.550000000000004,42.150000000000006,47.01,46.650000000000006,45.989999999999995,43.86,47.080000000000005,51.190000000000012,48.7,44.14,41.48,39.92,38.090000000000003,34.620000000000005,32.68,31.64,30.490000000000006,28.53,27.36]
[{"$f":"IF(AND(B160<>\"West\",OR(A159=\"Winter FOT\",A159=\"Done\")),\"Done\",VLOOKUP(C160,'Resource Map'!$B$3:$C$509,2,FALSE))","v":"Battery"},null,"Battery Storage - S-Oregon",0,0,0,0,0,0,0,0,0,0,0,0,0,0,0,0,0,0,0,45]
[{"$f":"IF(AND(B161<>\"West\",OR(A160=\"Winter FOT\",A160=\"Done\")),\"Done\",VLOOKUP(C161,'Resource Map'!$B$3:$C$509,2,FALSE))","v":"Battery"},null,"Battery Storage - Walla Walla",0,0,0,0,0,0,0,0,0,0,0,0,0,0,0,0,0,0,0,45]
[{"$f":"IF(AND(B162<>\"West\",OR(A161=\"Winter FOT\",A161=\"Done\")),\"Done\",VLOOKUP(C162,'Resource Map'!$B$3:$C$509,2,FALSE))","v":"Battery"},null,"Battery Storage - Yakima",0,0,0,0,0,0,0,0,0,0,0,0,0,0,0,0,0,0,0,105]
[{"$f":"IF(AND(B163<>\"West\",OR(A162=\"Winter FOT\",A162=\"Done\")),\"Done\",VLOOKUP(C163,'Resource Map'!$B$3:$C$509,2,FALSE))","v":"FOT"},null,"FOT West - Summer",997.75299999999993,719.44499999999994,493.005,502.68700000000001,497.86799999999999,130.953,126.44,191.25299999999999,263.99099999999999,1075,1075,1075,1075,1075,1075,1075,1074.4879999999998,976.60500000000013,1074.461,1075]
[{"$f":"IF(AND(B164<>\"West\",OR(A163=\"Winter FOT\",A163=\"Done\")),\"Done\",VLOOKUP(C164,'Resource Map'!$B$3:$C$509,2,FALSE))","v":"Winter FOT"},null,"FOT West - Winter",151.43799999999999,130.95499999999998,268.49199999999996,303.31600000000003,314.00799999999998,44.277000000000001,50.792999999999999,52.579000000000001,99.66,231.57400000000001,222.184,172.96600000000001,191.97699999999998,128.005,62.75,0,35.381999999999998,0,0,0]
[{"$f":"IF(AND(B165<>\"West\",OR(A164=\"Winter FOT\",A164=\"Done\")),\"Done\",VLOOKUP(C165,'Resource Map'!$B$3:$C$509,2,FALSE))","v":"Done"}]
[{"$f":"IF(AND(B166<>\"West\",OR(A165=\"Winter FOT\",A165=\"Done\")),\"Done\",VLOOKUP(C166,'Resource Map'!$B$3:$C$509,2,FALSE))","v":"Done"}]
[{"$f":"IF(AND(B167<>\"West\",OR(A166=\"Winter FOT\",A166=\"Done\")),\"Done\",VLOOKUP(C167,'Resource Map'!$B$3:$C$509,2,FALSE))","v":"Done"}]
[{"$f":"IF(AND(B168<>\"West\",OR(A167=\"Winter FOT\",A167=\"Done\")),\"Done\",VLOOKUP(C168,'Resource Map'!$B$3:$C$509,2,FALSE))","v":"Done"}]
[{"$f":"IF(AND(B169<>\"West\",OR(A168=\"Winter FOT\",A168=\"Done\")),\"Done\",VLOOKUP(C169,'Resource Map'!$B$3:$C$509,2,FALSE))","v":"Done"}]
[{"$f":"IF(AND(B170<>\"West\",OR(A169=\"Winter FOT\",A169=\"Done\")),\"Done\",VLOOKUP(C170,'Resource Map'!$B$3:$C$509,2,FALSE))","v":"Done"}]
[{"$f":"IF(AND(B171<>\"West\",OR(A170=\"Winter FOT\",A170=\"Done\")),\"Done\",VLOOKUP(C171,'Resource Map'!$B$3:$C$509,2,FALSE))","v":"Done"}]
[{"$f":"IF(AND(B172<>\"West\",OR(A171=\"Winter FOT\",A171=\"Done\")),\"Done\",VLOOKUP(C172,'Resource Map'!$B$3:$C$509,2,FALSE))","v":"Done"}]
[{"$f":"IF(AND(B173<>\"West\",OR(A172=\"Winter FOT\",A172=\"Done\")),\"Done\",VLOOKUP(C173,'Resource Map'!$B$3:$C$509,2,FALSE))","v":"Done"}]
[{"$f":"IF(AND(B174<>\"West\",OR(A173=\"Winter FOT\",A173=\"Done\")),\"Done\",VLOOKUP(C174,'Resource Map'!$B$3:$C$509,2,FALSE))","v":"Done"}]
[{"$f":"IF(AND(B175<>\"West\",OR(A174=\"Winter FOT\",A174=\"Done\")),\"Done\",VLOOKUP(C175,'Resource Map'!$B$3:$C$509,2,FALSE))","v":"Done"}]
[{"$f":"IF(AND(B176<>\"West\",OR(A175=\"Winter FOT\",A175=\"Done\")),\"Done\",VLOOKUP(C176,'Resource Map'!$B$3:$C$509,2,FALSE))","v":"Done"}]
[{"$f":"IF(AND(B177<>\"West\",OR(A176=\"Winter FOT\",A176=\"Done\")),\"Done\",VLOOKUP(C177,'Resource Map'!$B$3:$C$509,2,FALSE))","v":"Done"}]
[{"$f":"IF(AND(B178<>\"West\",OR(A177=\"Winter FOT\",A177=\"Done\")),\"Done\",VLOOKUP(C178,'Resource Map'!$B$3:$C$509,2,FALSE))","v":"Done"}]
[{"$f":"IF(AND(B179<>\"West\",OR(A178=\"Winter FOT\",A178=\"Done\")),\"Done\",VLOOKUP(C179,'Resource Map'!$B$3:$C$509,2,FALSE))","v":"Done"}]
[{"$f":"IF(AND(B180<>\"West\",OR(A179=\"Winter FOT\",A179=\"Done\")),\"Done\",VLOOKUP(C180,'Resource Map'!$B$3:$C$509,2,FALSE))","v":"Done"}]
[{"$f":"IF(AND(B181<>\"West\",OR(A180=\"Winter FOT\",A180=\"Done\")),\"Done\",VLOOKUP(C181,'Resource Map'!$B$3:$C$509,2,FALSE))","v":"Done"}]
[{"$f":"IF(AND(B182<>\"West\",OR(A181=\"Winter FOT\",A181=\"Done\")),\"Done\",VLOOKUP(C182,'Resource Map'!$B$3:$C$509,2,FALSE))","v":"Done"}]
[{"$f":"IF(AND(B183<>\"West\",OR(A182=\"Winter FOT\",A182=\"Done\")),\"Done\",VLOOKUP(C183,'Resource Map'!$B$3:$C$509,2,FALSE))","v":"Done"}]
[{"$f":"IF(AND(B184<>\"West\",OR(A183=\"Winter FOT\",A183=\"Done\")),\"Done\",VLOOKUP(C184,'Resource Map'!$B$3:$C$509,2,FALSE))","v":"Done"}]
[{"$f":"IF(AND(B185<>\"West\",OR(A184=\"Winter FOT\",A184=\"Done\")),\"Done\",VLOOKUP(C185,'Resource Map'!$B$3:$C$509,2,FALSE))","v":"Done"}]
[{"$f":"IF(AND(B186<>\"West\",OR(A185=\"Winter FOT\",A185=\"Done\")),\"Done\",VLOOKUP(C186,'Resource Map'!$B$3:$C$509,2,FALSE))","v":"Done"}]
[{"$f":"IF(AND(B187<>\"West\",OR(A186=\"Winter FOT\",A186=\"Done\")),\"Done\",VLOOKUP(C187,'Resource Map'!$B$3:$C$509,2,FALSE))","v":"Done"}]
[{"$f":"IF(AND(B188<>\"West\",OR(A187=\"Winter FOT\",A187=\"Done\")),\"Done\",VLOOKUP(C188,'Resource Map'!$B$3:$C$509,2,FALSE))","v":"Done"}]
[{"$f":"IF(AND(B189<>\"West\",OR(A188=\"Winter FOT\",A188=\"Done\")),\"Done\",VLOOKUP(C189,'Resource Map'!$B$3:$C$509,2,FALSE))","v":"Done"}]
[{"$f":"IF(AND(B190<>\"West\",OR(A189=\"Winter FOT\",A189=\"Done\")),\"Done\",VLOOKUP(C190,'Resource Map'!$B$3:$C$509,2,FALSE))","v":"Done"}]
[{"$f":"IF(AND(B191<>\"West\",OR(A190=\"Winter FOT\",A190=\"Done\")),\"Done\",VLOOKUP(C191,'Resource Map'!$B$3:$C$509,2,FALSE))","v":"Done"}]
[{"$f":"IF(AND(B192<>\"West\",OR(A191=\"Winter FOT\",A191=\"Done\")),\"Done\",VLOOKUP(C192,'Resource Map'!$B$3:$C$509,2,FALSE))","v":"Done"}]
[{"$f":"IF(AND(B193<>\"West\",OR(A192=\"Winter FOT\",A192=\"Done\")),\"Done\",VLOOKUP(C193,'Resource Map'!$B$3:$C$509,2,FALSE))","v":"Done"}]
[{"$f":"IF(AND(B194<>\"West\",OR(A193=\"Winter FOT\",A193=\"Done\")),\"Done\",VLOOKUP(C194,'Resource Map'!$B$3:$C$509,2,FALSE))","v":"Done"}]
[{"$f":"IF(AND(B195<>\"West\",OR(A194=\"Winter FOT\",A194=\"Done\")),\"Done\",VLOOKUP(C195,'Resource Map'!$B$3:$C$509,2,FALSE))","v":"Done"}]
[{"$f":"IF(AND(B196<>\"West\",OR(A195=\"Winter FOT\",A195=\"Done\")),\"Done\",VLOOKUP(C196,'Resource Map'!$B$3:$C$509,2,FALSE))","v":"Done"}]
[{"$f":"IF(AND(B197<>\"West\",OR(A196=\"Winter FOT\",A196=\"Done\")),\"Done\",VLOOKUP(C197,'Resource Map'!$B$3:$C$509,2,FALSE))","v":"Done"}]
[{"$f":"IF(AND(B198<>\"West\",OR(A197=\"Winter FOT\",A197=\"Done\")),\"Done\",VLOOKUP(C198,'Resource Map'!$B$3:$C$509,2,FALSE))","v":"Done"}]
[{"$f":"IF(AND(B199<>\"West\",OR(A198=\"Winter FOT\",A198=\"Done\")),\"Done\",VLOOKUP(C199,'Resource Map'!$B$3:$C$509,2,FALSE))","v":"Done"}]
[{"$f":"IF(AND(B200<>\"West\",OR(A199=\"Winter FOT\",A199=\"Done\")),\"Done\",VLOOKUP(C200,'Resource Map'!$B$3:$C$509,2,FALSE))","v":"Done"}]
[{"$f":"IF(AND(B201<>\"West\",OR(A200=\"Winter FOT\",A200=\"Done\")),\"Done\",VLOOKUP(C201,'Resource Map'!$B$3:$C$509,2,FALSE))","v":"Done"}]
[{"$f":"IF(AND(B202<>\"West\",OR(A201=\"Winter FOT\",A201=\"Done\")),\"Done\",VLOOKUP(C202,'Resource Map'!$B$3:$C$509,2,FALSE))","v":"Done"}]
[{"$f":"IF(AND(B203<>\"West\",OR(A202=\"Winter FOT\",A202=\"Done\")),\"Done\",VLOOKUP(C203,'Resource Map'!$B$3:$C$509,2,FALSE))","v":"Done"}]
[{"$f":"IF(AND(B204<>\"West\",OR(A203=\"Winter FOT\",A203=\"Done\")),\"Done\",VLOOKUP(C204,'Resource Map'!$B$3:$C$509,2,FALSE))","v":"Done"}]
[{"$f":"IF(AND(B205<>\"West\",OR(A204=\"Winter FOT\",A204=\"Done\")),\"Done\",VLOOKUP(C205,'Resource Map'!$B$3:$C$509,2,FALSE))","v":"Done"}]
[{"$f":"IF(AND(B206<>\"West\",OR(A205=\"Winter FOT\",A205=\"Done\")),\"Done\",VLOOKUP(C206,'Resource Map'!$B$3:$C$509,2,FALSE))","v":"Done"}]
[{"$f":"IF(AND(B207<>\"West\",OR(A206=\"Winter FOT\",A206=\"Done\")),\"Done\",VLOOKUP(C207,'Resource Map'!$B$3:$C$509,2,FALSE))","v":"Done"}]
[{"$f":"IF(AND(B208<>\"West\",OR(A207=\"Winter FOT\",A207=\"Done\")),\"Done\",VLOOKUP(C208,'Resource Map'!$B$3:$C$509,2,FALSE))","v":"Done"}]
[{"$f":"IF(AND(B209<>\"West\",OR(A208=\"Winter FOT\",A208=\"Done\")),\"Done\",VLOOKUP(C209,'Resource Map'!$B$3:$C$509,2,FALSE))","v":"Done"}]
[{"$f":"IF(AND(B210<>\"West\",OR(A209=\"Winter FOT\",A209=\"Done\")),\"Done\",VLOOKUP(C210,'Resource Map'!$B$3:$C$509,2,FALSE))","v":"Done"}]
[{"$f":"IF(AND(B211<>\"West\",OR(A210=\"Winter FOT\",A210=\"Done\")),\"Done\",VLOOKUP(C211,'Resource Map'!$B$3:$C$509,2,FALSE))","v":"Done"}]
[{"$f":"IF(AND(B212<>\"West\",OR(A211=\"Winter FOT\",A211=\"Done\")),\"Done\",VLOOKUP(C212,'Resource Map'!$B$3:$C$509,2,FALSE))","v":"Done"}]
[{"$f":"IF(AND(B213<>\"West\",OR(A212=\"Winter FOT\",A212=\"Done\")),\"Done\",VLOOKUP(C213,'Resource Map'!$B$3:$C$509,2,FALSE))","v":"Done"}]
[{"$f":"IF(AND(B214<>\"West\",OR(A213=\"Winter FOT\",A213=\"Done\")),\"Done\",VLOOKUP(C214,'Resource Map'!$B$3:$C$509,2,FALSE))","v":"Done"}]
[{"$f":"IF(AND(B215<>\"West\",OR(A214=\"Winter FOT\",A214=\"Done\")),\"Done\",VLOOKUP(C215,'Resource Map'!$B$3:$C$509,2,FALSE))","v":"Done"}]
[{"$f":"IF(AND(B216<>\"West\",OR(A215=\"Winter FOT\",A215=\"Done\")),\"Done\",VLOOKUP(C216,'Resource Map'!$B$3:$C$509,2,FALSE))","v":"Done"}]
[{"$f":"IF(AND(B217<>\"West\",OR(A216=\"Winter FOT\",A216=\"Done\")),\"Done\",VLOOKUP(C217,'Resource Map'!$B$3:$C$509,2,FALSE))","v":"Done"}]
[{"$f":"IF(AND(B218<>\"West\",OR(A217=\"Winter FOT\",A217=\"Done\")),\"Done\",VLOOKUP(C218,'Resource Map'!$B$3:$C$509,2,FALSE))","v":"Done"}]
[{"$f":"IF(AND(B219<>\"West\",OR(A218=\"Winter FOT\",A218=\"Done\")),\"Done\",VLOOKUP(C219,'Resource Map'!$B$3:$C$509,2,FALSE))","v":"Done"}]
[{"$f":"IF(AND(B220<>\"West\",OR(A219=\"Winter FOT\",A219=\"Done\")),\"Done\",VLOOKUP(C220,'Resource Map'!$B$3:$C$509,2,FALSE))","v":"Done"}]
[{"$f":"IF(AND(B221<>\"West\",OR(A220=\"Winter FOT\",A220=\"Done\")),\"Done\",VLOOKUP(C221,'Resource Map'!$B$3:$C$509,2,FALSE))","v":"Done"}]
[{"$f":"IF(AND(B222<>\"West\",OR(A221=\"Winter FOT\",A221=\"Done\")),\"Done\",VLOOKUP(C222,'Resource Map'!$B$3:$C$509,2,FALSE))","v":"Done"}]
[{"$f":"IF(AND(B223<>\"West\",OR(A222=\"Winter FOT\",A222=\"Done\")),\"Done\",VLOOKUP(C223,'Resource Map'!$B$3:$C$509,2,FALSE))","v":"Done"}]
[{"$f":"IF(AND(B224<>\"West\",OR(A223=\"Winter FOT\",A223=\"Done\")),\"Done\",VLOOKUP(C224,'Resource Map'!$B$3:$C$509,2,FALSE))","v":"Done"}]
[{"$f":"IF(AND(B225<>\"West\",OR(A224=\"Winter FOT\",A224=\"Done\")),\"Done\",VLOOKUP(C225,'Resource Map'!$B$3:$C$509,2,FALSE))","v":"Done"}]
[{"$f":"IF(AND(B226<>\"West\",OR(A225=\"Winter FOT\",A225=\"Done\")),\"Done\",VLOOKUP(C226,'Resource Map'!$B$3:$C$509,2,FALSE))","v":"Done"}]
[{"$f":"IF(AND(B227<>\"West\",OR(A226=\"Winter FOT\",A226=\"Done\")),\"Done\",VLOOKUP(C227,'Resource Map'!$B$3:$C$509,2,FALSE))","v":"Done"}]
[{"$f":"IF(AND(B228<>\"West\",OR(A227=\"Winter FOT\",A227=\"Done\")),\"Done\",VLOOKUP(C228,'Resource Map'!$B$3:$C$509,2,FALSE))","v":"Done"}]
[{"$f":"IF(AND(B229<>\"West\",OR(A228=\"Winter FOT\",A228=\"Done\")),\"Done\",VLOOKUP(C229,'Resource Map'!$B$3:$C$509,2,FALSE))","v":"Done"}]
[{"$f":"IF(AND(B230<>\"West\",OR(A229=\"Winter FOT\",A229=\"Done\")),\"Done\",VLOOKUP(C230,'Resource Map'!$B$3:$C$509,2,FALSE))","v":"Done"}]
[{"$f":"IF(AND(B231<>\"West\",OR(A230=\"Winter FOT\",A230=\"Done\")),\"Done\",VLOOKUP(C231,'Resource Map'!$B$3:$C$509,2,FALSE))","v":"Done"}]
[{"$f":"IF(AND(B232<>\"West\",OR(A231=\"Winter FOT\",A231=\"Done\")),\"Done\",VLOOKUP(C232,'Resource Map'!$B$3:$C$509,2,FALSE))","v":"Done"}]
[{"$f":"IF(AND(B233<>\"West\",OR(A232=\"Winter FOT\",A232=\"Done\")),\"Done\",VLOOKUP(C233,'Resource Map'!$B$3:$C$509,2,FALSE))","v":"Done"}]
[{"$f":"IF(AND(B234<>\"West\",OR(A233=\"Winter FOT\",A233=\"Done\")),\"Done\",VLOOKUP(C234,'Resource Map'!$B$3:$C$509,2,FALSE))","v":"Done"}]
[{"$f":"IF(AND(B235<>\"West\",OR(A234=\"Winter FOT\",A234=\"Done\")),\"Done\",VLOOKUP(C235,'Resource Map'!$B$3:$C$509,2,FALSE))","v":"Done"}]
[{"$f":"IF(AND(B236<>\"West\",OR(A235=\"Winter FOT\",A235=\"Done\")),\"Done\",VLOOKUP(C236,'Resource Map'!$B$3:$C$509,2,FALSE))","v":"Done"}]
[{"$f":"IF(AND(B237<>\"West\",OR(A236=\"Winter FOT\",A236=\"Done\")),\"Done\",VLOOKUP(C237,'Resource Map'!$B$3:$C$509,2,FALSE))","v":"Done"}]
[{"$f":"IF(AND(B238<>\"West\",OR(A237=\"Winter FOT\",A237=\"Done\")),\"Done\",VLOOKUP(C238,'Resource Map'!$B$3:$C$509,2,FALSE))","v":"Done"}]
[{"$f":"IF(AND(B239<>\"West\",OR(A238=\"Winter FOT\",A238=\"Done\")),\"Done\",VLOOKUP(C239,'Resource Map'!$B$3:$C$509,2,FALSE))","v":"Done"}]
[{"$f":"IF(AND(B240<>\"West\",OR(A239=\"Winter FOT\",A239=\"Done\")),\"Done\",VLOOKUP(C240,'Resource Map'!$B$3:$C$509,2,FALSE))","v":"Done"}]
[{"$f":"IF(AND(B241<>\"West\",OR(A240=\"Winter FOT\",A240=\"Done\")),\"Done\",VLOOKUP(C241,'Resource Map'!$B$3:$C$509,2,FALSE))","v":"Done"}]
[{"$f":"IF(AND(B242<>\"West\",OR(A241=\"Winter FOT\",A241=\"Done\")),\"Done\",VLOOKUP(C242,'Resource Map'!$B$3:$C$509,2,FALSE))","v":"Done"}]
[{"$f":"IF(AND(B243<>\"West\",OR(A242=\"Winter FOT\",A242=\"Done\")),\"Done\",VLOOKUP(C243,'Resource Map'!$B$3:$C$509,2,FALSE))","v":"Done"}]
[{"$f":"IF(AND(B244<>\"West\",OR(A243=\"Winter FOT\",A243=\"Done\")),\"Done\",VLOOKUP(C244,'Resource Map'!$B$3:$C$509,2,FALSE))","v":"Done"}]
[{"$f":"IF(AND(B245<>\"West\",OR(A244=\"Winter FOT\",A244=\"Done\")),\"Done\",VLOOKUP(C245,'Resource Map'!$B$3:$C$509,2,FALSE))","v":"Done"}]
[{"$f":"IF(AND(B246<>\"West\",OR(A245=\"Winter FOT\",A245=\"Done\")),\"Done\",VLOOKUP(C246,'Resource Map'!$B$3:$C$509,2,FALSE))","v":"Done"}]
[{"$f":"IF(AND(B247<>\"West\",OR(A246=\"Winter FOT\",A246=\"Done\")),\"Done\",VLOOKUP(C247,'Resource Map'!$B$3:$C$509,2,FALSE))","v":"Done"}]
[{"$f":"IF(AND(B248<>\"West\",OR(A247=\"Winter FOT\",A247=\"Done\")),\"Done\",VLOOKUP(C248,'Resource Map'!$B$3:$C$509,2,FALSE))","v":"Done"}]
[{"$f":"IF(AND(B249<>\"West\",OR(A248=\"Winter FOT\",A248=\"Done\")),\"Done\",VLOOKUP(C249,'Resource Map'!$B$3:$C$509,2,FALSE))","v":"Done"}]
[{"$f":"IF(AND(B250<>\"West\",OR(A249=\"Winter FOT\",A249=\"Done\")),\"Done\",VLOOKUP(C250,'Resource Map'!$B$3:$C$509,2,FALSE))","v":"Done"}]
[{"$f":"IF(AND(B251<>\"West\",OR(A250=\"Winter FOT\",A250=\"Done\")),\"Done\",VLOOKUP(C251,'Resource Map'!$B$3:$C$509,2,FALSE))","v":"Done"}]
[{"$f":"IF(AND(B252<>\"West\",OR(A251=\"Winter FOT\",A251=\"Done\")),\"Done\",VLOOKUP(C252,'Resource Map'!$B$3:$C$509,2,FALSE))","v":"Done"}]
[{"$f":"IF(AND(B253<>\"West\",OR(A252=\"Winter FOT\",A252=\"Done\")),\"Done\",VLOOKUP(C253,'Resource Map'!$B$3:$C$509,2,FALSE))","v":"Done"}]
[{"$f":"IF(AND(B254<>\"West\",OR(A253=\"Winter FOT\",A253=\"Done\")),\"Done\",VLOOKUP(C254,'Resource Map'!$B$3:$C$509,2,FALSE))","v":"Done"}]
[{"$f":"IF(AND(B255<>\"West\",OR(A254=\"Winter FOT\",A254=\"Done\")),\"Done\",VLOOKUP(C255,'Resource Map'!$B$3:$C$509,2,FALSE))","v":"Done"}]
[{"$f":"IF(AND(B256<>\"West\",OR(A255=\"Winter FOT\",A255=\"Done\")),\"Done\",VLOOKUP(C256,'Resource Map'!$B$3:$C$509,2,FALSE))","v":"Done"}]
[{"$f":"IF(AND(B257<>\"West\",OR(A256=\"Winter FOT\",A256=\"Done\")),\"Done\",VLOOKUP(C257,'Resource Map'!$B$3:$C$509,2,FALSE))","v":"Done"}]
[{"$f":"IF(AND(B258<>\"West\",OR(A257=\"Winter FOT\",A257=\"Done\")),\"Done\",VLOOKUP(C258,'Resource Map'!$B$3:$C$509,2,FALSE))","v":"Done"}]
[{"$f":"IF(AND(B259<>\"West\",OR(A258=\"Winter FOT\",A258=\"Done\")),\"Done\",VLOOKUP(C259,'Resource Map'!$B$3:$C$509,2,FALSE))","v":"Done"}]
[{"$f":"IF(AND(B260<>\"West\",OR(A259=\"Winter FOT\",A259=\"Done\")),\"Done\",VLOOKUP(C260,'Resource Map'!$B$3:$C$509,2,FALSE))","v":"Done"}]
[{"$f":"IF(AND(B261<>\"West\",OR(A260=\"Winter FOT\",A260=\"Done\")),\"Done\",VLOOKUP(C261,'Resource Map'!$B$3:$C$509,2,FALSE))","v":"Done"}]
[{"$f":"IF(AND(B262<>\"West\",OR(A261=\"Winter FOT\",A261=\"Done\")),\"Done\",VLOOKUP(C262,'Resource Map'!$B$3:$C$509,2,FALSE))","v":"Done"}]
[{"$f":"IF(AND(B263<>\"West\",OR(A262=\"Winter FOT\",A262=\"Done\")),\"Done\",VLOOKUP(C263,'Resource Map'!$B$3:$C$509,2,FALSE))","v":"Done"}]
[{"$f":"IF(AND(B264<>\"West\",OR(A263=\"Winter FOT\",A263=\"Done\")),\"Done\",VLOOKUP(C264,'Resource Map'!$B$3:$C$509,2,FALSE))","v":"Done"}]
[{"$f":"IF(AND(B265<>\"West\",OR(A264=\"Winter FOT\",A264=\"Done\")),\"Done\",VLOOKUP(C265,'Resource Map'!$B$3:$C$509,2,FALSE))","v":"Done"}]
[{"$f":"IF(AND(B266<>\"West\",OR(A265=\"Winter FOT\",A265=\"Done\")),\"Done\",VLOOKUP(C266,'Resource Map'!$B$3:$C$509,2,FALSE))","v":"Done"}]
[{"$f":"IF(AND(B267<>\"West\",OR(A266=\"Winter FOT\",A266=\"Done\")),\"Done\",VLOOKUP(C267,'Resource Map'!$B$3:$C$509,2,FALSE))","v":"Done"}]
[{"$f":"IF(AND(B268<>\"West\",OR(A267=\"Winter FOT\",A267=\"Done\")),\"Done\",VLOOKUP(C268,'Resource Map'!$B$3:$C$509,2,FALSE))","v":"Done"}]
[{"$f":"IF(AND(B269<>\"West\",OR(A268=\"Winter FOT\",A268=\"Done\")),\"Done\",VLOOKUP(C269,'Resource Map'!$B$3:$C$509,2,FALSE))","v":"Done"}]
[{"$f":"IF(AND(B270<>\"West\",OR(A269=\"Winter FOT\",A269=\"Done\")),\"Done\",VLOOKUP(C270,'Resource Map'!$B$3:$C$509,2,FALSE))","v":"Done"}]
[{"$f":"IF(AND(B271<>\"West\",OR(A270=\"Winter FOT\",A270=\"Done\")),\"Done\",VLOOKUP(C271,'Resource Map'!$B$3:$C$509,2,FALSE))","v":"Done"}]
[{"$f":"IF(AND(B272<>\"West\",OR(A271=\"Winter FOT\",A271=\"Done\")),\"Done\",VLOOKUP(C272,'Resource Map'!$B$3:$C$509,2,FALSE))","v":"Done"}]
[{"$f":"IF(AND(B273<>\"West\",OR(A272=\"Winter FOT\",A272=\"Done\")),\"Done\",VLOOKUP(C273,'Resource Map'!$B$3:$C$509,2,FALSE))","v":"Done"}]
[{"$f":"IF(AND(B274<>\"West\",OR(A273=\"Winter FOT\",A273=\"Done\")),\"Done\",VLOOKUP(C274,'Resource Map'!$B$3:$C$509,2,FALSE))","v":"Done"}]
[{"$f":"IF(AND(B275<>\"West\",OR(A274=\"Winter FOT\",A274=\"Done\")),\"Done\",VLOOKUP(C275,'Resource Map'!$B$3:$C$509,2,FALSE))","v":"Done"}]
[{"$f":"IF(AND(B276<>\"West\",OR(A275=\"Winter FOT\",A275=\"Done\")),\"Done\",VLOOKUP(C276,'Resource Map'!$B$3:$C$509,2,FALSE))","v":"Done"}]
[{"$f":"IF(AND(B277<>\"West\",OR(A276=\"Winter FOT\",A276=\"Done\")),\"Done\",VLOOKUP(C277,'Resource Map'!$B$3:$C$509,2,FALSE))","v":"Done"}]
[{"$f":"IF(AND(B278<>\"West\",OR(A277=\"Winter FOT\",A277=\"Done\")),\"Done\",VLOOKUP(C278,'Resource Map'!$B$3:$C$509,2,FALSE))","v":"Done"}]
[{"$f":"IF(AND(B279<>\"West\",OR(A278=\"Winter FOT\",A278=\"Done\")),\"Done\",VLOOKUP(C279,'Resource Map'!$B$3:$C$509,2,FALSE))","v":"Done"}]
[{"$f":"IF(AND(B280<>\"West\",OR(A279=\"Winter FOT\",A279=\"Done\")),\"Done\",VLOOKUP(C280,'Resource Map'!$B$3:$C$509,2,FALSE))","v":"Done"}]
[{"$f":"IF(AND(B281<>\"West\",OR(A280=\"Winter FOT\",A280=\"Done\")),\"Done\",VLOOKUP(C281,'Resource Map'!$B$3:$C$509,2,FALSE))","v":"Done"}]
[{"$f":"IF(AND(B282<>\"West\",OR(A281=\"Winter FOT\",A281=\"Done\")),\"Done\",VLOOKUP(C282,'Resource Map'!$B$3:$C$509,2,FALSE))","v":"Done"}]
[{"$f":"IF(AND(B283<>\"West\",OR(A282=\"Winter FOT\",A282=\"Done\")),\"Done\",VLOOKUP(C283,'Resource Map'!$B$3:$C$509,2,FALSE))","v":"Done"}]
[{"$f":"IF(AND(B284<>\"West\",OR(A283=\"Winter FOT\",A283=\"Done\")),\"Done\",VLOOKUP(C284,'Resource Map'!$B$3:$C$509,2,FALSE))","v":"Done"}]
[{"$f":"IF(AND(B285<>\"West\",OR(A284=\"Winter FOT\",A284=\"Done\")),\"Done\",VLOOKUP(C285,'Resource Map'!$B$3:$C$509,2,FALSE))","v":"Done"}]
[{"$f":"IF(AND(B286<>\"West\",OR(A285=\"Winter FOT\",A285=\"Done\")),\"Done\",VLOOKUP(C286,'Resource Map'!$B$3:$C$509,2,FALSE))","v":"Done"}]
[{"$f":"IF(AND(B287<>\"West\",OR(A286=\"Winter FOT\",A286=\"Done\")),\"Done\",VLOOKUP(C287,'Resource Map'!$B$3:$C$509,2,FALSE))","v":"Done"}]
[{"$f":"IF(AND(B288<>\"West\",OR(A287=\"Winter FOT\",A287=\"Done\")),\"Done\",VLOOKUP(C288,'Resource Map'!$B$3:$C$509,2,FALSE))","v":"Done"}]
[{"$f":"IF(AND(B289<>\"West\",OR(A288=\"Winter FOT\",A288=\"Done\")),\"Done\",VLOOKUP(C289,'Resource Map'!$B$3:$C$509,2,FALSE))","v":"Done"}]
[{"$f":"IF(AND(B290<>\"West\",OR(A289=\"Winter FOT\",A289=\"Done\")),\"Done\",VLOOKUP(C290,'Resource Map'!$B$3:$C$509,2,FALSE))","v":"Done"}]
[{"$f":"IF(AND(B291<>\"West\",OR(A290=\"Winter FOT\",A290=\"Done\")),\"Done\",VLOOKUP(C291,'Resource Map'!$B$3:$C$509,2,FALSE))","v":"Done"}]
[{"$f":"IF(AND(B292<>\"West\",OR(A291=\"Winter FOT\",A291=\"Done\")),\"Done\",VLOOKUP(C292,'Resource Map'!$B$3:$C$509,2,FALSE))","v":"Done"}]
[{"$f":"IF(AND(B293<>\"West\",OR(A292=\"Winter FOT\",A292=\"Done\")),\"Done\",VLOOKUP(C293,'Resource Map'!$B$3:$C$509,2,FALSE))","v":"Done"}]
[{"$f":"IF(AND(B294<>\"West\",OR(A293=\"Winter FOT\",A293=\"Done\")),\"Done\",VLOOKUP(C294,'Resource Map'!$B$3:$C$509,2,FALSE))","v":"Done"}]
[{"$f":"IF(AND(B295<>\"West\",OR(A294=\"Winter FOT\",A294=\"Done\")),\"Done\",VLOOKUP(C295,'Resource Map'!$B$3:$C$509,2,FALSE))","v":"Done"}]
[{"$f":"IF(AND(B296<>\"West\",OR(A295=\"Winter FOT\",A295=\"Done\")),\"Done\",VLOOKUP(C296,'Resource Map'!$B$3:$C$509,2,FALSE))","v":"Done"}]
[{"$f":"IF(AND(B297<>\"West\",OR(A296=\"Winter FOT\",A296=\"Done\")),\"Done\",VLOOKUP(C297,'Resource Map'!$B$3:$C$509,2,FALSE))","v":"Done"}]
[{"$f":"IF(AND(B298<>\"West\",OR(A297=\"Winter FOT\",A297=\"Done\")),\"Done\",VLOOKUP(C298,'Resource Map'!$B$3:$C$509,2,FALSE))","v":"Done"}]
[{"$f":"IF(AND(B299<>\"West\",OR(A298=\"Winter FOT\",A298=\"Done\")),\"Done\",VLOOKUP(C299,'Resource Map'!$B$3:$C$509,2,FALSE))","v":"Done"}]
[{"$f":"IF(AND(B300<>\"West\",OR(A299=\"Winter FOT\",A299=\"Done\")),\"Done\",VLOOKUP(C300,'Resource Map'!$B$3:$C$509,2,FALSE))","v":"Done"}]
[{"$f":"IF(AND(B301<>\"West\",OR(A300=\"Winter FOT\",A300=\"Done\")),\"Done\",VLOOKUP(C301,'Resource Map'!$B$3:$C$509,2,FALSE))","v":"Done"}]
[{"$f":"IF(AND(B302<>\"West\",OR(A301=\"Winter FOT\",A301=\"Done\")),\"Done\",VLOOKUP(C302,'Resource Map'!$B$3:$C$509,2,FALSE))","v":"Done"}]

{"sheet":"Delta Base Rel - Pre","index":5,"n_rows":48,"n_cols":27,"rows_kept":48,"cut":false,"hidden":false,"merged":[]}
[]
[]
[null,null,"Coal"]
[null,null,"Cumulative",2019,2020,2021,2022,2023,2024,2025,2026,2027,2028,2029,2030,2031,2032,2033,2034,2035,2036,2037,2038]
[null,null,"Coal Removed",{"$f":"'Data Base Rel'!D8-'Data Base Pre'!D8","v":0},{"$f":"'Data Base Rel'!E8-'Data Base Pre'!E8","v":0},{"$f":"'Data Base Rel'!F8-'Data Base Pre'!F8","v":0},{"$f":"'Data Base Rel'!G8-'Data Base Pre'!G8","v":0},{"$f":"'Data Base Rel'!H8-'Data Base Pre'!H8","v":0},{"$f":"'Data Base Rel'!I8-'Data Base Pre'!I8","v":0},{"$f":"'Data Base Rel'!J8-'Data Base Pre'!J8","v":0},{"$f":"'Data Base Rel'!K8-'Data Base Pre'!K8","v":0},{"$f":"'Data Base Rel'!L8-'Data Base Pre'!L8","v":0},{"$f":"'Data Base Rel'!M8-'Data Base Pre'!M8","v":0},{"$f":"'Data Base Rel'!N8-'Data Base Pre'!N8","v":0},{"$f":"'Data Base Rel'!O8-'Data Base Pre'!O8","v":0},{"$f":"'Data Base Rel'!P8-'Data Base Pre'!P8","v":0},{"$f":"'Data Base Rel'!Q8-'Data Base Pre'!Q8","v":0},{"$f":"'Data Base Rel'!R8-'Data Base Pre'!R8","v":0},{"$f":"'Data Base Rel'!S8-'Data Base Pre'!S8","v":0},{"$f":"'Data Base Rel'!T8-'Data Base Pre'!T8","v":0},{"$f":"'Data Base Rel'!U8-'Data Base Pre'!U8","v":0},{"$f":"'Data Base Rel'!V8-'Data Base Pre'!V8","v":0},{"$f":"'Data Base Rel'!W8-'Data Base Pre'!W8","v":0}]
[]
[null,null,"Renewable and Storage"]
[null,null,"Cumulative",2019,2020,2021,2022,2023,2024,2025,2026,2027,2028,2029,2030,2031,2032,2033,2034,2035,2036,2037,2038,null,"Wind","Solar","Battery"]
[null,null,"Wind",{"$f":"'Data Base Rel'!D24-'Data Base Pre'!D24","v":0},{"$f":"'Data Base Rel'!E24-'Data Base Pre'!E24","v":0},{"$f":"'Data Base Rel'!F24-'Data Base Pre'!F24","v":0},{"$f":"'Data Base Rel'!G24-'Data Base Pre'!G24","v":0},{"$f":"'Data Base Rel'!H24-'Data Base Pre'!H24","v":-1.5999999999991132E-2},{"$f":"'Data Base Rel'!I24-'Data Base Pre'!I24","v":-1.5999999999849024E-2},{"$f":"'Data Base Rel'!J24-'Data Base Pre'!J24","v":-1.5999999999849024E-2},{"$f":"'Data Base Rel'!K24-'Data Base Pre'!K24","v":-1.5999999999849024E-2},{"$f":"'Data Base Rel'!L24-'Data Base Pre'!L24","v":-1.5999999999849024E-2},{"$f":"'Data Base Rel'!M24-'Data Base Pre'!M24","v":-1.5999999999849024E-2},{"$f":"'Data Base Rel'!N24-'Data Base Pre'!N24","v":-1.5999999999849024E-2},{"$f":"'Data Base Rel'!O24-'Data Base Pre'!O24","v":6.8000000000211003E-2},{"$f":"'Data Base Rel'!P24-'Data Base Pre'!P24","v":6.8000000000211003E-2},{"$f":"'Data Base Rel'!Q24-'Data Base Pre'!Q24","v":6.8000000000211003E-2},{"$f":"'Data Base Rel'!R24-'Data Base Pre'!R24","v":6.8000000000211003E-2},{"$f":"'Data Base Rel'!S24-'Data Base Pre'!S24","v":6.8000000000211003E-2},{"$f":"'Data Base Rel'!T24-'Data Base Pre'!T24","v":6.8000000000211003E-2},{"$f":"'Data Base Rel'!U24-'Data Base Pre'!U24","v":6.8000000000211003E-2},{"$f":"'Data Base Rel'!V24-'Data Base Pre'!V24","v":6.8000000000211003E-2},{"$f":"'Data Base Rel'!W24-'Data Base Pre'!W24","v":6.8000000000211003E-2},null,{"$f":"'Data Base Rel'!Y24-'Data Base Pre'!Y24","v":1.6000000000076398E-2},{"$f":"'Data Base Rel'!Z24-'Data Base Pre'!Z24","v":0.18400000000019645},{"$f":"0.25*W11+0.25*W12+W13","v":915.03300000000002}]
[null,null,"Solar",{"$f":"'Data Base Rel'!D25-'Data Base Pre'!D25","v":0},{"$f":"'Data Base Rel'!E25-'Data Base Pre'!E25","v":0},{"$f":"'Data Base Rel'!F25-'Data Base Pre'!F25","v":0},{"$f":"'Data Base Rel'!G25-'Data Base Pre'!G25","v":0},{"$f":"'Data Base Rel'!H25-'Data Base Pre'!H25","v":0},{"$f":"'Data Base Rel'!I25-'Data Base Pre'!I25","v":0},{"$f":"'Data Base Rel'!J25-'Data Base Pre'!J25","v":0},{"$f":"'Data Base Rel'!K25-'Data Base Pre'!K25","v":0},{"$f":"'Data Base Rel'!L25-'Data Base Pre'!L25","v":0},{"$f":"'Data Base Rel'!M25-'Data Base Pre'!M25","v":0},{"$f":"'Data Base Rel'!N25-'Data Base Pre'!N25","v":0},{"$f":"'Data Base Rel'!O25-'Data Base Pre'!O25","v":0},{"$f":"'Data Base Rel'!P25-'Data Base Pre'!P25","v":0},{"$f":"'Data Base Rel'!Q25-'Data Base Pre'!Q25","v":0},{"$f":"'Data Base Rel'!R25-'Data Base Pre'!R25","v":0},{"$f":"'Data Base Rel'!S25-'Data Base Pre'!S25","v":0},{"$f":"'Data Base Rel'!T25-'Data Base Pre'!T25","v":0},{"$f":"'Data Base Rel'!U25-'Data Base Pre'!U25","v":0},{"$f":"'Data Base Rel'!V25-'Data Base Pre'!V25","v":0},{"$f":"'Data Base Rel'!W25-'Data Base Pre'!W25","v":0}]
[null,null,"Wind+Bat",{"$f":"'Data Base Rel'!D26-'Data Base Pre'!D26","v":0},{"$f":"'Data Base Rel'!E26-'Data Base Pre'!E26","v":0},{"$f":"'Data Base Rel'!F26-'Data Base Pre'!F26","v":0},{"$f":"'Data Base Rel'!G26-'Data Base Pre'!G26","v":0},{"$f":"'Data Base Rel'!H26-'Data Base Pre'!H26","v":0},{"$f":"'Data Base Rel'!I26-'Data Base Pre'!I26","v":0},{"$f":"'Data Base Rel'!J26-'Data Base Pre'!J26","v":0},{"$f":"'Data Base Rel'!K26-'Data Base Pre'!K26","v":0},{"$f":"'Data Base Rel'!L26-'Data Base Pre'!L26","v":0},{"$f":"'Data Base Rel'!M26-'Data Base Pre'!M26","v":0},{"$f":"'Data Base Rel'!N26-'Data Base Pre'!N26","v":9.0000000000003411E-3},{"$f":"'Data Base Rel'!O26-'Data Base Pre'!O26","v":9.0000000000003411E-3},{"$f":"'Data Base Rel'!P26-'Data Base Pre'!P26","v":9.0000000000003411E-3},{"$f":"'Data Base Rel'!Q26-'Data Base Pre'!Q26","v":-7.5000000000002842E-2},{"$f":"'Data Base Rel'!R26-'Data Base Pre'!R26","v":-7.5000000000002842E-2},{"$f":"'Data Base Rel'!S26-'Data Base Pre'!S26","v":-7.5000000000002842E-2},{"$f":"'Data Base Rel'!T26-'Data Base Pre'!T26","v":-7.5000000000002842E-2},{"$f":"'Data Base Rel'!U26-'Data Base Pre'!U26","v":-7.5000000000002842E-2},{"$f":"'Data Base Rel'!V26-'Data Base Pre'!V26","v":-5.2000000000006708E-2},{"$f":"'Data Base Rel'!W26-'Data Base Pre'!W26","v":-5.2000000000006708E-2}]
[null,null,"Solar+Bat",{"$f":"'Data Base Rel'!D27-'Data Base Pre'!D27","v":0},{"$f":"'Data Base Rel'!E27-'Data Base Pre'!E27","v":0},{"$f":"'Data Base Rel'!F27-'Data Base Pre'!F27","v":-5.5000000000006821E-2},{"$f":"'Data Base Rel'!G27-'Data Base Pre'!G27","v":-2.2999999999996135E-2},{"$f":"'Data Base Rel'!H27-'Data Base Pre'!H27","v":-5.2999999999997272E-2},{"$f":"'Data Base Rel'!I27-'Data Base Pre'!I27","v":7.0000000000618456E-3},{"$f":"'Data Base Rel'!J27-'Data Base Pre'!J27","v":7.0000000000618456E-3},{"$f":"'Data Base Rel'!K27-'Data Base Pre'!K27","v":7.0000000000618456E-3},{"$f":"'Data Base Rel'!L27-'Data Base Pre'!L27","v":7.0000000000618456E-3},{"$f":"'Data Base Rel'!M27-'Data Base Pre'!M27","v":7.0000000000618456E-3},{"$f":"'Data Base Rel'!N27-'Data Base Pre'!N27","v":0.1069999999999709},{"$f":"'Data Base Rel'!O27-'Data Base Pre'!O27","v":0.1069999999999709},{"$f":"'Data Base Rel'!P27-'Data Base Pre'!P27","v":0.1069999999999709},{"$f":"'Data Base Rel'!Q27-'Data Base Pre'!Q27","v":0.1069999999999709},{"$f":"'Data Base Rel'!R27-'Data Base Pre'!R27","v":0.1069999999999709},{"$f":"'Data Base Rel'!S27-'Data Base Pre'!S27","v":0.1069999999999709},{"$f":"'Data Base Rel'!T27-'Data Base Pre'!T27","v":0.1069999999999709},{"$f":"'Data Base Rel'!U27-'Data Base Pre'!U27","v":8.3999999999832653E-2},{"$f":"'Data Base Rel'!V27-'Data Base Pre'!V27","v":8.3999999999832653E-2},{"$f":"'Data Base Rel'!W27-'Data Base Pre'!W27","v":0.18400000000019645}]
[null,null,"Battery",{"$f":"'Data Base Rel'!D28-'Data Base Pre'!D28","v":0},{"$f":"'Data Base Rel'!E28-'Data Base Pre'!E28","v":0},{"$f":"'Data Base Rel'!F28-'Data Base Pre'!F28","v":0},{"$f":"'Data Base Rel'!G28-'Data Base Pre'!G28","v":0},{"$f":"'Data Base Rel'!H28-'Data Base Pre'!H28","v":0},{"$f":"'Data Base Rel'!I28-'Data Base Pre'!I28","v":0},{"$f":"'Data Base Rel'!J28-'Data Base Pre'!J28","v":0},{"$f":"'Data Base Rel'!K28-'Data Base Pre'!K28","v":0},{"$f":"'Data Base Rel'!L28-'Data Base Pre'!L28","v":0},{"$f":"'Data Base Rel'!M28-'Data Base Pre'!M28","v":180},{"$f":"'Data Base Rel'!N28-'Data Base Pre'!N28","v":615},{"$f":"'Data Base Rel'!O28-'Data Base Pre'!O28","v":615},{"$f":"'Data Base Rel'!P28-'Data Base Pre'!P28","v":645},{"$f":"'Data Base Rel'!Q28-'Data Base Pre'!Q28","v":765},{"$f":"'Data Base Rel'!R28-'Data Base Pre'!R28","v":765},{"$f":"'Data Base Rel'!S28-'Data Base Pre'!S28","v":765},{"$f":"'Data Base Rel'!T28-'Data Base Pre'!T28","v":765},{"$f":"'Data Base Rel'!U28-'Data Base Pre'!U28","v":765},{"$f":"'Data Base Rel'!V28-'Data Base Pre'!V28","v":765},{"$f":"'Data Base Rel'!W28-'Data Base Pre'!W28","v":915}]
[null,null,"Pumped Storage",{"$f":"'Data Base Rel'!D29-'Data Base Pre'!D29","v":0},{"$f":"'Data Base Rel'!E29-'Data Base Pre'!E29","v":0},{"$f":"'Data Base Rel'!F29-'Data Base Pre'!F29","v":0},{"$f":"'Data Base Rel'!G29-'Data Base Pre'!G29","v":0},{"$f":"'Data Base Rel'!H29-'Data Base Pre'!H29","v":0},{"$f":"'Data Base Rel'!I29-'Data Base Pre'!I29","v":0},{"$f":"'Data Base Rel'!J29-'Data Base Pre'!J29","v":0},{"$f":"'Data Base Rel'!K29-'Data Base Pre'!K29","v":0},{"$f":"'Data Base Rel'!L29-'Data Base Pre'!L29","v":0},{"$f":"'Data Base Rel'!M29-'Data Base Pre'!M29","v":0},{"$f":"'Data Base Rel'!N29-'Data Base Pre'!N29","v":0},{"$f":"'Data Base Rel'!O29-'Data Base Pre'!O29","v":0},{"$f":"'Data Base Rel'!P29-'Data Base Pre'!P29","v":0},{"$f":"'Data Base Rel'!Q29-'Data Base Pre'!Q29","v":0},{"$f":"'Data Base Rel'!R29-'Data Base Pre'!R29","v":0},{"$f":"'Data Base Rel'!S29-'Data Base Pre'!S29","v":0},{"$f":"'Data Base Rel'!T29-'Data Base Pre'!T29","v":0},{"$f":"'Data Base Rel'!U29-'Data Base Pre'!U29","v":0},{"$f":"'Data Base Rel'!V29-'Data Base Pre'!V29","v":0},{"$f":"'Data Base Rel'!W29-'Data Base Pre'!W29","v":0}]
[null,null,"Renewable Removed",{"$f":"'Data Base Rel'!D30-'Data Base Pre'!D30","v":0},{"$f":"'Data Base Rel'!E30-'Data Base Pre'!E30","v":0},{"$f":"'Data Base Rel'!F30-'Data Base Pre'!F30","v":0},{"$f":"'Data Base Rel'!G30-'Data Base Pre'!G30","v":0},{"$f":"'Data Base Rel'!H30-'Data Base Pre'!H30","v":0},{"$f":"'Data Base Rel'!I30-'Data Base Pre'!I30","v":0},{"$f":"'Data Base Rel'!J30-'Data Base Pre'!J30","v":0},{"$f":"'Data Base Rel'!K30-'Data Base Pre'!K30","v":0},{"$f":"'Data Base Rel'!L30-'Data Base Pre'!L30","v":0},{"$f":"'Data Base Rel'!M30-'Data Base Pre'!M30","v":0},{"$f":"'Data Base Rel'!N30-'Data Base Pre'!N30","v":0},{"$f":"'Data Base Rel'!O30-'Data Base Pre'!O30","v":0},{"$f":"'Data Base Rel'!P30-'Data Base Pre'!P30","v":0},{"$f":"'Data Base Rel'!Q30-'Data Base Pre'!Q30","v":0},{"$f":"'Data Base Rel'!R30-'Data Base Pre'!R30","v":0},{"$f":"'Data Base Rel'!S30-'Data Base Pre'!S30","v":0},{"$f":"'Data Base Rel'!T30-'Data Base Pre'!T30","v":0},{"$f":"'Data Base Rel'!U30-'Data Base Pre'!U30","v":0},{"$f":"'Data Base Rel'!V30-'Data Base Pre'!V30","v":0},{"$f":"'Data Base Rel'!W30-'Data Base Pre'!W30","v":0}]
[]
[null,null,"Gas"]
[null,null,"Cumulative",2019,2020,2021,2022,2023,2024,2025,2026,2027,2028,2029,2030,2031,2032,2033,2034,2035,2036,2037,2038]
[null,null,"Gas Peaker",{"$f":"'Data Base Rel'!D40-'Data Base Pre'!D40","v":0},{"$f":"'Data Base Rel'!E40-'Data Base Pre'!E40","v":0},{"$f":"'Data Base Rel'!F40-'Data Base Pre'!F40","v":0},{"$f":"'Data Base Rel'!G40-'Data Base Pre'!G40","v":0},{"$f":"'Data Base Rel'!H40-'Data Base Pre'!H40","v":0},{"$f":"'Data Base Rel'!I40-'Data Base Pre'!I40","v":0},{"$f":"'Data Base Rel'!J40-'Data Base Pre'!J40","v":0},{"$f":"'Data Base Rel'!K40-'Data Base Pre'!K40","v":184.9},{"$f":"'Data Base Rel'!L40-'Data Base Pre'!L40","v":184.9},{"$f":"'Data Base Rel'!M40-'Data Base Pre'!M40","v":184.9},{"$f":"'Data Base Rel'!N40-'Data Base Pre'!N40","v":184.9},{"$f":"'Data Base Rel'!O40-'Data Base Pre'!O40","v":369.80000000000007},{"$f":"'Data Base Rel'!P40-'Data Base Pre'!P40","v":184.90000000000003},{"$f":"'Data Base Rel'!Q40-'Data Base Pre'!Q40","v":184.90000000000003},{"$f":"'Data Base Rel'!R40-'Data Base Pre'!R40","v":0},{"$f":"'Data Base Rel'!S40-'Data Base Pre'!S40","v":0},{"$f":"'Data Base Rel'!T40-'Data Base Pre'!T40","v":0},{"$f":"'Data Base Rel'!U40-'Data Base Pre'!U40","v":0},{"$f":"'Data Base Rel'!V40-'Data Base Pre'!V40","v":0},{"$f":"'Data Base Rel'!W40-'Data Base Pre'!W40","v":0}]
[null,null,"Gas CCCT",{"$f":"'Data Base Rel'!D41-'Data Base Pre'!D41","v":0},{"$f":"'Data Base Rel'!E41-'Data Base Pre'!E41","v":0},{"$f":"'Data Base Rel'!F41-'Data Base Pre'!F41","v":0},{"$f":"'Data Base Rel'!G41-'Data Base Pre'!G41","v":0},{"$f":"'Data Base Rel'!H41-'Data Base Pre'!H41","v":0},{"$f":"'Data Base Rel'!I41-'Data Base Pre'!I41","v":0},{"$f":"'Data Base Rel'!J41-'Data Base Pre'!J41","v":0},{"$f":"'Data Base Rel'!K41-'Data Base Pre'!K41","v":0},{"$f":"'Data Base Rel'!L41-'Data Base Pre'!L41","v":0},{"$f":"'Data Base Rel'!M41-'Data Base Pre'!M41","v":0},{"$f":"'Data Base Rel'!N41-'Data Base Pre'!N41","v":0},{"$f":"'Data Base Rel'!O41-'Data Base Pre'!O41","v":0},{"$f":"'Data Base Rel'!P41-'Data Base Pre'!P41","v":0},{"$f":"'Data Base Rel'!Q41-'Data Base Pre'!Q41","v":0},{"$f":"'Data Base Rel'!R41-'Data Base Pre'!R41","v":0},{"$f":"'Data Base Rel'!S41-'Data Base Pre'!S41","v":0},{"$f":"'Data Base Rel'!T41-'Data Base Pre'!T41","v":0},{"$f":"'Data Base Rel'!U41-'Data Base Pre'!U41","v":0},{"$f":"'Data Base Rel'!V41-'Data Base Pre'!V41","v":0},{"$f":"'Data Base Rel'!W41-'Data Base Pre'!W41","v":0}]
[null,null,"Gas Conv.",{"$f":"'Data Base Rel'!D42-'Data Base Pre'!D42","v":0},{"$f":"'Data Base Rel'!E42-'Data Base Pre'!E42","v":0},{"$f":"'Data Base Rel'!F42-'Data Base Pre'!F42","v":0},{"$f":"'Data Base Rel'!G42-'Data Base Pre'!G42","v":0},{"$f":"'Data Base Rel'!H42-'Data Base Pre'!H42","v":0},{"$f":"'Data Base Rel'!I42-'Data Base Pre'!I42","v":0},{"$f":"'Data Base Rel'!J42-'Data Base Pre'!J42","v":0},{"$f":"'Data Base Rel'!K42-'Data Base Pre'!K42","v":0},{"$f":"'Data Base Rel'!L42-'Data Base Pre'!L42","v":0},{"$f":"'Data Base Rel'!M42-'Data Base Pre'!M42","v":0},{"$f":"'Data Base Rel'!N42-'Data Base Pre'!N42","v":0},{"$f":"'Data Base Rel'!O42-'Data Base Pre'!O42","v":0},{"$f":"'Data Base Rel'!P42-'Data Base Pre'!P42","v":0},{"$f":"'Data Base Rel'!Q42-'Data Base Pre'!Q42","v":0},{"$f":"'Data Base Rel'!R42-'Data Base Pre'!R42","v":0},{"$f":"'Data Base Rel'!S42-'Data Base Pre'!S42","v":0},{"$f":"'Data Base Rel'!T42-'Data Base Pre'!T42","v":0},{"$f":"'Data Base Rel'!U42-'Data Base Pre'!U42","v":0},{"$f":"'Data Base Rel'!V42-'Data Base Pre'!V42","v":0},{"$f":"'Data Base Rel'!W42-'Data Base Pre'!W42","v":0}]
[null,null,"Gas Removed",{"$f":"'Data Base Rel'!D43-'Data Base Pre'!D43","v":0},{"$f":"'Data Base Rel'!E43-'Data Base Pre'!E43","v":0},{"$f":"'Data Base Rel'!F43-'Data Base Pre'!F43","v":0},{"$f":"'Data Base Rel'!G43-'Data Base Pre'!G43","v":0},{"$f":"'Data Base Rel'!H43-'Data Base Pre'!H43","v":0},{"$f":"'Data Base Rel'!I43-'Data Base Pre'!I43","v":0},{"$f":"'Data Base Rel'!J43-'Data Base Pre'!J43","v":0},{"$f":"'Data Base Rel'!K43-'Data Base Pre'!K43","v":0},{"$f":"'Data Base Rel'!L43-'Data Base Pre'!L43","v":0},{"$f":"'Data Base Rel'!M43-'Data Base Pre'!M43","v":0},{"$f":"'Data Base Rel'!N43-'Data Base Pre'!N43","v":0},{"$f":"'Data Base Rel'!O43-'Data Base Pre'!O43","v":0},{"$f":"'Data Base Rel'!P43-'Data Base Pre'!P43","v":0},{"$f":"'Data Base Rel'!Q43-'Data Base Pre'!Q43","v":0},{"$f":"'Data Base Rel'!R43-'Data Base Pre'!R43","v":0},{"$f":"'Data Base Rel'!S43-'Data Base Pre'!S43","v":0},{"$f":"'Data Base Rel'!T43-'Data Base Pre'!T43","v":0},{"$f":"'Data Base Rel'!U43-'Data Base Pre'!U43","v":0},{"$f":"'Data Base Rel'!V43-'Data Base Pre'!V43","v":0},{"$f":"'Data Base Rel'!W43-'Data Base Pre'!W43","v":0}]
[]
[null,null,"Demand-Side Management"]
[null,null,"Cumulative",2019,2020,2021,2022,2023,2024,2025,2026,2027,2028,2029,2030,2031,2032,2033,2034,2035,2036,2037,2038]
[null,null,"Class 2 DSM",{"$f":"'Data Base Rel'!D51-'Data Base Pre'!D51","v":0},{"$f":"'Data Base Rel'!E51-'Data Base Pre'!E51","v":13.590000000000003},{"$f":"'Data Base Rel'!F51-'Data Base Pre'!F51","v":27.5},{"$f":"'Data Base Rel'!G51-'Data Base Pre'!G51","v":44.060000000000059},{"$f":"'Data Base Rel'!H51-'Data Base Pre'!H51","v":54.990000000000123},{"$f":"'Data Base Rel'!I51-'Data Base Pre'!I51","v":70.680000000000177},{"$f":"'Data Base Rel'!J51-'Data Base Pre'!J51","v":85.650000000000205},{"$f":"'Data Base Rel'!K51-'Data Base Pre'!K51","v":96.570000000000164},{"$f":"'Data Base Rel'!L51-'Data Base Pre'!L51","v":105.60000000000014},{"$f":"'Data Base Rel'!M51-'Data Base Pre'!M51","v":111.75999999999999},{"$f":"'Data Base Rel'!N51-'Data Base Pre'!N51","v":118.02000000000021},{"$f":"'Data Base Rel'!O51-'Data Base Pre'!O51","v":123.11000000000035},{"$f":"'Data Base Rel'!P51-'Data Base Pre'!P51","v":125.20000000000027},{"$f":"'Data Base Rel'!Q51-'Data Base Pre'!Q51","v":129.44000000000028},{"$f":"'Data Base Rel'!R51-'Data Base Pre'!R51","v":128.75000000000045},{"$f":"'Data Base Rel'!S51-'Data Base Pre'!S51","v":128.55000000000041},{"$f":"'Data Base Rel'!T51-'Data Base Pre'!T51","v":129.51000000000022},{"$f":"'Data Base Rel'!U51-'Data Base Pre'!U51","v":129.3400000000006},{"$f":"'Data Base Rel'!V51-'Data Base Pre'!V51","v":128.86000000000058},{"$f":"'Data Base Rel'!W51-'Data Base Pre'!W51","v":127.32000000000062}]
[null,null,"Class 1 DSM",{"$f":"'Data Base Rel'!D52-'Data Base Pre'!D52","v":0},{"$f":"'Data Base Rel'!E52-'Data Base Pre'!E52","v":0},{"$f":"'Data Base Rel'!F52-'Data Base Pre'!F52","v":0},{"$f":"'Data Base Rel'!G52-'Data Base Pre'!G52","v":0},{"$f":"'Data Base Rel'!H52-'Data Base Pre'!H52","v":0},{"$f":"'Data Base Rel'!I52-'Data Base Pre'!I52","v":0},{"$f":"'Data Base Rel'!J52-'Data Base Pre'!J52","v":0},{"$f":"'Data Base Rel'!K52-'Data Base Pre'!K52","v":0},{"$f":"'Data Base Rel'!L52-'Data Base Pre'!L52","v":0},{"$f":"'Data Base Rel'!M52-'Data Base Pre'!M52","v":0},{"$f":"'Data Base Rel'!N52-'Data Base Pre'!N52","v":0},{"$f":"'Data Base Rel'!O52-'Data Base Pre'!O52","v":0},{"$f":"'Data Base Rel'!P52-'Data Base Pre'!P52","v":0},{"$f":"'Data Base Rel'!Q52-'Data Base Pre'!Q52","v":0},{"$f":"'Data Base Rel'!R52-'Data Base Pre'!R52","v":0},{"$f":"'Data Base Rel'!S52-'Data Base Pre'!S52","v":0},{"$f":"'Data Base Rel'!T52-'Data Base Pre'!T52","v":0},{"$f":"'Data Base Rel'!U52-'Data Base Pre'!U52","v":0},{"$f":"'Data Base Rel'!V52-'Data Base Pre'!V52","v":0},{"$f":"'Data Base Rel'!W52-'Data Base Pre'!W52","v":0}]
[]
[null,null,"FOTs"]
[null,null,"Incremental",2019,2020,2021,2022,2023,2024,2025,2026,2027,2028,2029,2030,2031,2032,2033,2034,2035,2036,2037,2038]
[null,null,"FOT",{"$f":"'Data Base Rel'!D56-'Data Base Pre'!D56","v":9.0000000000145519E-3},{"$f":"'Data Base Rel'!E56-'Data Base Pre'!E56","v":5.0000000001091394E-3},{"$f":"'Data Base Rel'!F56-'Data Base Pre'!F56","v":-4.9999999999954525E-3},{"$f":"'Data Base Rel'!G56-'Data Base Pre'!G56","v":-7.0000000000050022E-3},{"$f":"'Data Base Rel'!H56-'Data Base Pre'!H56","v":1.2000000000000455E-2},{"$f":"'Data Base Rel'!I56-'Data Base Pre'!I56","v":-3.0000000000143245E-3},{"$f":"'Data Base Rel'!J56-'Data Base Pre'!J56","v":5.0000000000096634E-3},{"$f":"'Data Base Rel'!K56-'Data Base Pre'!K56","v":-1.2999999999976808E-2},{"$f":"'Data Base Rel'!L56-'Data Base Pre'!L56","v":9.0000000000145519E-3},{"$f":"'Data Base Rel'!M56-'Data Base Pre'!M56","v":-5.0000000001091394E-3},{"$f":"'Data Base Rel'!N56-'Data Base Pre'!N56","v":0},{"$f":"'Data Base Rel'!O56-'Data Base Pre'!O56","v":-4.9999999998817657E-3},{"$f":"'Data Base Rel'!P56-'Data Base Pre'!P56","v":-3.0000000001564331E-3},{"$f":"'Data Base Rel'!Q56-'Data Base Pre'!Q56","v":1.9999999999527063E-3},{"$f":"'Data Base Rel'!R56-'Data Base Pre'!R56","v":-7.9999999998108251E-3},{"$f":"'Data Base Rel'!S56-'Data Base Pre'!S56","v":0},{"$f":"'Data Base Rel'!T56-'Data Base Pre'!T56","v":-1.2999999999919964E-2},{"$f":"'Data Base Rel'!U56-'Data Base Pre'!U56","v":-5.0000000001091394E-3},{"$f":"'Data Base Rel'!V56-'Data Base Pre'!V56","v":1.3999999999896318E-2},{"$f":"'Data Base Rel'!W56-'Data Base Pre'!W56","v":0}]
[]
[]
[null,null,null,2019,2020,2021,2022,2023,2024,2025,2026,2027,2028,2029,2030,2031,2032,2033,2034,2035,2036,2037,2038]
[null,null,"Coal Removed",{"$f":"D5","v":0},{"$f":"E5","v":0},0,0,0,0,0,0,0,0,0,0,0,0,0,0,0,0,0,0]
[null,null,"Wind",{"$f":"D9","v":0},0,0,0,-1.5999999999991132E-2,-1.5999999999849024E-2,-1.5999999999849024E-2,-1.5999999999849024E-2,-1.5999999999849024E-2,-1.5999999999849024E-2,-1.5999999999849024E-2,6.8000000000211003E-2,6.8000000000211003E-2,6.8000000000211003E-2,6.8000000000211003E-2,6.8000000000211003E-2,6.8000000000211003E-2,6.8000000000211003E-2,6.8000000000211003E-2,6.8000000000211003E-2]
[null,null,"Solar",{"$f":"D10","v":0},0,0,0,0,0,0,0,0,0,0,0,0,0,0,0,0,0,0,0]
[null,null,"Wind+Bat",{"$f":"D11","v":0},0,0,0,0,0,0,0,0,0,9.0000000000003411E-3,9.0000000000003411E-3,9.0000000000003411E-3,-7.5000000000002842E-2,-7.5000000000002842E-2,-7.5000000000002842E-2,-7.5000000000002842E-2,-7.5000000000002842E-2,-5.2000000000006708E-2,-5.2000000000006708E-2]
[null,null,"Solar+Bat",{"$f":"D12","v":0},0,-5.5000000000006821E-2,-2.2999999999996135E-2,-5.2999999999997272E-2,7.0000000000618456E-3,7.0000000000618456E-3,7.0000000000618456E-3,7.0000000000618456E-3,7.0000000000618456E-3,0.1069999999999709,0.1069999999999709,0.1069999999999709,0.1069999999999709,0.1069999999999709,0.1069999999999709,0.1069999999999709,8.3999999999832653E-2,8.3999999999832653E-2,0.18400000000019645]
[null,null,"Battery",{"$f":"D13","v":0},0,0,0,0,0,0,0,0,180,615,615,645,765,765,765,765,765,765,915]
[null,null,"Pumped Storage",{"$f":"D14","v":0},0,0,0,0,0,0,0,0,0,0,0,0,0,0,0,0,0,0,0]
[null,null,"Gas",{"$f":"SUM(D19:D22)","v":0},{"$f":"SUM(E19:E22)","v":0},0,0,0,0,0,184.9,184.9,184.9,184.9,369.80000000000007,184.90000000000003,184.90000000000003,0,0,0,0,0,0]
[null,null,"Class 1 DSM",{"$f":"D27","v":0},{"$f":"E27","v":0},0,0,0,0,0,0,0,0,0,0,0,0,0,0,0,0,0,0]
[null,null,"Class 2 DSM",{"$f":"D26","v":0},{"$f":"E26","v":13.590000000000003},27.5,44.060000000000059,54.990000000000123,70.680000000000177,85.650000000000205,96.570000000000164,105.60000000000014,111.75999999999999,118.02000000000021,123.11000000000035,125.20000000000027,129.44000000000028,128.75000000000045,128.55000000000041,129.51000000000022,129.3400000000006,128.86000000000058,127.32000000000062]
[null,null,"FOT",{"$f":"D31","v":9.0000000000145519E-3},{"$f":"E31","v":5.0000000001091394E-3},-4.9999999999954525E-3,-7.0000000000050022E-3,1.2000000000000455E-2,-3.0000000000143245E-3,5.0000000000096634E-3,-1.2999999999976808E-2,9.0000000000145519E-3,-5.0000000001091394E-3,0,-4.9999999998817657E-3,-3.0000000001564331E-3,1.9999999999527063E-3,-7.9999999998108251E-3,0,-1.2999999999919964E-2,-5.0000000001091394E-3,1.3999999999896318E-2,0]
[]
[]
[null,null,"Existing Capacity Removed",{"$f":"D5+D15+D22","v":0},{"$f":"E5+E15+E22","v":0},0,0,0,0,0,0,0,0,0,0,0,0,0,0,0,0,0,0]

{"sheet":"Data Compare Rel","index":6,"n_rows":302,"n_cols":27,"rows_kept":302,"cut":false,"hidden":false,"merged":[]}
["S05-MMR",null,{"$f":"IF(IFERROR(SUM(A68:A302),\"Err\")=0,\"OK\",\"MAPPING ERRORS, left column below\")","v":"OK"},null,null,null,null,null,null,null,null,null,null,null,null,null,null,null,null,null,null,null,null,null,"Checks for","MAPPING ERRORS, left column below"]
[]
[null,null,"Coal"]
[null,null,"Incremental",2019,2020,2021,2022,2023,2024,2025,2026,2027,2028,2029,2030,2031,2032,2033,2034,2035,2036,2037,2038]
[null,null,"Coal Removed",{"$f":"SUMIF($A$69:$A$302,$C5,D$69:D$302)","v":0},{"$f":"SUMIF($A$69:$A$302,$C5,E$69:E$302)","v":-280},-387,0,0,-350.5,0,-439.3,-81.5,-903,-355.8,0,-76.599999999999994,0,0,0,0,0,-909,-702]
[]
[null,null,"Cumulative",2019,2020,2021,2022,2023,2024,2025,2026,2027,2028,2029,2030,2031,2032,2033,2034,2035,2036,2037,2038]
[null,null,"Coal Removed",{"$f":"D5","v":0},{"$f":"E5+D8","v":-280},{"$f":"F5+E8","v":-667},-667,-667,-1017.5,-1017.5,-1456.8,-1538.3,-2441.3000000000002,-2797.1000000000004,-2797.1000000000004,-2873.7000000000003,-2873.7000000000003,-2873.7000000000003,-2873.7000000000003,-2873.7000000000003,-2873.7000000000003,-3782.7000000000003,-4484.7000000000007]
[]
[null,null,"Renewable and Storage"]
[null,null,"Incremental",2019,2020,2021,2022,2023,2024,2025,2026,2027,2028,2029,2030,2031,2032,2033,2034,2035,2036,2037,2038]
[null,null,"Wind",{"$f":"SUMIF($A$69:$A$302,$C12,D$69:D$302)","v":0},0,0,0,0,1920,0,0,0,0,{"$f":"SUMIF($A$69:$A$302,$C12,N$69:N$302)","v":0},993.6,0,0,0,0,0,0,0,0]
[null,null,"Solar",0,0,0,0,0,0,0,0,0,0,0,0,0,0,0,0,0,0,0,0]
[null,null,"Wind+Bat",0,0,0,0,0,0,0,0,0,0,0,30.2,0,76.2,0,0,0,0,0,0]
[null,null,"Solar+Bat",0,0,159.19999999999999,63.8,72.8,2163.1999999999998,0,0,0,0,359.4,0,500,475,100,0,0,0,904,706.8]
[null,null,"Battery",0,0,0,0,0,0,0,0,0,240,0,330,0,45,195,0,0,0,120,465]
[null,null,"Pumped Storage",0,0,0,0,0,0,0,0,0,0,0,0,0,0,0,0,0,0,0,0]
[null,null,"Hydro Removed",0,-1.1000000000000001,-168.90000000000003,0,-0.7,-20.28,0,-1.4,0,-7.2,0,0,-6.4,0,0,-74.900000000000006,0,-1.2,0,0]
[null,null,"Wind Removed",0,-26.55,-16.8,-224,-0.2,-41,0,-64.5,-3,0,-93.4,-149.1,-200.2,-65,-200.9,-80,0,-70,-90,0]
[null,null,"Solar Removed",0,0,0,0,-0.5,-0.52,0,0,0,-2,0,0,-67,-48.9,0,0,-35.9,-209.10000000000002,-1024.2,-10.9]
[null,null,"Other Removed",0,0,0,0,0,0,0,0,0,0,0,0,0,0,0,-0.90700000000000003,0,0,0,-32.1]
[]
[null,null,"Cumulative",2019,2020,2021,2022,2023,2024,2025,2026,2027,2028,2029,2030,2031,2032,2033,2034,2035,2036,2037,2038,null,"Wind","Solar","Battery"]
[null,null,"Wind",{"$f":"D12","v":0},{"$f":"D24+E12","v":0},0,0,0,1920,1920,1920,1920,1920,1920,2913.6,2913.6,2913.6,2913.6,2913.6,2913.6,2913.6,2913.6,2913.6,null,{"$f":"W24+SUM(D19:W19)+W26","v":1695.35},{"$f":"W25+SUM(D20:W20)+W27","v":4105.1799999999994},{"$f":"0.25*W26+0.25*W27+W28","v":2797.6499999999996}]
[null,null,"Solar",0,{"$f":"D25+E13","v":0},0,0,0,0,0,0,0,0,0,0,0,0,0,0,0,0,0,0]
[null,null,"Wind+Bat",0,{"$f":"D26+E14","v":0},0,0,0,0,0,0,0,0,0,30.2,30.2,106.4,106.4,106.4,106.4,106.4,106.4,106.4]
[null,null,"Solar+Bat",0,{"$f":"D27+E15","v":0},159.19999999999999,223,295.8,2459,2459,2459,2459,2459,2818.4,2818.4,3318.4,3793.4,3893.4,3893.4,3893.4,3893.4,4797.3999999999996,5504.2]
[null,null,"Battery",0,{"$f":"D28+E16","v":0},0,0,0,0,0,0,0,240,240,570,570,615,810,810,810,810,930,1395]
[null,null,"Pumped Storage",0,{"$f":"D29+E17","v":0},0,0,0,0,0,0,0,0,0,0,0,0,0,0,0,0,0,0]
[null,null,"Renewable Removed",{"$f":"D19+D20+D18+D21","v":0},{"$f":"E19+E20+E18+E21+D30","v":-27.650000000000002},{"$f":"F19+F20+F18+F21+E30","v":-213.35000000000005},-437.35,-438.75,-500.55,-500.55,-566.45000000000005,-569.45000000000005,-578.65000000000009,-672.05000000000007,-821.15000000000009,-1094.75,-1208.6500000000001,-1409.5500000000002,-1565.3570000000002,-1601.2570000000003,-1881.5570000000002,-2995.7570000000005,-3038.7570000000005]
[]
[null,null,"Gas"]
[null,null,"Incremental",2019,2020,2021,2022,2023,2024,2025,2026,2027,2028,2029,2030,2031,2032,2033,2034,2035,2036,2037,2038]
[null,null,"Gas Peaker",{"$f":"SUMIF($A$69:$A$302,$C34,D$69:D$302)","v":0},0,0,0,0,0,0,0,0,0,{"$f":"SUMIF($A$69:$A$302,$C34,N$69:N$302)","v":0},554.70000000000005,0,0,0,0,0,0,812.6,0]
[null,null,"Gas CCCT",0,0,0,0,0,0,0,0,0,0,0,0,0,0,0,0,0,0,505.2,0]
[null,null,"Gas Conv.",0,247,0,0,0,0,0,0,0,0,0,-247,0,0,0,0,0,0,0,0]
[null,null,"Gas Removed",0,0,0,0,0,0,0,0,0,0,0,0,0,0,-356.30000000000007,0,0,0,-237,0]
[]
[null,null,"Cumulative",2019,2020,2021,2022,2023,2024,2025,2026,2027,2028,2029,2030,2031,2032,2033,2034,2035,2036,2037,2038]
[null,null,"Gas Peaker",{"$f":"D34","v":0},{"$f":"D40+E34","v":0},{"$f":"E40+F34","v":0},0,0,0,0,0,0,0,0,554.70000000000005,554.70000000000005,554.70000000000005,554.70000000000005,554.70000000000005,554.70000000000005,554.70000000000005,1367.3000000000002,1367.3000000000002]
[null,null,"Gas CCCT",{"$f":"D35","v":0},{"$f":"D41+E35","v":0},{"$f":"E41+F35","v":0},0,0,0,0,0,0,0,0,0,0,0,0,0,0,0,505.2,505.2]
[null,null,"Gas Conv.",{"$f":"D36","v":0},{"$f":"D42+E36","v":247},{"$f":"E42+F36","v":247},247,247,247,247,247,247,247,247,0,0,0,0,0,0,0,0,0]
[null,null,"Gas Removed",{"$f":"D37","v":0},{"$f":"D43+E37","v":0},0,0,0,0,0,0,0,0,0,0,0,0,-356.30000000000007,-356.30000000000007,-356.30000000000007,-356.30000000000007,-593.30000000000007,-593.30000000000007]
[]
[null,null,"Demand-Side Management"]
[null,null,"Incremental",2019,2020,2021,2022,2023,2024,2025,2026,2027,2028,2029,2030,2031,2032,2033,2034,2035,2036,2037,2038]
[null,null,"Class 2 DSM",{"$f":"SUMIF($A$69:$A$302,$C47,D$69:D$302)","v":126},130.41000000000003,132.69000000000003,138.15,144.08000000000001,148.9,147.00000000000003,143.83000000000001,141.38000000000002,137.76,{"$f":"SUMIF($A$69:$A$302,$C47,N$69:N$302)","v":126.15},123.16,113.5,108.13,105.79,81.87,77.800000000000011,69.030000000000015,61.150000000000006,63.260000000000005]
[null,null,"Class 1 DSM",4.0599999999999996,0,7.0039999999999996,0,18.11,0,8.2110000000000003,7.1660000000000004,0,0,99.21,34.203000000000003,0,19.507000000000001,0,0,7.008,0,36.804000000000002,105.75]
[]
[null,null,"Cumulative",2019,2020,2021,2022,2023,2024,2025,2026,2027,2028,2029,2030,2031,2032,2033,2034,2035,2036,2037,2038]
[null,null,"Class 2 DSM",{"$f":"D47","v":126},{"$f":"D51+E47","v":256.41000000000003},389.1,527.25,671.33,820.23,967.23,1111.06,1252.44,1390.2,1516.3500000000001,1639.5100000000002,1753.0100000000002,1861.1400000000003,1966.9300000000003,2048.8000000000002,2126.6000000000004,2195.6300000000006,2256.7800000000007,2320.0400000000009]
[null,null,"Class 1 DSM",{"$f":"D48","v":4.0599999999999996},4.0599999999999996,11.064,11.064,29.173999999999999,29.173999999999999,37.384999999999998,44.551000000000002,44.551000000000002,44.551000000000002,143.761,177.964,177.964,197.471,197.471,197.471,204.47900000000001,204.47900000000001,241.28300000000002,347.03300000000002]
[]
[null,null,"FOTs"]
[null,null,"Incremental",2019,2020,2021,2022,2023,2024,2025,2026,2027,2028,2029,2030,2031,2032,2033,2034,2035,2036,2037,2038]
[null,null,"FOT",{"$f":"SUMIF($A$69:$A$302,$C56,D$69:D$302)","v":997.68499999999995},719.55,493.56,503.88,499.64,175.02500000000001,168.52500000000001,198.04000000000002,243.32,1105.51,1299.43,1375,1355.32,1219.93,1375,1356.01,1351.4880000000001,1363.037,1375,1362.3630000000001]
[null,null,"Winter FOT",151.44499999999999,130.91,268.39999999999998,303.27999999999997,313.95999999999998,50.15,56.55,60.3,109.85,241.68,261.64,225.94,247.20999999999998,127.51,75.48,6.92,22.24,175,0,0]
[]
[null,null,"Removed Capacity",{"$f":"D8+D30+D43","v":0},{"$f":"E8+E30+E43","v":-307.64999999999998},-880.35,-1104.3499999999999,-1105.75,-1518.05,-1518.05,-2023.25,-2107.75,-3019.9500000000003,-3469.1500000000005,-3618.2500000000005,-3968.4500000000003,-4082.3500000000004,-4639.55,-4795.3570000000009,-4831.2570000000005,-5111.5570000000007,-7371.7570000000005,-8116.7570000000014]
[]
[]
[]
[]
[null,"Study Name: I19-S05-MMR  (09-28-19 0929 PM)"]
[null,null,null,""]
[null,null,null,"Capacity (MW)"]
[null,null,"Resource",2019,2020,2021,2022,2023,2024,2025,2026,2027,2028,2029,2030,2031,2032,2033,2034,2035,2036,2037,2038]
[{"$f":"IF(AND(B68<>\"West\",OR(A67=\"Winter FOT\",A67=\"Done\")),\"Done\",VLOOKUP(C68,'Resource Map'!$B$3:$C$509,2,FALSE))","v":"-"},"East","Existing Plant Retirements and PPA Termination"]
[{"$f":"IF(AND(B69<>\"West\",OR(A68=\"Winter FOT\",A68=\"Done\")),\"Done\",VLOOKUP(C69,'Resource Map'!$B$3:$C$509,2,FALSE))","v":"Coal Removed"},null,"Craig 1  (Coal Early Retirement/Conversions)",0,0,0,0,0,0,0,-82.3,0,0,0,0,0,0,0,0,0,0,0,0]
[{"$f":"IF(AND(B70<>\"West\",OR(A69=\"Winter FOT\",A69=\"Done\")),\"Done\",VLOOKUP(C70,'Resource Map'!$B$3:$C$509,2,FALSE))","v":"Coal Removed"},null,"Craig 2  (Coal Early Retirement/Conversions)",0,0,0,0,0,0,0,0,-81.5,0,0,0,0,0,0,0,0,0,0,0]
[{"$f":"IF(AND(B71<>\"West\",OR(A70=\"Winter FOT\",A70=\"Done\")),\"Done\",VLOOKUP(C71,'Resource Map'!$B$3:$C$509,2,FALSE))","v":"Coal Removed"},null,"Hayden 1",0,0,0,0,0,0,0,0,0,0,0,0,-43.9,0,0,0,0,0,0,0]
[{"$f":"IF(AND(B72<>\"West\",OR(A71=\"Winter FOT\",A71=\"Done\")),\"Done\",VLOOKUP(C72,'Resource Map'!$B$3:$C$509,2,FALSE))","v":"Coal Removed"},null,"Hayden 2",0,0,0,0,0,0,0,0,0,0,0,0,-32.700000000000003,0,0,0,0,0,0,0]
[{"$f":"IF(AND(B73<>\"West\",OR(A72=\"Winter FOT\",A72=\"Done\")),\"Done\",VLOOKUP(C73,'Resource Map'!$B$3:$C$509,2,FALSE))","v":"Coal Removed"},null,"Huntington 1",0,0,0,0,0,0,0,0,0,0,0,0,0,0,0,0,0,0,-459,0]
[{"$f":"IF(AND(B74<>\"West\",OR(A73=\"Winter FOT\",A73=\"Done\")),\"Done\",VLOOKUP(C74,'Resource Map'!$B$3:$C$509,2,FALSE))","v":"Coal Removed"},null,"Huntington 2",0,0,0,0,0,0,0,0,0,0,0,0,0,0,0,0,0,0,-450,0]
[{"$f":"IF(AND(B75<>\"West\",OR(A74=\"Winter FOT\",A74=\"Done\")),\"Done\",VLOOKUP(C75,'Resource Map'!$B$3:$C$509,2,FALSE))","v":"Coal Removed"},null,"Colstrip 3  (Coal Early Retirement/Conversions)",0,0,0,0,0,0,0,0,0,-74,0,0,0,0,0,0,0,0,0,0]
[{"$f":"IF(AND(B76<>\"West\",OR(A75=\"Winter FOT\",A75=\"Done\")),\"Done\",VLOOKUP(C76,'Resource Map'!$B$3:$C$509,2,FALSE))","v":"Coal Removed"},null,"Colstrip 4  (Coal Early Retirement/Conversions)",0,0,0,0,0,0,0,0,0,-74,0,0,0,0,0,0,0,0,0,0]
[{"$f":"IF(AND(B77<>\"West\",OR(A76=\"Winter FOT\",A76=\"Done\")),\"Done\",VLOOKUP(C77,'Resource Map'!$B$3:$C$509,2,FALSE))","v":"Coal Removed"},null,"Cholla 4  (Coal Early Retirement/Conversions)",0,0,-387,0,0,0,0,0,0,0,0,0,0,0,0,0,0,0,0,0]
[{"$f":"IF(AND(B78<>\"West\",OR(A77=\"Winter FOT\",A77=\"Done\")),\"Done\",VLOOKUP(C78,'Resource Map'!$B$3:$C$509,2,FALSE))","v":"Coal Removed"},null,"DaveJohnston 1",0,0,0,0,0,0,0,0,0,-99,0,0,0,0,0,0,0,0,0,0]
[{"$f":"IF(AND(B79<>\"West\",OR(A78=\"Winter FOT\",A78=\"Done\")),\"Done\",VLOOKUP(C79,'Resource Map'!$B$3:$C$509,2,FALSE))","v":"Coal Removed"},null,"DaveJohnston 2",0,0,0,0,0,0,0,0,0,-106,0,0,0,0,0,0,0,0,0,0]
[{"$f":"IF(AND(B80<>\"West\",OR(A79=\"Winter FOT\",A79=\"Done\")),\"Done\",VLOOKUP(C80,'Resource Map'!$B$3:$C$509,2,FALSE))","v":"Coal Removed"},null,"DaveJohnston 3",0,0,0,0,0,0,0,0,0,-220,0,0,0,0,0,0,0,0,0,0]
[{"$f":"IF(AND(B81<>\"West\",OR(A80=\"Winter FOT\",A80=\"Done\")),\"Done\",VLOOKUP(C81,'Resource Map'!$B$3:$C$509,2,FALSE))","v":"Coal Removed"},null,"DaveJohnston 4",0,0,0,0,0,0,0,0,0,-330,0,0,0,0,0,0,0,0,0,0]
[{"$f":"IF(AND(B82<>\"West\",OR(A81=\"Winter FOT\",A81=\"Done\")),\"Done\",VLOOKUP(C82,'Resource Map'!$B$3:$C$509,2,FALSE))","v":"Coal Removed"},null,"Naughton 1  (Coal Early Retirement/Conversions)",0,0,0,0,0,0,0,-156,0,0,0,0,0,0,0,0,0,0,0,0]
[{"$f":"IF(AND(B83<>\"West\",OR(A82=\"Winter FOT\",A82=\"Done\")),\"Done\",VLOOKUP(C83,'Resource Map'!$B$3:$C$509,2,FALSE))","v":"Coal Removed"},null,"Naughton 2  (Coal Early Retirement/Conversions)",0,0,0,0,0,0,0,-201,0,0,0,0,0,0,0,0,0,0,0,0]
[{"$f":"IF(AND(B84<>\"West\",OR(A83=\"Winter FOT\",A83=\"Done\")),\"Done\",VLOOKUP(C84,'Resource Map'!$B$3:$C$509,2,FALSE))","v":"Coal Removed"},null,"Naughton 3  (Coal Early Retirement/Conversions)",0,-280,0,0,0,0,0,0,0,0,0,0,0,0,0,0,0,0,0,0]
[{"$f":"IF(AND(B85<>\"West\",OR(A84=\"Winter FOT\",A84=\"Done\")),\"Done\",VLOOKUP(C85,'Resource Map'!$B$3:$C$509,2,FALSE))","v":"Gas Removed"},null,"Gadsby 1-6",0,0,0,0,0,0,0,0,0,0,0,0,0,0,-356.30000000000007,0,0,0,0,0]
[{"$f":"IF(AND(B86<>\"West\",OR(A85=\"Winter FOT\",A85=\"Done\")),\"Done\",VLOOKUP(C86,'Resource Map'!$B$3:$C$509,2,FALSE))","v":"Hydro Removed"},null,"Retire - Hydro",0,0,0,0,0,-20.28,0,0,0,0,0,0,0,0,0,0,0,0,0,0]
[{"$f":"IF(AND(B87<>\"West\",OR(A86=\"Winter FOT\",A86=\"Done\")),\"Done\",VLOOKUP(C87,'Resource Map'!$B$3:$C$509,2,FALSE))","v":"Wind Removed"},null,"Retire - Wind",0,0,0,0,0,0,0,0,0,0,0,-40.200000000000003,0,0,0,0,0,0,0,0]
[{"$f":"IF(AND(B88<>\"West\",OR(A87=\"Winter FOT\",A87=\"Done\")),\"Done\",VLOOKUP(C88,'Resource Map'!$B$3:$C$509,2,FALSE))","v":"Wind Removed"},null,"Expire - Wind PPA",0,-26.55,-16.8,-49,-0.2,0,0,-64.5,-3,0,-18.899999999999999,-99,-200.2,-45,-180.9,-80,0,-60,-80,0]
[{"$f":"IF(AND(B89<>\"West\",OR(A88=\"Winter FOT\",A88=\"Done\")),\"Done\",VLOOKUP(C89,'Resource Map'!$B$3:$C$509,2,FALSE))","v":"Solar Removed"},null,"Expire - Solar PPA",0,0,0,0,-0.5,-0.52,0,0,0,0,0,0,0,0,0,0,-35.1,-94.100000000000009,-849,0]
[{"$f":"IF(AND(B90<>\"West\",OR(A89=\"Winter FOT\",A89=\"Done\")),\"Done\",VLOOKUP(C90,'Resource Map'!$B$3:$C$509,2,FALSE))","v":"Other Removed"},null,"Retire - Other",0,0,0,0,0,0,0,0,0,0,0,0,0,0,0,-0.90700000000000003,0,0,0,-32.1]
[{"$f":"IF(AND(B91<>\"West\",OR(A90=\"Winter FOT\",A90=\"Done\")),\"Done\",VLOOKUP(C91,'Resource Map'!$B$3:$C$509,2,FALSE))","v":"Gas Conv."},null,"Coal Ret_WY - Gas RePower",0,247,0,0,0,0,0,0,0,0,0,-247,0,0,0,0,0,0,0,0]
[{"$f":"IF(AND(B92<>\"West\",OR(A91=\"Winter FOT\",A91=\"Done\")),\"Done\",VLOOKUP(C92,'Resource Map'!$B$3:$C$509,2,FALSE))","v":"-"},null,"Expansion Resources"]
[{"$f":"IF(AND(B93<>\"West\",OR(A92=\"Winter FOT\",A92=\"Done\")),\"Done\",VLOOKUP(C93,'Resource Map'!$B$3:$C$509,2,FALSE))","v":"Gas CCCT"},null,"CCCT - DJohns - J 1x1",0,0,0,0,0,0,0,0,0,0,0,0,0,0,0,0,0,0,505.2,0]
[{"$f":"IF(AND(B94<>\"West\",OR(A93=\"Winter FOT\",A93=\"Done\")),\"Done\",VLOOKUP(C94,'Resource Map'!$B$3:$C$509,2,FALSE))","v":"-"},null,"Total CCCT",0,0,0,0,0,0,0,0,0,0,0,0,0,0,0,0,0,0,505.2,0]
[{"$f":"IF(AND(B95<>\"West\",OR(A94=\"Winter FOT\",A94=\"Done\")),\"Done\",VLOOKUP(C95,'Resource Map'!$B$3:$C$509,2,FALSE))","v":"Gas Peaker"},null,"SCCT Frame NTN",0,0,0,0,0,0,0,0,0,0,0,554.70000000000005,0,0,0,0,0,0,0,0]
[{"$f":"IF(AND(B96<>\"West\",OR(A95=\"Winter FOT\",A95=\"Done\")),\"Done\",VLOOKUP(C96,'Resource Map'!$B$3:$C$509,2,FALSE))","v":"Gas Peaker"},null,"SCCT Frame WYSW",0,0,0,0,0,0,0,0,0,0,0,0,0,0,0,0,0,0,369.8,0]
[{"$f":"IF(AND(B97<>\"West\",OR(A96=\"Winter FOT\",A96=\"Done\")),\"Done\",VLOOKUP(C97,'Resource Map'!$B$3:$C$509,2,FALSE))","v":"-"},null,"Total SCCT",0,0,0,0,0,0,0,0,0,0,0,554.70000000000005,0,0,0,0,0,0,369.8,0]
[{"$f":"IF(AND(B98<>\"West\",OR(A97=\"Winter FOT\",A97=\"Done\")),\"Done\",VLOOKUP(C98,'Resource Map'!$B$3:$C$509,2,FALSE))","v":"Wind"},null,"Wind, GO",0,0,0,0,0,0,0,0,0,0,0,993.6,0,0,0,0,0,0,0,0]
[{"$f":"IF(AND(B99<>\"West\",OR(A98=\"Winter FOT\",A98=\"Done\")),\"Done\",VLOOKUP(C99,'Resource Map'!$B$3:$C$509,2,FALSE))","v":"Wind"},null,"Wind, WYAE",0,0,0,0,0,1920,0,0,0,0,0,0,0,0,0,0,0,0,0,0]
[{"$f":"IF(AND(B100<>\"West\",OR(A99=\"Winter FOT\",A99=\"Done\")),\"Done\",VLOOKUP(C100,'Resource Map'!$B$3:$C$509,2,FALSE))","v":"Wind+Bat"},null,"Wind+Storage, GO",0,0,0,0,0,0,0,0,0,0,0,30.2,0,76.2,0,0,0,0,0,0]
[{"$f":"IF(AND(B101<>\"West\",OR(A100=\"Winter FOT\",A100=\"Done\")),\"Done\",VLOOKUP(C101,'Resource Map'!$B$3:$C$509,2,FALSE))","v":"-"},null,"Total Wind",0,0,0,0,0,1920,0,0,0,0,0,1023.8000000000001,0,76.2,0,0,0,0,0,0]
[{"$f":"IF(AND(B102<>\"West\",OR(A101=\"Winter FOT\",A101=\"Done\")),\"Done\",VLOOKUP(C102,'Resource Map'!$B$3:$C$509,2,FALSE))","v":"Solar+Bat"},null,"Utility Solar+Storage - PV - Utah-S",0,0,0,0,0,300,0,0,0,0,0,0,500,0,0,0,0,0,0,0]
[{"$f":"IF(AND(B103<>\"West\",OR(A102=\"Winter FOT\",A102=\"Done\")),\"Done\",VLOOKUP(C103,'Resource Map'!$B$3:$C$509,2,FALSE))","v":"Solar+Bat"},null,"Utility Solar+Storage - PV - WYSW",0,0,0,0,0,0,0,0,0,0,0,0,0,0,100,0,0,0,0,0]
[{"$f":"IF(AND(B104<>\"West\",OR(A103=\"Winter FOT\",A103=\"Done\")),\"Done\",VLOOKUP(C104,'Resource Map'!$B$3:$C$509,2,FALSE))","v":"Solar+Bat"},null,"Utility Solar+Storage - PV - Huntington",0,0,0,0,0,0,0,0,0,0,0,0,0,0,0,0,0,0,904,5]
[{"$f":"IF(AND(B105<>\"West\",OR(A104=\"Winter FOT\",A104=\"Done\")),\"Done\",VLOOKUP(C105,'Resource Map'!$B$3:$C$509,2,FALSE))","v":"Solar+Bat"},null,"Utility Solar+Storage - PV - Utah-N",0,0,159.19999999999999,63.8,72.8,604.20000000000005,0,0,0,0,0,0,0,0,0,0,0,0,0,0]
[{"$f":"IF(AND(B106<>\"West\",OR(A105=\"Winter FOT\",A105=\"Done\")),\"Done\",VLOOKUP(C106,'Resource Map'!$B$3:$C$509,2,FALSE))","v":"-"},null,"Total Solar",0,0,159.19999999999999,63.8,72.8,904.2,0,0,0,0,0,0,500,0,100,0,0,0,904,5]
[{"$f":"IF(AND(B107<>\"West\",OR(A106=\"Winter FOT\",A106=\"Done\")),\"Done\",VLOOKUP(C107,'Resource Map'!$B$3:$C$509,2,FALSE))","v":"Class 1 DSM"},null,"Demand Response, ID-3rd Party Contracts",0,0,0,0,0,0,0,0,0,0,0,0,0,0,0,0,0,0,0,1.827]
[{"$f":"IF(AND(B108<>\"West\",OR(A107=\"Winter FOT\",A107=\"Done\")),\"Done\",VLOOKUP(C108,'Resource Map'!$B$3:$C$509,2,FALSE))","v":"Class 1 DSM"},null,"Demand Response, ID-Irrigate",0,0,0,0,0,0,0,0,0,0,0,0,0,5.1520000000000001,0,0,0,0,3.6539999999999999,1.7889999999999999]
[{"$f":"IF(AND(B109<>\"West\",OR(A108=\"Winter FOT\",A108=\"Done\")),\"Done\",VLOOKUP(C109,'Resource Map'!$B$3:$C$509,2,FALSE))","v":"Class 1 DSM"},null,"Demand Response, UT-Cool/WH",4.0599999999999996,0,7.0039999999999996,0,9.8580000000000005,0,0,7.1660000000000004,0,0,6.6929999999999996,0,0,6.843,0,0,7.008,0,0,7.2370000000000001]
[{"$f":"IF(AND(B110<>\"West\",OR(A109=\"Winter FOT\",A109=\"Done\")),\"Done\",VLOOKUP(C110,'Resource Map'!$B$3:$C$509,2,FALSE))","v":"Class 1 DSM"},null,"Demand Response, UT-3rd Party Contracts",0,0,0,0,0,0,0,0,0,0,0,0,0,0,0,0,0,0,0,48.394999999999996]
[{"$f":"IF(AND(B111<>\"West\",OR(A110=\"Winter FOT\",A110=\"Done\")),\"Done\",VLOOKUP(C111,'Resource Map'!$B$3:$C$509,2,FALSE))","v":"Class 1 DSM"},null,"Demand Response, UT-Irrigate",0,0,0,0,0,0,0,0,0,0,0,0,0,0,0,0,0,0,0,1.927]
[{"$f":"IF(AND(B112<>\"West\",OR(A111=\"Winter FOT\",A111=\"Done\")),\"Done\",VLOOKUP(C112,'Resource Map'!$B$3:$C$509,2,FALSE))","v":"Class 1 DSM"},null,"Demand Response, UT-Thermostat",0,0,0,0,0,0,0,0,0,0,92.516999999999996,32.352000000000004,0,0,0,0,0,0,8.3350000000000009,5.1180000000000003]
[{"$f":"IF(AND(B113<>\"West\",OR(A112=\"Winter FOT\",A112=\"Done\")),\"Done\",VLOOKUP(C113,'Resource Map'!$B$3:$C$509,2,FALSE))","v":"Class 1 DSM"},null,"Demand Response, WY-3rd Party Contracts",0,0,0,0,0,0,0,0,0,0,0,0,0,0,0,0,0,0,0,2.0499999999999998]
[{"$f":"IF(AND(B114<>\"West\",OR(A113=\"Winter FOT\",A113=\"Done\")),\"Done\",VLOOKUP(C114,'Resource Map'!$B$3:$C$509,2,FALSE))","v":"Class 1 DSM"},null,"Demand Response, WY-Irrigate",0,0,0,0,0,0,0,0,0,0,0,0,0,0,0,0,0,0,0,1.7569999999999999]
[{"$f":"IF(AND(B115<>\"West\",OR(A114=\"Winter FOT\",A114=\"Done\")),\"Done\",VLOOKUP(C115,'Resource Map'!$B$3:$C$509,2,FALSE))","v":"Class 1 DSM"},null,"Demand Response, WY-Thermostat",0,0,0,0,0,0,0,0,0,0,0,0,0,0,0,0,0,0,0,19.920999999999999]
[{"$f":"IF(AND(B116<>\"West\",OR(A115=\"Winter FOT\",A115=\"Done\")),\"Done\",VLOOKUP(C116,'Resource Map'!$B$3:$C$509,2,FALSE))","v":"Class 1 DSM"},null,"Demand Response, UT-Ancillary Services",0,0,0,0,8.2520000000000007,0,5.2530000000000001,0,0,0,0,0,0,0,0,0,0,0,3.2410000000000001,0]
[{"$f":"IF(AND(B117<>\"West\",OR(A116=\"Winter FOT\",A116=\"Done\")),\"Done\",VLOOKUP(C117,'Resource Map'!$B$3:$C$509,2,FALSE))","v":"Class 1 DSM"},null,"Demand Response, WY-Ancillary Services",0,0,0,0,0,0,2.9580000000000002,0,0,0,0,0,0,0,0,0,0,0,0,0]
[{"$f":"IF(AND(B118<>\"West\",OR(A117=\"Winter FOT\",A117=\"Done\")),\"Done\",VLOOKUP(C118,'Resource Map'!$B$3:$C$509,2,FALSE))","v":"-"},null,"Demand Response Total",4.0599999999999996,0,7.0039999999999996,0,18.11,0,8.2110000000000003,7.1660000000000004,0,0,99.21,32.352000000000004,0,11.995000000000001,0,0,7.008,0,15.23,90.020999999999987]
[{"$f":"IF(AND(B119<>\"West\",OR(A118=\"Winter FOT\",A118=\"Done\")),\"Done\",VLOOKUP(C119,'Resource Map'!$B$3:$C$509,2,FALSE))","v":"Class 2 DSM"},null,"Energy Efficiency, ID",6,5.25,6.32,6.6,7.03,7.3599999999999994,7.3000000000000007,7.21,7.07,7.09,6.62,6.39,6.1,5.86,5.7700000000000014,4.42,4.0200000000000005,3.45,3.04,2.98]
[{"$f":"IF(AND(B120<>\"West\",OR(A119=\"Winter FOT\",A119=\"Done\")),\"Done\",VLOOKUP(C120,'Resource Map'!$B$3:$C$509,2,FALSE))","v":"Class 2 DSM"},null,"Energy Efficiency, UT",58,67.100000000000009,67.2,67.5,68.800000000000011,66.300000000000011,67.100000000000009,64.600000000000009,64.800000000000011,62.300000000000004,57,57.900000000000006,52.300000000000004,49.900000000000006,50.5,35.9,32.4,26.200000000000003,22.900000000000002,26.2]
[{"$f":"IF(AND(B121<>\"West\",OR(A120=\"Winter FOT\",A120=\"Done\")),\"Done\",VLOOKUP(C121,'Resource Map'!$B$3:$C$509,2,FALSE))","v":"Class 2 DSM"},null,"Energy Efficiency, WY",10,10.17,10.990000000000002,12.010000000000002,15.380000000000003,16.16,16.47,17.7,17.61,17.39,16.12,15.13,13.13,12.05,11.43,8.7899999999999991,8.18,7.0900000000000007,5.19,5.33]
[{"$f":"IF(AND(B122<>\"West\",OR(A121=\"Winter FOT\",A121=\"Done\")),\"Done\",VLOOKUP(C122,'Resource Map'!$B$3:$C$509,2,FALSE))","v":"-"},null,"Energy Efficiency Total",74,82.52000000000001,84.510000000000019,86.11,91.210000000000008,89.820000000000007,90.87,89.51,89.48,86.78,79.739999999999995,79.42,71.53,67.81,67.7,49.11,44.6,36.74,31.130000000000003,34.51]
[{"$f":"IF(AND(B123<>\"West\",OR(A122=\"Winter FOT\",A122=\"Done\")),\"Done\",VLOOKUP(C123,'Resource Map'!$B$3:$C$509,2,FALSE))","v":"Battery"},null,"Battery Storage - Utah-S",0,0,0,0,0,0,0,0,0,0,0,0,0,0,0,0,0,0,0,420]
[{"$f":"IF(AND(B124<>\"West\",OR(A123=\"Winter FOT\",A123=\"Done\")),\"Done\",VLOOKUP(C124,'Resource Map'!$B$3:$C$509,2,FALSE))","v":"Battery"},null,"Battery Storage - WYSW",0,0,0,0,0,0,0,0,0,0,0,0,0,0,0,0,0,0,0,15]
[{"$f":"IF(AND(B125<>\"West\",OR(A124=\"Winter FOT\",A124=\"Done\")),\"Done\",VLOOKUP(C125,'Resource Map'!$B$3:$C$509,2,FALSE))","v":"Battery"},null,"Battery Storage - Idaho",0,0,0,0,0,0,0,0,0,0,0,90,0,45,0,0,0,0,0,30]
[{"$f":"IF(AND(B126<>\"West\",OR(A125=\"Winter FOT\",A125=\"Done\")),\"Done\",VLOOKUP(C126,'Resource Map'!$B$3:$C$509,2,FALSE))","v":"FOT"},null,"FOT East - Summer",0,0,0,0,0,0,0,0,0,30.51,224.43,300,280.32,144.93,300,281.01,300,300,300,300]
[{"$f":"IF(AND(B127<>\"West\",OR(A126=\"Winter FOT\",A126=\"Done\")),\"Done\",VLOOKUP(C127,'Resource Map'!$B$3:$C$509,2,FALSE))","v":"-"},"West","Existing Plant Retirements and PPA Termination"]
[{"$f":"IF(AND(B128<>\"West\",OR(A127=\"Winter FOT\",A127=\"Done\")),\"Done\",VLOOKUP(C128,'Resource Map'!$B$3:$C$509,2,FALSE))","v":"Coal Removed"},null,"JimBridger 1  (Coal Early Retirement/Conversions)",0,0,0,0,0,-350.5,0,0,0,0,0,0,0,0,0,0,0,0,0,0]
[{"$f":"IF(AND(B129<>\"West\",OR(A128=\"Winter FOT\",A128=\"Done\")),\"Done\",VLOOKUP(C129,'Resource Map'!$B$3:$C$509,2,FALSE))","v":"Coal Removed"},null,"JimBridger 2  (Coal Early Retirement/Conversions)",0,0,0,0,0,0,0,0,0,0,-355.8,0,0,0,0,0,0,0,0,0]
[{"$f":"IF(AND(B130<>\"West\",OR(A129=\"Winter FOT\",A129=\"Done\")),\"Done\",VLOOKUP(C130,'Resource Map'!$B$3:$C$509,2,FALSE))","v":"Coal Removed"},null,"JimBridger 3",0,0,0,0,0,0,0,0,0,0,0,0,0,0,0,0,0,0,0,-348.7]
[{"$f":"IF(AND(B131<>\"West\",OR(A130=\"Winter FOT\",A130=\"Done\")),\"Done\",VLOOKUP(C131,'Resource Map'!$B$3:$C$509,2,FALSE))","v":"Coal Removed"},null,"JimBridger 4",0,0,0,0,0,0,0,0,0,0,0,0,0,0,0,0,0,0,0,-353.3]
[{"$f":"IF(AND(B132<>\"West\",OR(A131=\"Winter FOT\",A131=\"Done\")),\"Done\",VLOOKUP(C132,'Resource Map'!$B$3:$C$509,2,FALSE))","v":"Gas Removed"},null,"Hermiston",0,0,0,0,0,0,0,0,0,0,0,0,0,0,0,0,0,0,-237,0]
[{"$f":"IF(AND(B133<>\"West\",OR(A132=\"Winter FOT\",A132=\"Done\")),\"Done\",VLOOKUP(C133,'Resource Map'!$B$3:$C$509,2,FALSE))","v":"Hydro Removed"},null,"Retire - Hydro",0,-1.1000000000000001,-168.90000000000003,0,-0.7,0,0,-1.4,0,-7.2,0,0,-6.4,0,0,-74.900000000000006,0,-1.2,0,0]
[{"$f":"IF(AND(B134<>\"West\",OR(A133=\"Winter FOT\",A133=\"Done\")),\"Done\",VLOOKUP(C134,'Resource Map'!$B$3:$C$509,2,FALSE))","v":"Wind Removed"},null,"Expire - Wind PPA",0,0,0,-175,0,-41,0,0,0,0,-74.5,-9.9,0,-20,-20,0,0,-10,-10,0]
[{"$f":"IF(AND(B135<>\"West\",OR(A134=\"Winter FOT\",A134=\"Done\")),\"Done\",VLOOKUP(C135,'Resource Map'!$B$3:$C$509,2,FALSE))","v":"Solar Removed"},null,"Expire - Solar PPA",0,0,0,0,0,0,0,0,0,-2,0,0,-67,-48.9,0,0,-0.8,-115,-175.20000000000002,-10.9]
[{"$f":"IF(AND(B136<>\"West\",OR(A135=\"Winter FOT\",A135=\"Done\")),\"Done\",VLOOKUP(C136,'Resource Map'!$B$3:$C$509,2,FALSE))","v":"-"},null,"Expansion Resources"]
[{"$f":"IF(AND(B137<>\"West\",OR(A136=\"Winter FOT\",A136=\"Done\")),\"Done\",VLOOKUP(C137,'Resource Map'!$B$3:$C$509,2,FALSE))","v":"Gas Peaker"},null,"SCCT Frame WV",0,0,0,0,0,0,0,0,0,0,0,0,0,0,0,0,0,0,442.8,0]
[{"$f":"IF(AND(B138<>\"West\",OR(A137=\"Winter FOT\",A137=\"Done\")),\"Done\",VLOOKUP(C138,'Resource Map'!$B$3:$C$509,2,FALSE))","v":"-"},null,"Total SCCT",0,0,0,0,0,0,0,0,0,0,0,0,0,0,0,0,0,0,442.8,0]
[{"$f":"IF(AND(B139<>\"West\",OR(A138=\"Winter FOT\",A138=\"Done\")),\"Done\",VLOOKUP(C139,'Resource Map'!$B$3:$C$509,2,FALSE))","v":"Solar+Bat"},null,"Utility Solar+Storage - PV - Jbridger",0,0,0,0,0,354,0,0,0,0,359.4,0,0,0,0,0,0,0,0,701.8]
[{"$f":"IF(AND(B140<>\"West\",OR(A139=\"Winter FOT\",A139=\"Done\")),\"Done\",VLOOKUP(C140,'Resource Map'!$B$3:$C$509,2,FALSE))","v":"Solar+Bat"},null,"Utility Solar+Storage - PV - S-Oregon",0,0,0,0,0,500,0,0,0,0,0,0,0,475,0,0,0,0,0,0]
[{"$f":"IF(AND(B141<>\"West\",OR(A140=\"Winter FOT\",A140=\"Done\")),\"Done\",VLOOKUP(C141,'Resource Map'!$B$3:$C$509,2,FALSE))","v":"Solar+Bat"},null,"Utility Solar+Storage - PV - Yakima",0,0,0,0,0,405,0,0,0,0,0,0,0,0,0,0,0,0,0,0]
[{"$f":"IF(AND(B142<>\"West\",OR(A141=\"Winter FOT\",A141=\"Done\")),\"Done\",VLOOKUP(C142,'Resource Map'!$B$3:$C$509,2,FALSE))","v":"-"},null,"Total Solar",0,0,0,0,0,1259,0,0,0,0,359.4,0,0,475,0,0,0,0,0,701.8]
[{"$f":"IF(AND(B143<>\"West\",OR(A142=\"Winter FOT\",A142=\"Done\")),\"Done\",VLOOKUP(C143,'Resource Map'!$B$3:$C$509,2,FALSE))","v":"Class 1 DSM"},null,"Demand Response, OR-Ancillary Services",0,0,0,0,0,0,0,0,0,0,0,0,0,7.5119999999999996,0,0,0,0,0,0]
[{"$f":"IF(AND(B144<>\"West\",OR(A143=\"Winter FOT\",A143=\"Done\")),\"Done\",VLOOKUP(C144,'Resource Map'!$B$3:$C$509,2,FALSE))","v":"Class 1 DSM"},null,"Demand Response, WA-Ancillary Services",0,0,0,0,0,0,0,0,0,0,0,1.851,0,0,0,0,0,0,0,0]
[{"$f":"IF(AND(B145<>\"West\",OR(A144=\"Winter FOT\",A144=\"Done\")),\"Done\",VLOOKUP(C145,'Resource Map'!$B$3:$C$509,2,FALSE))","v":"Class 1 DSM"},null,"Demand Response, OR-Cool/WH",0,0,0,0,0,0,0,0,0,0,0,0,0,0,0,0,0,0,0,3.0270000000000001]
[{"$f":"IF(AND(B146<>\"West\",OR(A145=\"Winter FOT\",A145=\"Done\")),\"Done\",VLOOKUP(C146,'Resource Map'!$B$3:$C$509,2,FALSE))","v":"Class 1 DSM"},null,"Demand Response, OR-3rd Party Contracts",0,0,0,0,0,0,0,0,0,0,0,0,0,0,0,0,0,0,0,7.3940000000000001]
[{"$f":"IF(AND(B147<>\"West\",OR(A146=\"Winter FOT\",A146=\"Done\")),\"Done\",VLOOKUP(C147,'Resource Map'!$B$3:$C$509,2,FALSE))","v":"Class 1 DSM"},null,"Demand Response, OR-Irrigate",0,0,0,0,0,0,0,0,0,0,0,0,0,0,0,0,0,0,13.268000000000001,0]
[{"$f":"IF(AND(B148<>\"West\",OR(A147=\"Winter FOT\",A147=\"Done\")),\"Done\",VLOOKUP(C148,'Resource Map'!$B$3:$C$509,2,FALSE))","v":"Class 1 DSM"},null,"Demand Response, WA-Irrigate",0,0,0,0,0,0,0,0,0,0,0,0,0,0,0,0,0,0,8.3060000000000009,0]
[{"$f":"IF(AND(B149<>\"West\",OR(A148=\"Winter FOT\",A148=\"Done\")),\"Done\",VLOOKUP(C149,'Resource Map'!$B$3:$C$509,2,FALSE))","v":"Class 1 DSM"},null,"Demand Response, WA-Thermostat",0,0,0,0,0,0,0,0,0,0,0,0,0,0,0,0,0,0,0,5.3079999999999998]
[{"$f":"IF(AND(B150<>\"West\",OR(A149=\"Winter FOT\",A149=\"Done\")),\"Done\",VLOOKUP(C150,'Resource Map'!$B$3:$C$509,2,FALSE))","v":"-"},null,"Demand Response  Total",0,0,0,0,0,0,0,0,0,0,0,1.851,0,7.5119999999999996,0,0,0,0,21.574000000000002,15.728999999999999]
[{"$f":"IF(AND(B151<>\"West\",OR(A150=\"Winter FOT\",A150=\"Done\")),\"Done\",VLOOKUP(C151,'Resource Map'!$B$3:$C$509,2,FALSE))","v":"Class 2 DSM"},null,"Energy Efficiency, CA",1,1.6400000000000001,1.53,1.62,1.74,1.83,1.8399999999999999,2.0300000000000002,2.0099999999999998,2.0300000000000002,2.0299999999999998,2.06,1.8800000000000001,1.84,1.8000000000000003,1.3,1.4100000000000001,1.2,1.04,0.89]
[{"$f":"IF(AND(B152<>\"West\",OR(A151=\"Winter FOT\",A151=\"Done\")),\"Done\",VLOOKUP(C152,'Resource Map'!$B$3:$C$509,2,FALSE))","v":"Class 2 DSM"},null,"Energy Efficiency, OR",40,37,36.5,39.700000000000003,39.300000000000004,45.6,42.7,41.100000000000009,38.800000000000011,38.200000000000003,34.6,32.299999999999997,31.299999999999997,30.1,28.200000000000003,25.5,25.900000000000002,26.200000000000003,24.700000000000003,23.800000000000004]
[{"$f":"IF(AND(B153<>\"West\",OR(A152=\"Winter FOT\",A152=\"Done\")),\"Done\",VLOOKUP(C153,'Resource Map'!$B$3:$C$509,2,FALSE))","v":"Class 2 DSM"},null,"Energy Efficiency, WA",11,9.2500000000000018,10.15,10.719999999999999,11.830000000000002,11.649999999999999,11.59,11.189999999999998,11.089999999999998,10.749999999999998,9.7799999999999994,9.3800000000000026,8.7900000000000009,8.379999999999999,8.09,5.9600000000000017,5.8899999999999988,4.8900000000000015,4.28,4.0599999999999996]
[{"$f":"IF(AND(B154<>\"West\",OR(A153=\"Winter FOT\",A153=\"Done\")),\"Done\",VLOOKUP(C154,'Resource Map'!$B$3:$C$509,2,FALSE))","v":"-"},null,"Energy Efficiency  Total",52,47.89,48.18,52.04,52.870000000000005,59.08,56.13000000000001,54.320000000000007,51.900000000000006,50.980000000000004,46.410000000000004,43.74,41.97,40.32,38.090000000000003,32.760000000000005,33.200000000000003,32.290000000000006,30.020000000000003,28.750000000000004]
[{"$f":"IF(AND(B155<>\"West\",OR(A154=\"Winter FOT\",A154=\"Done\")),\"Done\",VLOOKUP(C155,'Resource Map'!$B$3:$C$509,2,FALSE))","v":"Battery"},null,"Battery Storage - S-Oregon",0,0,0,0,0,0,0,0,0,15,0,120,0,0,150,0,0,0,60,0]
[{"$f":"IF(AND(B156<>\"West\",OR(A155=\"Winter FOT\",A155=\"Done\")),\"Done\",VLOOKUP(C156,'Resource Map'!$B$3:$C$509,2,FALSE))","v":"Battery"},null,"Battery Storage - Willamette Valley",0,0,0,0,0,0,0,0,0,0,0,75,0,0,0,0,0,0,0,0]
[{"$f":"IF(AND(B157<>\"West\",OR(A156=\"Winter FOT\",A156=\"Done\")),\"Done\",VLOOKUP(C157,'Resource Map'!$B$3:$C$509,2,FALSE))","v":"Battery"},null,"Battery Storage - Portland NC",0,0,0,0,0,0,0,0,0,0,0,45,0,0,30,0,0,0,0,0]
[{"$f":"IF(AND(B158<>\"West\",OR(A157=\"Winter FOT\",A157=\"Done\")),\"Done\",VLOOKUP(C158,'Resource Map'!$B$3:$C$509,2,FALSE))","v":"Battery"},null,"Battery Storage - Walla Walla",0,0,0,0,0,0,0,0,0,120,0,0,0,0,15,0,0,0,60,0]
[{"$f":"IF(AND(B159<>\"West\",OR(A158=\"Winter FOT\",A158=\"Done\")),\"Done\",VLOOKUP(C159,'Resource Map'!$B$3:$C$509,2,FALSE))","v":"Battery"},null,"Battery Storage - Yakima",0,0,0,0,0,0,0,0,0,105,0,0,0,0,0,0,0,0,0,0]
[{"$f":"IF(AND(B160<>\"West\",OR(A159=\"Winter FOT\",A159=\"Done\")),\"Done\",VLOOKUP(C160,'Resource Map'!$B$3:$C$509,2,FALSE))","v":"FOT"},null,"FOT West - Summer",997.68499999999995,719.55,493.56,503.88,499.64,175.02500000000001,168.52500000000001,198.04000000000002,243.32,1075,1075,1075,1075,1075,1075,1075,1051.4880000000001,1063.037,1075,1062.3630000000001]
[{"$f":"IF(AND(B161<>\"West\",OR(A160=\"Winter FOT\",A160=\"Done\")),\"Done\",VLOOKUP(C161,'Resource Map'!$B$3:$C$509,2,FALSE))","v":"Winter FOT"},null,"FOT West - Winter",151.44499999999999,130.91,268.39999999999998,303.27999999999997,313.95999999999998,50.15,56.55,60.3,109.85,241.68,261.64,225.94,247.20999999999998,127.51,75.48,6.92,22.24,175,0,0]
[{"$f":"IF(AND(B162<>\"West\",OR(A161=\"Winter FOT\",A161=\"Done\")),\"Done\",VLOOKUP(C162,'Resource Map'!$B$3:$C$509,2,FALSE))","v":"Done"}]
[{"$f":"IF(AND(B163<>\"West\",OR(A162=\"Winter FOT\",A162=\"Done\")),\"Done\",VLOOKUP(C163,'Resource Map'!$B$3:$C$509,2,FALSE))","v":"Done"}]
[{"$f":"IF(AND(B164<>\"West\",OR(A163=\"Winter FOT\",A163=\"Done\")),\"Done\",VLOOKUP(C164,'Resource Map'!$B$3:$C$509,2,FALSE))","v":"Done"}]
[{"$f":"IF(AND(B165<>\"West\",OR(A164=\"Winter FOT\",A164=\"Done\")),\"Done\",VLOOKUP(C165,'Resource Map'!$B$3:$C$509,2,FALSE))","v":"Done"}]
[{"$f":"IF(AND(B166<>\"West\",OR(A165=\"Winter FOT\",A165=\"Done\")),\"Done\",VLOOKUP(C166,'Resource Map'!$B$3:$C$509,2,FALSE))","v":"Done"}]
[{"$f":"IF(AND(B167<>\"West\",OR(A166=\"Winter FOT\",A166=\"Done\")),\"Done\",VLOOKUP(C167,'Resource Map'!$B$3:$C$509,2,FALSE))","v":"Done"}]
[{"$f":"IF(AND(B168<>\"West\",OR(A167=\"Winter FOT\",A167=\"Done\")),\"Done\",VLOOKUP(C168,'Resource Map'!$B$3:$C$509,2,FALSE))","v":"Done"}]
[{"$f":"IF(AND(B169<>\"West\",OR(A168=\"Winter FOT\",A168=\"Done\")),\"Done\",VLOOKUP(C169,'Resource Map'!$B$3:$C$509,2,FALSE))","v":"Done"}]
[{"$f":"IF(AND(B170<>\"West\",OR(A169=\"Winter FOT\",A169=\"Done\")),\"Done\",VLOOKUP(C170,'Resource Map'!$B$3:$C$509,2,FALSE))","v":"Done"}]
[{"$f":"IF(AND(B171<>\"West\",OR(A170=\"Winter FOT\",A170=\"Done\")),\"Done\",VLOOKUP(C171,'Resource Map'!$B$3:$C$509,2,FALSE))","v":"Done"}]
[{"$f":"IF(AND(B172<>\"West\",OR(A171=\"Winter FOT\",A171=\"Done\")),\"Done\",VLOOKUP(C172,'Resource Map'!$B$3:$C$509,2,FALSE))","v":"Done"}]
[{"$f":"IF(AND(B173<>\"West\",OR(A172=\"Winter FOT\",A172=\"Done\")),\"Done\",VLOOKUP(C173,'Resource Map'!$B$3:$C$509,2,FALSE))","v":"Done"}]
[{"$f":"IF(AND(B174<>\"West\",OR(A173=\"Winter FOT\",A173=\"Done\")),\"Done\",VLOOKUP(C174,'Resource Map'!$B$3:$C$509,2,FALSE))","v":"Done"}]
[{"$f":"IF(AND(B175<>\"West\",OR(A174=\"Winter FOT\",A174=\"Done\")),\"Done\",VLOOKUP(C175,'Resource Map'!$B$3:$C$509,2,FALSE))","v":"Done"}]
[{"$f":"IF(AND(B176<>\"West\",OR(A175=\"Winter FOT\",A175=\"Done\")),\"Done\",VLOOKUP(C176,'Resource Map'!$B$3:$C$509,2,FALSE))","v":"Done"}]
[{"$f":"IF(AND(B177<>\"West\",OR(A176=\"Winter FOT\",A176=\"Done\")),\"Done\",VLOOKUP(C177,'Resource Map'!$B$3:$C$509,2,FALSE))","v":"Done"}]
[{"$f":"IF(AND(B178<>\"West\",OR(A177=\"Winter FOT\",A177=\"Done\")),\"Done\",VLOOKUP(C178,'Resource Map'!$B$3:$C$509,2,FALSE))","v":"Done"}]
[{"$f":"IF(AND(B179<>\"West\",OR(A178=\"Winter FOT\",A178=\"Done\")),\"Done\",VLOOKUP(C179,'Resource Map'!$B$3:$C$509,2,FALSE))","v":"Done"}]
[{"$f":"IF(AND(B180<>\"West\",OR(A179=\"Winter FOT\",A179=\"Done\")),\"Done\",VLOOKUP(C180,'Resource Map'!$B$3:$C$509,2,FALSE))","v":"Done"}]
[{"$f":"IF(AND(B181<>\"West\",OR(A180=\"Winter FOT\",A180=\"Done\")),\"Done\",VLOOKUP(C181,'Resource Map'!$B$3:$C$509,2,FALSE))","v":"Done"}]
[{"$f":"IF(AND(B182<>\"West\",OR(A181=\"Winter FOT\",A181=\"Done\")),\"Done\",VLOOKUP(C182,'Resource Map'!$B$3:$C$509,2,FALSE))","v":"Done"}]
[{"$f":"IF(AND(B183<>\"West\",OR(A182=\"Winter FOT\",A182=\"Done\")),\"Done\",VLOOKUP(C183,'Resource Map'!$B$3:$C$509,2,FALSE))","v":"Done"}]
[{"$f":"IF(AND(B184<>\"West\",OR(A183=\"Winter FOT\",A183=\"Done\")),\"Done\",VLOOKUP(C184,'Resource Map'!$B$3:$C$509,2,FALSE))","v":"Done"}]
[{"$f":"IF(AND(B185<>\"West\",OR(A184=\"Winter FOT\",A184=\"Done\")),\"Done\",VLOOKUP(C185,'Resource Map'!$B$3:$C$509,2,FALSE))","v":"Done"}]
[{"$f":"IF(AND(B186<>\"West\",OR(A185=\"Winter FOT\",A185=\"Done\")),\"Done\",VLOOKUP(C186,'Resource Map'!$B$3:$C$509,2,FALSE))","v":"Done"}]
[{"$f":"IF(AND(B187<>\"West\",OR(A186=\"Winter FOT\",A186=\"Done\")),\"Done\",VLOOKUP(C187,'Resource Map'!$B$3:$C$509,2,FALSE))","v":"Done"}]
[{"$f":"IF(AND(B188<>\"West\",OR(A187=\"Winter FOT\",A187=\"Done\")),\"Done\",VLOOKUP(C188,'Resource Map'!$B$3:$C$509,2,FALSE))","v":"Done"}]
[{"$f":"IF(AND(B189<>\"West\",OR(A188=\"Winter FOT\",A188=\"Done\")),\"Done\",VLOOKUP(C189,'Resource Map'!$B$3:$C$509,2,FALSE))","v":"Done"}]
[{"$f":"IF(AND(B190<>\"West\",OR(A189=\"Winter FOT\",A189=\"Done\")),\"Done\",VLOOKUP(C190,'Resource Map'!$B$3:$C$509,2,FALSE))","v":"Done"}]
[{"$f":"IF(AND(B191<>\"West\",OR(A190=\"Winter FOT\",A190=\"Done\")),\"Done\",VLOOKUP(C191,'Resource Map'!$B$3:$C$509,2,FALSE))","v":"Done"}]
[{"$f":"IF(AND(B192<>\"West\",OR(A191=\"Winter FOT\",A191=\"Done\")),\"Done\",VLOOKUP(C192,'Resource Map'!$B$3:$C$509,2,FALSE))","v":"Done"}]
[{"$f":"IF(AND(B193<>\"West\",OR(A192=\"Winter FOT\",A192=\"Done\")),\"Done\",VLOOKUP(C193,'Resource Map'!$B$3:$C$509,2,FALSE))","v":"Done"}]
[{"$f":"IF(AND(B194<>\"West\",OR(A193=\"Winter FOT\",A193=\"Done\")),\"Done\",VLOOKUP(C194,'Resource Map'!$B$3:$C$509,2,FALSE))","v":"Done"}]
[{"$f":"IF(AND(B195<>\"West\",OR(A194=\"Winter FOT\",A194=\"Done\")),\"Done\",VLOOKUP(C195,'Resource Map'!$B$3:$C$509,2,FALSE))","v":"Done"}]
[{"$f":"IF(AND(B196<>\"West\",OR(A195=\"Winter FOT\",A195=\"Done\")),\"Done\",VLOOKUP(C196,'Resource Map'!$B$3:$C$509,2,FALSE))","v":"Done"}]
[{"$f":"IF(AND(B197<>\"West\",OR(A196=\"Winter FOT\",A196=\"Done\")),\"Done\",VLOOKUP(C197,'Resource Map'!$B$3:$C$509,2,FALSE))","v":"Done"}]
[{"$f":"IF(AND(B198<>\"West\",OR(A197=\"Winter FOT\",A197=\"Done\")),\"Done\",VLOOKUP(C198,'Resource Map'!$B$3:$C$509,2,FALSE))","v":"Done"}]
[{"$f":"IF(AND(B199<>\"West\",OR(A198=\"Winter FOT\",A198=\"Done\")),\"Done\",VLOOKUP(C199,'Resource Map'!$B$3:$C$509,2,FALSE))","v":"Done"}]
[{"$f":"IF(AND(B200<>\"West\",OR(A199=\"Winter FOT\",A199=\"Done\")),\"Done\",VLOOKUP(C200,'Resource Map'!$B$3:$C$509,2,FALSE))","v":"Done"}]
[{"$f":"IF(AND(B201<>\"West\",OR(A200=\"Winter FOT\",A200=\"Done\")),\"Done\",VLOOKUP(C201,'Resource Map'!$B$3:$C$509,2,FALSE))","v":"Done"}]
[{"$f":"IF(AND(B202<>\"West\",OR(A201=\"Winter FOT\",A201=\"Done\")),\"Done\",VLOOKUP(C202,'Resource Map'!$B$3:$C$509,2,FALSE))","v":"Done"}]
[{"$f":"IF(AND(B203<>\"West\",OR(A202=\"Winter FOT\",A202=\"Done\")),\"Done\",VLOOKUP(C203,'Resource Map'!$B$3:$C$509,2,FALSE))","v":"Done"}]
[{"$f":"IF(AND(B204<>\"West\",OR(A203=\"Winter FOT\",A203=\"Done\")),\"Done\",VLOOKUP(C204,'Resource Map'!$B$3:$C$509,2,FALSE))","v":"Done"}]
[{"$f":"IF(AND(B205<>\"West\",OR(A204=\"Winter FOT\",A204=\"Done\")),\"Done\",VLOOKUP(C205,'Resource Map'!$B$3:$C$509,2,FALSE))","v":"Done"}]
[{"$f":"IF(AND(B206<>\"West\",OR(A205=\"Winter FOT\",A205=\"Done\")),\"Done\",VLOOKUP(C206,'Resource Map'!$B$3:$C$509,2,FALSE))","v":"Done"}]
[{"$f":"IF(AND(B207<>\"West\",OR(A206=\"Winter FOT\",A206=\"Done\")),\"Done\",VLOOKUP(C207,'Resource Map'!$B$3:$C$509,2,FALSE))","v":"Done"}]
[{"$f":"IF(AND(B208<>\"West\",OR(A207=\"Winter FOT\",A207=\"Done\")),\"Done\",VLOOKUP(C208,'Resource Map'!$B$3:$C$509,2,FALSE))","v":"Done"}]
[{"$f":"IF(AND(B209<>\"West\",OR(A208=\"Winter FOT\",A208=\"Done\")),\"Done\",VLOOKUP(C209,'Resource Map'!$B$3:$C$509,2,FALSE))","v":"Done"}]
[{"$f":"IF(AND(B210<>\"West\",OR(A209=\"Winter FOT\",A209=\"Done\")),\"Done\",VLOOKUP(C210,'Resource Map'!$B$3:$C$509,2,FALSE))","v":"Done"}]
[{"$f":"IF(AND(B211<>\"West\",OR(A210=\"Winter FOT\",A210=\"Done\")),\"Done\",VLOOKUP(C211,'Resource Map'!$B$3:$C$509,2,FALSE))","v":"Done"}]
[{"$f":"IF(AND(B212<>\"West\",OR(A211=\"Winter FOT\",A211=\"Done\")),\"Done\",VLOOKUP(C212,'Resource Map'!$B$3:$C$509,2,FALSE))","v":"Done"}]
[{"$f":"IF(AND(B213<>\"West\",OR(A212=\"Winter FOT\",A212=\"Done\")),\"Done\",VLOOKUP(C213,'Resource Map'!$B$3:$C$509,2,FALSE))","v":"Done"}]
[{"$f":"IF(AND(B214<>\"West\",OR(A213=\"Winter FOT\",A213=\"Done\")),\"Done\",VLOOKUP(C214,'Resource Map'!$B$3:$C$509,2,FALSE))","v":"Done"}]
[{"$f":"IF(AND(B215<>\"West\",OR(A214=\"Winter FOT\",A214=\"Done\")),\"Done\",VLOOKUP(C215,'Resource Map'!$B$3:$C$509,2,FALSE))","v":"Done"}]
[{"$f":"IF(AND(B216<>\"West\",OR(A215=\"Winter FOT\",A215=\"Done\")),\"Done\",VLOOKUP(C216,'Resource Map'!$B$3:$C$509,2,FALSE))","v":"Done"}]
[{"$f":"IF(AND(B217<>\"West\",OR(A216=\"Winter FOT\",A216=\"Done\")),\"Done\",VLOOKUP(C217,'Resource Map'!$B$3:$C$509,2,FALSE))","v":"Done"}]
[{"$f":"IF(AND(B218<>\"West\",OR(A217=\"Winter FOT\",A217=\"Done\")),\"Done\",VLOOKUP(C218,'Resource Map'!$B$3:$C$509,2,FALSE))","v":"Done"}]
[{"$f":"IF(AND(B219<>\"West\",OR(A218=\"Winter FOT\",A218=\"Done\")),\"Done\",VLOOKUP(C219,'Resource Map'!$B$3:$C$509,2,FALSE))","v":"Done"}]
[{"$f":"IF(AND(B220<>\"West\",OR(A219=\"Winter FOT\",A219=\"Done\")),\"Done\",VLOOKUP(C220,'Resource Map'!$B$3:$C$509,2,FALSE))","v":"Done"}]
[{"$f":"IF(AND(B221<>\"West\",OR(A220=\"Winter FOT\",A220=\"Done\")),\"Done\",VLOOKUP(C221,'Resource Map'!$B$3:$C$509,2,FALSE))","v":"Done"}]
[{"$f":"IF(AND(B222<>\"West\",OR(A221=\"Winter FOT\",A221=\"Done\")),\"Done\",VLOOKUP(C222,'Resource Map'!$B$3:$C$509,2,FALSE))","v":"Done"}]
[{"$f":"IF(AND(B223<>\"West\",OR(A222=\"Winter FOT\",A222=\"Done\")),\"Done\",VLOOKUP(C223,'Resource Map'!$B$3:$C$509,2,FALSE))","v":"Done"}]
[{"$f":"IF(AND(B224<>\"West\",OR(A223=\"Winter FOT\",A223=\"Done\")),\"Done\",VLOOKUP(C224,'Resource Map'!$B$3:$C$509,2,FALSE))","v":"Done"}]
[{"$f":"IF(AND(B225<>\"West\",OR(A224=\"Winter FOT\",A224=\"Done\")),\"Done\",VLOOKUP(C225,'Resource Map'!$B$3:$C$509,2,FALSE))","v":"Done"}]
[{"$f":"IF(AND(B226<>\"West\",OR(A225=\"Winter FOT\",A225=\"Done\")),\"Done\",VLOOKUP(C226,'Resource Map'!$B$3:$C$509,2,FALSE))","v":"Done"}]
[{"$f":"IF(AND(B227<>\"West\",OR(A226=\"Winter FOT\",A226=\"Done\")),\"Done\",VLOOKUP(C227,'Resource Map'!$B$3:$C$509,2,FALSE))","v":"Done"}]
[{"$f":"IF(AND(B228<>\"West\",OR(A227=\"Winter FOT\",A227=\"Done\")),\"Done\",VLOOKUP(C228,'Resource Map'!$B$3:$C$509,2,FALSE))","v":"Done"}]
[{"$f":"IF(AND(B229<>\"West\",OR(A228=\"Winter FOT\",A228=\"Done\")),\"Done\",VLOOKUP(C229,'Resource Map'!$B$3:$C$509,2,FALSE))","v":"Done"}]
[{"$f":"IF(AND(B230<>\"West\",OR(A229=\"Winter FOT\",A229=\"Done\")),\"Done\",VLOOKUP(C230,'Resource Map'!$B$3:$C$509,2,FALSE))","v":"Done"}]
[{"$f":"IF(AND(B231<>\"West\",OR(A230=\"Winter FOT\",A230=\"Done\")),\"Done\",VLOOKUP(C231,'Resource Map'!$B$3:$C$509,2,FALSE))","v":"Done"}]
[{"$f":"IF(AND(B232<>\"West\",OR(A231=\"Winter FOT\",A231=\"Done\")),\"Done\",VLOOKUP(C232,'Resource Map'!$B$3:$C$509,2,FALSE))","v":"Done"}]
[{"$f":"IF(AND(B233<>\"West\",OR(A232=\"Winter FOT\",A232=\"Done\")),\"Done\",VLOOKUP(C233,'Resource Map'!$B$3:$C$509,2,FALSE))","v":"Done"}]
[{"$f":"IF(AND(B234<>\"West\",OR(A233=\"Winter FOT\",A233=\"Done\")),\"Done\",VLOOKUP(C234,'Resource Map'!$B$3:$C$509,2,FALSE))","v":"Done"}]
[{"$f":"IF(AND(B235<>\"West\",OR(A234=\"Winter FOT\",A234=\"Done\")),\"Done\",VLOOKUP(C235,'Resource Map'!$B$3:$C$509,2,FALSE))","v":"Done"}]
[{"$f":"IF(AND(B236<>\"West\",OR(A235=\"Winter FOT\",A235=\"Done\")),\"Done\",VLOOKUP(C236,'Resource Map'!$B$3:$C$509,2,FALSE))","v":"Done"}]
[{"$f":"IF(AND(B237<>\"West\",OR(A236=\"Winter FOT\",A236=\"Done\")),\"Done\",VLOOKUP(C237,'Resource Map'!$B$3:$C$509,2,FALSE))","v":"Done"}]
[{"$f":"IF(AND(B238<>\"West\",OR(A237=\"Winter FOT\",A237=\"Done\")),\"Done\",VLOOKUP(C238,'Resource Map'!$B$3:$C$509,2,FALSE))","v":"Done"}]
[{"$f":"IF(AND(B239<>\"West\",OR(A238=\"Winter FOT\",A238=\"Done\")),\"Done\",VLOOKUP(C239,'Resource Map'!$B$3:$C$509,2,FALSE))","v":"Done"}]
[{"$f":"IF(AND(B240<>\"West\",OR(A239=\"Winter FOT\",A239=\"Done\")),\"Done\",VLOOKUP(C240,'Resource Map'!$B$3:$C$509,2,FALSE))","v":"Done"}]
[{"$f":"IF(AND(B241<>\"West\",OR(A240=\"Winter FOT\",A240=\"Done\")),\"Done\",VLOOKUP(C241,'Resource Map'!$B$3:$C$509,2,FALSE))","v":"Done"}]
[{"$f":"IF(AND(B242<>\"West\",OR(A241=\"Winter FOT\",A241=\"Done\")),\"Done\",VLOOKUP(C242,'Resource Map'!$B$3:$C$509,2,FALSE))","v":"Done"}]
[{"$f":"IF(AND(B243<>\"West\",OR(A242=\"Winter FOT\",A242=\"Done\")),\"Done\",VLOOKUP(C243,'Resource Map'!$B$3:$C$509,2,FALSE))","v":"Done"}]
[{"$f":"IF(AND(B244<>\"West\",OR(A243=\"Winter FOT\",A243=\"Done\")),\"Done\",VLOOKUP(C244,'Resource Map'!$B$3:$C$509,2,FALSE))","v":"Done"}]
[{"$f":"IF(AND(B245<>\"West\",OR(A244=\"Winter FOT\",A244=\"Done\")),\"Done\",VLOOKUP(C245,'Resource Map'!$B$3:$C$509,2,FALSE))","v":"Done"}]
[{"$f":"IF(AND(B246<>\"West\",OR(A245=\"Winter FOT\",A245=\"Done\")),\"Done\",VLOOKUP(C246,'Resource Map'!$B$3:$C$509,2,FALSE))","v":"Done"}]
[{"$f":"IF(AND(B247<>\"West\",OR(A246=\"Winter FOT\",A246=\"Done\")),\"Done\",VLOOKUP(C247,'Resource Map'!$B$3:$C$509,2,FALSE))","v":"Done"}]
[{"$f":"IF(AND(B248<>\"West\",OR(A247=\"Winter FOT\",A247=\"Done\")),\"Done\",VLOOKUP(C248,'Resource Map'!$B$3:$C$509,2,FALSE))","v":"Done"}]
[{"$f":"IF(AND(B249<>\"West\",OR(A248=\"Winter FOT\",A248=\"Done\")),\"Done\",VLOOKUP(C249,'Resource Map'!$B$3:$C$509,2,FALSE))","v":"Done"}]
[{"$f":"IF(AND(B250<>\"West\",OR(A249=\"Winter FOT\",A249=\"Done\")),\"Done\",VLOOKUP(C250,'Resource Map'!$B$3:$C$509,2,FALSE))","v":"Done"}]
[{"$f":"IF(AND(B251<>\"West\",OR(A250=\"Winter FOT\",A250=\"Done\")),\"Done\",VLOOKUP(C251,'Resource Map'!$B$3:$C$509,2,FALSE))","v":"Done"}]
[{"$f":"IF(AND(B252<>\"West\",OR(A251=\"Winter FOT\",A251=\"Done\")),\"Done\",VLOOKUP(C252,'Resource Map'!$B$3:$C$509,2,FALSE))","v":"Done"}]
[{"$f":"IF(AND(B253<>\"West\",OR(A252=\"Winter FOT\",A252=\"Done\")),\"Done\",VLOOKUP(C253,'Resource Map'!$B$3:$C$509,2,FALSE))","v":"Done"}]
[{"$f":"IF(AND(B254<>\"West\",OR(A253=\"Winter FOT\",A253=\"Done\")),\"Done\",VLOOKUP(C254,'Resource Map'!$B$3:$C$509,2,FALSE))","v":"Done"}]
[{"$f":"IF(AND(B255<>\"West\",OR(A254=\"Winter FOT\",A254=\"Done\")),\"Done\",VLOOKUP(C255,'Resource Map'!$B$3:$C$509,2,FALSE))","v":"Done"}]
[{"$f":"IF(AND(B256<>\"West\",OR(A255=\"Winter FOT\",A255=\"Done\")),\"Done\",VLOOKUP(C256,'Resource Map'!$B$3:$C$509,2,FALSE))","v":"Done"}]
[{"$f":"IF(AND(B257<>\"West\",OR(A256=\"Winter FOT\",A256=\"Done\")),\"Done\",VLOOKUP(C257,'Resource Map'!$B$3:$C$509,2,FALSE))","v":"Done"}]
[{"$f":"IF(AND(B258<>\"West\",OR(A257=\"Winter FOT\",A257=\"Done\")),\"Done\",VLOOKUP(C258,'Resource Map'!$B$3:$C$509,2,FALSE))","v":"Done"}]
[{"$f":"IF(AND(B259<>\"West\",OR(A258=\"Winter FOT\",A258=\"Done\")),\"Done\",VLOOKUP(C259,'Resource Map'!$B$3:$C$509,2,FALSE))","v":"Done"}]
[{"$f":"IF(AND(B260<>\"West\",OR(A259=\"Winter FOT\",A259=\"Done\")),\"Done\",VLOOKUP(C260,'Resource Map'!$B$3:$C$509,2,FALSE))","v":"Done"}]
[{"$f":"IF(AND(B261<>\"West\",OR(A260=\"Winter FOT\",A260=\"Done\")),\"Done\",VLOOKUP(C261,'Resource Map'!$B$3:$C$509,2,FALSE))","v":"Done"}]
[{"$f":"IF(AND(B262<>\"West\",OR(A261=\"Winter FOT\",A261=\"Done\")),\"Done\",VLOOKUP(C262,'Resource Map'!$B$3:$C$509,2,FALSE))","v":"Done"}]
[{"$f":"IF(AND(B263<>\"West\",OR(A262=\"Winter FOT\",A262=\"Done\")),\"Done\",VLOOKUP(C263,'Resource Map'!$B$3:$C$509,2,FALSE))","v":"Done"}]
[{"$f":"IF(AND(B264<>\"West\",OR(A263=\"Winter FOT\",A263=\"Done\")),\"Done\",VLOOKUP(C264,'Resource Map'!$B$3:$C$509,2,FALSE))","v":"Done"}]
[{"$f":"IF(AND(B265<>\"West\",OR(A264=\"Winter FOT\",A264=\"Done\")),\"Done\",VLOOKUP(C265,'Resource Map'!$B$3:$C$509,2,FALSE))","v":"Done"}]
[{"$f":"IF(AND(B266<>\"West\",OR(A265=\"Winter FOT\",A265=\"Done\")),\"Done\",VLOOKUP(C266,'Resource Map'!$B$3:$C$509,2,FALSE))","v":"Done"}]
[{"$f":"IF(AND(B267<>\"West\",OR(A266=\"Winter FOT\",A266=\"Done\")),\"Done\",VLOOKUP(C267,'Resource Map'!$B$3:$C$509,2,FALSE))","v":"Done"}]
[{"$f":"IF(AND(B268<>\"West\",OR(A267=\"Winter FOT\",A267=\"Done\")),\"Done\",VLOOKUP(C268,'Resource Map'!$B$3:$C$509,2,FALSE))","v":"Done"}]
[{"$f":"IF(AND(B269<>\"West\",OR(A268=\"Winter FOT\",A268=\"Done\")),\"Done\",VLOOKUP(C269,'Resource Map'!$B$3:$C$509,2,FALSE))","v":"Done"}]
[{"$f":"IF(AND(B270<>\"West\",OR(A269=\"Winter FOT\",A269=\"Done\")),\"Done\",VLOOKUP(C270,'Resource Map'!$B$3:$C$509,2,FALSE))","v":"Done"}]
[{"$f":"IF(AND(B271<>\"West\",OR(A270=\"Winter FOT\",A270=\"Done\")),\"Done\",VLOOKUP(C271,'Resource Map'!$B$3:$C$509,2,FALSE))","v":"Done"}]
[{"$f":"IF(AND(B272<>\"West\",OR(A271=\"Winter FOT\",A271=\"Done\")),\"Done\",VLOOKUP(C272,'Resource Map'!$B$3:$C$509,2,FALSE))","v":"Done"}]
[{"$f":"IF(AND(B273<>\"West\",OR(A272=\"Winter FOT\",A272=\"Done\")),\"Done\",VLOOKUP(C273,'Resource Map'!$B$3:$C$509,2,FALSE))","v":"Done"}]
[{"$f":"IF(AND(B274<>\"West\",OR(A273=\"Winter FOT\",A273=\"Done\")),\"Done\",VLOOKUP(C274,'Resource Map'!$B$3:$C$509,2,FALSE))","v":"Done"}]
[{"$f":"IF(AND(B275<>\"West\",OR(A274=\"Winter FOT\",A274=\"Done\")),\"Done\",VLOOKUP(C275,'Resource Map'!$B$3:$C$509,2,FALSE))","v":"Done"}]
[{"$f":"IF(AND(B276<>\"West\",OR(A275=\"Winter FOT\",A275=\"Done\")),\"Done\",VLOOKUP(C276,'Resource Map'!$B$3:$C$509,2,FALSE))","v":"Done"}]
[{"$f":"IF(AND(B277<>\"West\",OR(A276=\"Winter FOT\",A276=\"Done\")),\"Done\",VLOOKUP(C277,'Resource Map'!$B$3:$C$509,2,FALSE))","v":"Done"}]
[{"$f":"IF(AND(B278<>\"West\",OR(A277=\"Winter FOT\",A277=\"Done\")),\"Done\",VLOOKUP(C278,'Resource Map'!$B$3:$C$509,2,FALSE))","v":"Done"}]
[{"$f":"IF(AND(B279<>\"West\",OR(A278=\"Winter FOT\",A278=\"Done\")),\"Done\",VLOOKUP(C279,'Resource Map'!$B$3:$C$509,2,FALSE))","v":"Done"}]
[{"$f":"IF(AND(B280<>\"West\",OR(A279=\"Winter FOT\",A279=\"Done\")),\"Done\",VLOOKUP(C280,'Resource Map'!$B$3:$C$509,2,FALSE))","v":"Done"}]
[{"$f":"IF(AND(B281<>\"West\",OR(A280=\"Winter FOT\",A280=\"Done\")),\"Done\",VLOOKUP(C281,'Resource Map'!$B$3:$C$509,2,FALSE))","v":"Done"}]
[{"$f":"IF(AND(B282<>\"West\",OR(A281=\"Winter FOT\",A281=\"Done\")),\"Done\",VLOOKUP(C282,'Resource Map'!$B$3:$C$509,2,FALSE))","v":"Done"}]
[{"$f":"IF(AND(B283<>\"West\",OR(A282=\"Winter FOT\",A282=\"Done\")),\"Done\",VLOOKUP(C283,'Resource Map'!$B$3:$C$509,2,FALSE))","v":"Done"}]
[{"$f":"IF(AND(B284<>\"West\",OR(A283=\"Winter FOT\",A283=\"Done\")),\"Done\",VLOOKUP(C284,'Resource Map'!$B$3:$C$509,2,FALSE))","v":"Done"}]
[{"$f":"IF(AND(B285<>\"West\",OR(A284=\"Winter FOT\",A284=\"Done\")),\"Done\",VLOOKUP(C285,'Resource Map'!$B$3:$C$509,2,FALSE))","v":"Done"}]
[{"$f":"IF(AND(B286<>\"West\",OR(A285=\"Winter FOT\",A285=\"Done\")),\"Done\",VLOOKUP(C286,'Resource Map'!$B$3:$C$509,2,FALSE))","v":"Done"}]
[{"$f":"IF(AND(B287<>\"West\",OR(A286=\"Winter FOT\",A286=\"Done\")),\"Done\",VLOOKUP(C287,'Resource Map'!$B$3:$C$509,2,FALSE))","v":"Done"}]
[{"$f":"IF(AND(B288<>\"West\",OR(A287=\"Winter FOT\",A287=\"Done\")),\"Done\",VLOOKUP(C288,'Resource Map'!$B$3:$C$509,2,FALSE))","v":"Done"}]
[{"$f":"IF(AND(B289<>\"West\",OR(A288=\"Winter FOT\",A288=\"Done\")),\"Done\",VLOOKUP(C289,'Resource Map'!$B$3:$C$509,2,FALSE))","v":"Done"}]
[{"$f":"IF(AND(B290<>\"West\",OR(A289=\"Winter FOT\",A289=\"Done\")),\"Done\",VLOOKUP(C290,'Resource Map'!$B$3:$C$509,2,FALSE))","v":"Done"}]
[{"$f":"IF(AND(B291<>\"West\",OR(A290=\"Winter FOT\",A290=\"Done\")),\"Done\",VLOOKUP(C291,'Resource Map'!$B$3:$C$509,2,FALSE))","v":"Done"}]
[{"$f":"IF(AND(B292<>\"West\",OR(A291=\"Winter FOT\",A291=\"Done\")),\"Done\",VLOOKUP(C292,'Resource Map'!$B$3:$C$509,2,FALSE))","v":"Done"}]
[{"$f":"IF(AND(B293<>\"West\",OR(A292=\"Winter FOT\",A292=\"Done\")),\"Done\",VLOOKUP(C293,'Resource Map'!$B$3:$C$509,2,FALSE))","v":"Done"}]
[{"$f":"IF(AND(B294<>\"West\",OR(A293=\"Winter FOT\",A293=\"Done\")),\"Done\",VLOOKUP(C294,'Resource Map'!$B$3:$C$509,2,FALSE))","v":"Done"}]
[{"$f":"IF(AND(B295<>\"West\",OR(A294=\"Winter FOT\",A294=\"Done\")),\"Done\",VLOOKUP(C295,'Resource Map'!$B$3:$C$509,2,FALSE))","v":"Done"}]
[{"$f":"IF(AND(B296<>\"West\",OR(A295=\"Winter FOT\",A295=\"Done\")),\"Done\",VLOOKUP(C296,'Resource Map'!$B$3:$C$509,2,FALSE))","v":"Done"}]
[{"$f":"IF(AND(B297<>\"West\",OR(A296=\"Winter FOT\",A296=\"Done\")),\"Done\",VLOOKUP(C297,'Resource Map'!$B$3:$C$509,2,FALSE))","v":"Done"}]
[{"$f":"IF(AND(B298<>\"West\",OR(A297=\"Winter FOT\",A297=\"Done\")),\"Done\",VLOOKUP(C298,'Resource Map'!$B$3:$C$509,2,FALSE))","v":"Done"}]
[{"$f":"IF(AND(B299<>\"West\",OR(A298=\"Winter FOT\",A298=\"Done\")),\"Done\",VLOOKUP(C299,'Resource Map'!$B$3:$C$509,2,FALSE))","v":"Done"}]
[{"$f":"IF(AND(B300<>\"West\",OR(A299=\"Winter FOT\",A299=\"Done\")),\"Done\",VLOOKUP(C300,'Resource Map'!$B$3:$C$509,2,FALSE))","v":"Done"}]
[{"$f":"IF(AND(B301<>\"West\",OR(A300=\"Winter FOT\",A300=\"Done\")),\"Done\",VLOOKUP(C301,'Resource Map'!$B$3:$C$509,2,FALSE))","v":"Done"}]
[{"$f":"IF(AND(B302<>\"West\",OR(A301=\"Winter FOT\",A301=\"Done\")),\"Done\",VLOOKUP(C302,'Resource Map'!$B$3:$C$509,2,FALSE))","v":"Done"}]

{"sheet":"Data Compare Pre","index":7,"n_rows":302,"n_cols":27,"rows_kept":302,"cut":false,"hidden":false,"merged":[]}
["S05-MM_",null,{"$f":"IF(IFERROR(SUM(A68:A302),\"Err\")=0,\"OK\",\"MAPPING ERRORS, left column below\")","v":"OK"},null,null,null,null,null,null,null,null,null,null,null,null,null,null,null,null,null,null,null,null,null,"Checks for","MAPPING ERRORS, left column below"]
[]
[null,null,"Coal"]
[null,null,"Incremental",2019,2020,2021,2022,2023,2024,2025,2026,2027,2028,2029,2030,2031,2032,2033,2034,2035,2036,2037,2038]
[null,null,"Coal Removed",{"$f":"SUMIF($A$69:$A$302,$C5,D$69:D$302)","v":0},-280,-387,0,0,-350.5,0,-439.3,-81.5,-903,-355.8,0,-76.599999999999994,0,0,0,0,0,-909,-702]
[]
[null,null,"Cumulative",2019,2020,2021,2022,2023,2024,2025,2026,2027,2028,2029,2030,2031,2032,2033,2034,2035,2036,2037,2038]
[null,null,"Coal Removed",{"$f":"D5","v":0},{"$f":"E5+D8","v":-280},{"$f":"F5+E8","v":-667},-667,-667,-1017.5,-1017.5,-1456.8,-1538.3,-2441.3000000000002,-2797.1000000000004,-2797.1000000000004,-2873.7000000000003,-2873.7000000000003,-2873.7000000000003,-2873.7000000000003,-2873.7000000000003,-2873.7000000000003,-3782.7000000000003,-4484.7000000000007]
[]
[null,null,"Renewable and Storage"]
[null,null,"Incremental",2019,2020,2021,2022,2023,2024,2025,2026,2027,2028,2029,2030,2031,2032,2033,2034,2035,2036,2037,2038]
[null,null,"Wind",{"$f":"SUMIF($A$69:$A$302,$C12,D$69:D$302)","v":0},0,0,0,0,1920,0,0,0,0,{"$f":"SUMIF($A$69:$A$302,$C12,N$69:N$302)","v":0},993.55200000000002,0,0,0,0,0,0,0,0]
[null,null,"Solar",0,0,0,0,0,0,0,0,0,0,0,0,0,0,0,0,0,0,0,0]
[null,null,"Wind+Bat",0,0,0,0,0,0,0,0,0,0,0,30.253,0,76.194999999999993,0,0,0,0,0,0]
[null,null,"Solar+Bat",0,0,159.23400000000001,63.747,72.825000000000003,2163.1930000000002,0,0,0,0,359.3,0,500,475,100,0,0,0,904.024,706.67600000000004]
[null,null,"Battery",0,0,0,0,0,0,0,0,0,0,0,0,0,0,0,0,0,0,0,330]
[null,null,"Pumped Storage",0,0,0,0,0,0,0,0,0,0,0,0,0,0,0,0,0,0,0,0]
[null,null,"Hydro Removed",0,-1.1000000000000001,-168.90000000000003,0,-0.7,-20.28,0,-1.4,0,-7.2,0,0,-6.4,0,0,-74.900000000000006,0,-1.2,0,0]
[null,null,"Wind Removed",0,-26.55,-16.8,-224,-0.2,-41,0,-64.5,-3,0,-93.4,-149.1,-200.2,-65,-200.9,-80,0,-70,-90,0]
[null,null,"Solar Removed",0,0,0,0,-0.5,-0.52,0,0,0,-2,0,0,-67,-48.9,0,0,-35.9,-209.10000000000002,-1024.2,-10.9]
[null,null,"Other Removed",0,0,0,0,0,0,0,0,0,0,0,0,0,0,0,-0.90700000000000003,0,0,0,-32.1]
[]
[null,null,"Cumulative",2019,2020,2021,2022,2023,2024,2025,2026,2027,2028,2029,2030,2031,2032,2033,2034,2035,2036,2037,2038,null,"Wind","Solar","Battery"]
[null,null,"Wind",{"$f":"D12","v":0},{"$f":"D24+E12","v":0},0,0,0,1920,1920,1920,1920,1920,1920,2913.5520000000001,2913.5520000000001,2913.5520000000001,2913.5520000000001,2913.5520000000001,2913.5520000000001,2913.5520000000001,2913.5520000000001,2913.5520000000001,null,{"$f":"W24+SUM(D19:W19)+W26","v":1695.3500000000001},{"$f":"W25+SUM(D20:W20)+W27","v":4104.9790000000003},{"$f":"0.25*W26+0.25*W27+W28","v":1732.6117500000003}]
[null,null,"Solar",0,0,0,0,0,0,0,0,0,0,0,0,0,0,0,0,0,0,0,0]
[null,null,"Wind+Bat",0,0,0,0,0,0,0,0,0,0,0,30.253,30.253,106.44799999999999,106.44799999999999,106.44799999999999,106.44799999999999,106.44799999999999,106.44799999999999,106.44799999999999]
[null,null,"Solar+Bat",0,0,159.23400000000001,222.98099999999999,295.80599999999998,2458.9990000000003,2458.9990000000003,2458.9990000000003,2458.9990000000003,2458.9990000000003,2818.2990000000004,2818.2990000000004,3318.2990000000004,3793.2990000000004,3893.2990000000004,3893.2990000000004,3893.2990000000004,3893.2990000000004,4797.3230000000003,5503.9990000000007]
[null,null,"Battery",0,0,0,0,0,0,0,0,0,0,0,0,0,0,0,0,0,0,0,330]
[null,null,"Pumped Storage",0,0,0,0,0,0,0,0,0,0,0,0,0,0,0,0,0,0,0,0]
[null,null,"Renewable Removed",{"$f":"D19+D20+D18+D21","v":0},{"$f":"E19+E20+E18+E21+D30","v":-27.650000000000002},{"$f":"F19+F20+F18+F21+E30","v":-213.35000000000005},-437.35,-438.75,-500.55,-500.55,-566.45000000000005,-569.45000000000005,-578.65000000000009,-672.05000000000007,-821.15000000000009,-1094.75,-1208.6500000000001,-1409.5500000000002,-1565.3570000000002,-1601.2570000000003,-1881.5570000000002,-2995.7570000000005,-3038.7570000000005]
[]
[null,null,"Gas"]
[null,null,"Incremental",2019,2020,2021,2022,2023,2024,2025,2026,2027,2028,2029,2030,2031,2032,2033,2034,2035,2036,2037,2038]
[null,null,"Gas Peaker",{"$f":"SUMIF($A$69:$A$302,$C34,D$69:D$302)","v":0},0,0,0,0,0,0,0,0,0,{"$f":"SUMIF($A$69:$A$302,$C34,N$69:N$302)","v":0},0,0,0,184.9,0,0,0,961,221.4]
[null,null,"Gas CCCT",0,0,0,0,0,0,0,0,0,0,0,0,0,0,0,0,0,0,505.2,0]
[null,null,"Gas Conv.",0,247,0,0,0,0,0,0,0,0,0,-247,0,0,0,0,0,0,0,0]
[null,null,"Gas Removed",0,0,0,0,0,0,0,0,0,0,0,0,0,0,-356.30000000000007,0,0,0,-237,0]
[]
[null,null,"Cumulative",2019,2020,2021,2022,2023,2024,2025,2026,2027,2028,2029,2030,2031,2032,2033,2034,2035,2036,2037,2038]
[null,null,"Gas Peaker",{"$f":"D34","v":0},{"$f":"D40+E34","v":0},{"$f":"E40+F34","v":0},0,0,0,0,0,0,0,0,0,0,0,184.9,184.9,184.9,184.9,1145.9000000000001,1367.3000000000002]
[null,null,"Gas CCCT",{"$f":"D35","v":0},{"$f":"D41+E35","v":0},{"$f":"E41+F35","v":0},0,0,0,0,0,0,0,0,0,0,0,0,0,0,0,505.2,505.2]
[null,null,"Gas Conv.",{"$f":"D36","v":0},{"$f":"D42+E36","v":247},{"$f":"E42+F36","v":247},247,247,247,247,247,247,247,247,0,0,0,0,0,0,0,0,0]
[null,null,"Gas Removed",{"$f":"D37","v":0},{"$f":"D43+E37","v":0},0,0,0,0,0,0,0,0,0,0,0,0,-356.30000000000007,-356.30000000000007,-356.30000000000007,-356.30000000000007,-593.30000000000007,-593.30000000000007]
[]
[null,null,"Demand-Side Management"]
[null,null,"Incremental",2019,2020,2021,2022,2023,2024,2025,2026,2027,2028,2029,2030,2031,2032,2033,2034,2035,2036,2037,2038]
[null,null,"Class 2 DSM",{"$f":"SUMIF($A$69:$A$302,$C47,D$69:D$302)","v":126},118.47,118.78000000000002,124.86000000000001,135.81,133.25000000000003,132.22,128.59,127.37,128.39999999999998,{"$f":"SUMIF($A$69:$A$302,$C47,N$69:N$302)","v":120.13999999999999},115.35,108.57,105.9,100.11000000000001,81.599999999999994,76.100000000000009,65.45,58.58,60.77]
[null,null,"Class 1 DSM",4.0599999999999996,0,7.0039999999999996,0,18.11,0,8.2110000000000003,7.1660000000000004,0,0,99.21,34.203000000000003,0,19.507000000000001,0,0,7.008,0,36.804000000000002,105.75]
[]
[null,null,"Cumulative",2019,2020,2021,2022,2023,2024,2025,2026,2027,2028,2029,2030,2031,2032,2033,2034,2035,2036,2037,2038]
[null,null,"Class 2 DSM",{"$f":"D47","v":126},{"$f":"D51+E47","v":244.47},363.25,488.11,623.92000000000007,757.17000000000007,889.3900000000001,1017.9800000000001,1145.3500000000001,1273.75,1393.8899999999999,1509.2399999999998,1617.8099999999997,1723.7099999999998,1823.8199999999997,1905.4199999999996,1981.5199999999995,2046.9699999999996,2105.5499999999997,2166.3199999999997]
[null,null,"Class 1 DSM",{"$f":"D48","v":4.0599999999999996},4.0599999999999996,11.064,11.064,29.173999999999999,29.173999999999999,37.384999999999998,44.551000000000002,44.551000000000002,44.551000000000002,143.761,177.964,177.964,197.471,197.471,197.471,204.47900000000001,204.47900000000001,241.28300000000002,347.03300000000002]
[]
[null,null,"FOTs"]
[null,null,"Incremental",2019,2020,2021,2022,2023,2024,2025,2026,2027,2028,2029,2030,2031,2032,2033,2034,2035,2036,2037,2038]
[null,null,"FOT",{"$f":"SUMIF($A$69:$A$302,$C56,D$69:D$302)","v":997.68499999999995},719.55500000000006,493.54300000000001,503.89499999999998,499.65800000000002,175.02600000000001,168.51600000000002,198.048,243.309,1105.5060000000001,1299.433,1375,1355.3240000000001,1219.9359999999999,1375,1356.0149999999999,1351.473,1363.048,1375,1362.377]
[null,null,"Winter FOT",151.42700000000002,130.923,268.41499999999996,303.28200000000004,313.94600000000003,50.143999999999998,56.543999999999997,60.296999999999997,109.849,241.696,261.63799999999998,225.95699999999999,247.19899999999998,127.506,75.488,6.915,22.234999999999999,175.01599999999999,0,0]
[]
[null,null,"Removed Capacity",{"$f":"D8+D30+D43","v":0},{"$f":"E8+E30+E43","v":-307.64999999999998},-880.35,-1104.3499999999999,-1105.75,-1518.05,-1518.05,-2023.25,-2107.75,-3019.9500000000003,-3469.1500000000005,-3618.2500000000005,-3968.4500000000003,-4082.3500000000004,-4639.55,-4795.3570000000009,-4831.2570000000005,-5111.5570000000007,-7371.7570000000005,-8116.7570000000014]
[]
[]
[]
[]
[null,"Study Name: I19-S05-MM  (09-24-19 0428 PM)"]
[null,null,null,""]
[null,null,null,"Capacity (MW)"]
[null,null,"Resource",2019,2020,2021,2022,2023,2024,2025,2026,2027,2028,2029,2030,2031,2032,2033,2034,2035,2036,2037,2038]
[{"$f":"IF(AND(B68<>\"West\",OR(A67=\"Winter FOT\",A67=\"Done\")),\"Done\",VLOOKUP(C68,'Resource Map'!$B$3:$C$509,2,FALSE))","v":"-"},"East","Existing Plant Retirements and PPA Termination"]
[{"$f":"IF(AND(B69<>\"West\",OR(A68=\"Winter FOT\",A68=\"Done\")),\"Done\",VLOOKUP(C69,'Resource Map'!$B$3:$C$509,2,FALSE))","v":"Coal Removed"},null,"Craig 1  (Coal Early Retirement/Conversions)",0,0,0,0,0,0,0,-82.3,0,0,0,0,0,0,0,0,0,0,0,0]
[{"$f":"IF(AND(B70<>\"West\",OR(A69=\"Winter FOT\",A69=\"Done\")),\"Done\",VLOOKUP(C70,'Resource Map'!$B$3:$C$509,2,FALSE))","v":"Coal Removed"},null,"Craig 2  (Coal Early Retirement/Conversions)",0,0,0,0,0,0,0,0,-81.5,0,0,0,0,0,0,0,0,0,0,0]
[{"$f":"IF(AND(B71<>\"West\",OR(A70=\"Winter FOT\",A70=\"Done\")),\"Done\",VLOOKUP(C71,'Resource Map'!$B$3:$C$509,2,FALSE))","v":"Coal Removed"},null,"Hayden 1",0,0,0,0,0,0,0,0,0,0,0,0,-43.9,0,0,0,0,0,0,0]
[{"$f":"IF(AND(B72<>\"West\",OR(A71=\"Winter FOT\",A71=\"Done\")),\"Done\",VLOOKUP(C72,'Resource Map'!$B$3:$C$509,2,FALSE))","v":"Coal Removed"},null,"Hayden 2",0,0,0,0,0,0,0,0,0,0,0,0,-32.700000000000003,0,0,0,0,0,0,0]
[{"$f":"IF(AND(B73<>\"West\",OR(A72=\"Winter FOT\",A72=\"Done\")),\"Done\",VLOOKUP(C73,'Resource Map'!$B$3:$C$509,2,FALSE))","v":"Coal Removed"},null,"Huntington 1",0,0,0,0,0,0,0,0,0,0,0,0,0,0,0,0,0,0,-459,0]
[{"$f":"IF(AND(B74<>\"West\",OR(A73=\"Winter FOT\",A73=\"Done\")),\"Done\",VLOOKUP(C74,'Resource Map'!$B$3:$C$509,2,FALSE))","v":"Coal Removed"},null,"Huntington 2",0,0,0,0,0,0,0,0,0,0,0,0,0,0,0,0,0,0,-450,0]
[{"$f":"IF(AND(B75<>\"West\",OR(A74=\"Winter FOT\",A74=\"Done\")),\"Done\",VLOOKUP(C75,'Resource Map'!$B$3:$C$509,2,FALSE))","v":"Coal Removed"},null,"Colstrip 3  (Coal Early Retirement/Conversions)",0,0,0,0,0,0,0,0,0,-74,0,0,0,0,0,0,0,0,0,0]
[{"$f":"IF(AND(B76<>\"West\",OR(A75=\"Winter FOT\",A75=\"Done\")),\"Done\",VLOOKUP(C76,'Resource Map'!$B$3:$C$509,2,FALSE))","v":"Coal Removed"},null,"Colstrip 4  (Coal Early Retirement/Conversions)",0,0,0,0,0,0,0,0,0,-74,0,0,0,0,0,0,0,0,0,0]
[{"$f":"IF(AND(B77<>\"West\",OR(A76=\"Winter FOT\",A76=\"Done\")),\"Done\",VLOOKUP(C77,'Resource Map'!$B$3:$C$509,2,FALSE))","v":"Coal Removed"},null,"Cholla 4  (Coal Early Retirement/Conversions)",0,0,-387,0,0,0,0,0,0,0,0,0,0,0,0,0,0,0,0,0]
[{"$f":"IF(AND(B78<>\"West\",OR(A77=\"Winter FOT\",A77=\"Done\")),\"Done\",VLOOKUP(C78,'Resource Map'!$B$3:$C$509,2,FALSE))","v":"Coal Removed"},null,"DaveJohnston 1",0,0,0,0,0,0,0,0,0,-99,0,0,0,0,0,0,0,0,0,0]
[{"$f":"IF(AND(B79<>\"West\",OR(A78=\"Winter FOT\",A78=\"Done\")),\"Done\",VLOOKUP(C79,'Resource Map'!$B$3:$C$509,2,FALSE))","v":"Coal Removed"},null,"DaveJohnston 2",0,0,0,0,0,0,0,0,0,-106,0,0,0,0,0,0,0,0,0,0]
[{"$f":"IF(AND(B80<>\"West\",OR(A79=\"Winter FOT\",A79=\"Done\")),\"Done\",VLOOKUP(C80,'Resource Map'!$B$3:$C$509,2,FALSE))","v":"Coal Removed"},null,"DaveJohnston 3",0,0,0,0,0,0,0,0,0,-220,0,0,0,0,0,0,0,0,0,0]
[{"$f":"IF(AND(B81<>\"West\",OR(A80=\"Winter FOT\",A80=\"Done\")),\"Done\",VLOOKUP(C81,'Resource Map'!$B$3:$C$509,2,FALSE))","v":"Coal Removed"},null,"DaveJohnston 4",0,0,0,0,0,0,0,0,0,-330,0,0,0,0,0,0,0,0,0,0]
[{"$f":"IF(AND(B82<>\"West\",OR(A81=\"Winter FOT\",A81=\"Done\")),\"Done\",VLOOKUP(C82,'Resource Map'!$B$3:$C$509,2,FALSE))","v":"Coal Removed"},null,"Naughton 1  (Coal Early Retirement/Conversions)",0,0,0,0,0,0,0,-156,0,0,0,0,0,0,0,0,0,0,0,0]
[{"$f":"IF(AND(B83<>\"West\",OR(A82=\"Winter FOT\",A82=\"Done\")),\"Done\",VLOOKUP(C83,'Resource Map'!$B$3:$C$509,2,FALSE))","v":"Coal Removed"},null,"Naughton 2  (Coal Early Retirement/Conversions)",0,0,0,0,0,0,0,-201,0,0,0,0,0,0,0,0,0,0,0,0]
[{"$f":"IF(AND(B84<>\"West\",OR(A83=\"Winter FOT\",A83=\"Done\")),\"Done\",VLOOKUP(C84,'Resource Map'!$B$3:$C$509,2,FALSE))","v":"Coal Removed"},null,"Naughton 3  (Coal Early Retirement/Conversions)",0,-280,0,0,0,0,0,0,0,0,0,0,0,0,0,0,0,0,0,0]
[{"$f":"IF(AND(B85<>\"West\",OR(A84=\"Winter FOT\",A84=\"Done\")),\"Done\",VLOOKUP(C85,'Resource Map'!$B$3:$C$509,2,FALSE))","v":"Gas Removed"},null,"Gadsby 1-6",0,0,0,0,0,0,0,0,0,0,0,0,0,0,-356.30000000000007,0,0,0,0,0]
[{"$f":"IF(AND(B86<>\"West\",OR(A85=\"Winter FOT\",A85=\"Done\")),\"Done\",VLOOKUP(C86,'Resource Map'!$B$3:$C$509,2,FALSE))","v":"Hydro Removed"},null,"Retire - Hydro",0,0,0,0,0,-20.28,0,0,0,0,0,0,0,0,0,0,0,0,0,0]
[{"$f":"IF(AND(B87<>\"West\",OR(A86=\"Winter FOT\",A86=\"Done\")),\"Done\",VLOOKUP(C87,'Resource Map'!$B$3:$C$509,2,FALSE))","v":"Wind Removed"},null,"Retire - Wind",0,0,0,0,0,0,0,0,0,0,0,-40.200000000000003,0,0,0,0,0,0,0,0]
[{"$f":"IF(AND(B88<>\"West\",OR(A87=\"Winter FOT\",A87=\"Done\")),\"Done\",VLOOKUP(C88,'Resource Map'!$B$3:$C$509,2,FALSE))","v":"Wind Removed"},null,"Expire - Wind PPA",0,-26.55,-16.8,-49,-0.2,0,0,-64.5,-3,0,-18.899999999999999,-99,-200.2,-45,-180.9,-80,0,-60,-80,0]
[{"$f":"IF(AND(B89<>\"West\",OR(A88=\"Winter FOT\",A88=\"Done\")),\"Done\",VLOOKUP(C89,'Resource Map'!$B$3:$C$509,2,FALSE))","v":"Solar Removed"},null,"Expire - Solar PPA",0,0,0,0,-0.5,-0.52,0,0,0,0,0,0,0,0,0,0,-35.1,-94.100000000000009,-849,0]
[{"$f":"IF(AND(B90<>\"West\",OR(A89=\"Winter FOT\",A89=\"Done\")),\"Done\",VLOOKUP(C90,'Resource Map'!$B$3:$C$509,2,FALSE))","v":"Other Removed"},null,"Retire - Other",0,0,0,0,0,0,0,0,0,0,0,0,0,0,0,-0.90700000000000003,0,0,0,-32.1]
[{"$f":"IF(AND(B91<>\"West\",OR(A90=\"Winter FOT\",A90=\"Done\")),\"Done\",VLOOKUP(C91,'Resource Map'!$B$3:$C$509,2,FALSE))","v":"Gas Conv."},null,"Coal Ret_WY - Gas RePower",0,247,0,0,0,0,0,0,0,0,0,-247,0,0,0,0,0,0,0,0]
[{"$f":"IF(AND(B92<>\"West\",OR(A91=\"Winter FOT\",A91=\"Done\")),\"Done\",VLOOKUP(C92,'Resource Map'!$B$3:$C$509,2,FALSE))","v":"-"},null,"Expansion Resources"]
[{"$f":"IF(AND(B93<>\"West\",OR(A92=\"Winter FOT\",A92=\"Done\")),\"Done\",VLOOKUP(C93,'Resource Map'!$B$3:$C$509,2,FALSE))","v":"Gas CCCT"},null,"CCCT - DJohns - J 1x1",0,0,0,0,0,0,0,0,0,0,0,0,0,0,0,0,0,0,505.2,0]
[{"$f":"IF(AND(B94<>\"West\",OR(A93=\"Winter FOT\",A93=\"Done\")),\"Done\",VLOOKUP(C94,'Resource Map'!$B$3:$C$509,2,FALSE))","v":"-"},null,"Total CCCT",0,0,0,0,0,0,0,0,0,0,0,0,0,0,0,0,0,0,505.2,0]
[{"$f":"IF(AND(B95<>\"West\",OR(A94=\"Winter FOT\",A94=\"Done\")),\"Done\",VLOOKUP(C95,'Resource Map'!$B$3:$C$509,2,FALSE))","v":"Gas Peaker"},null,"SCCT Frame NTN",0,0,0,0,0,0,0,0,0,0,0,0,0,0,184.9,0,0,0,369.8,0]
[{"$f":"IF(AND(B96<>\"West\",OR(A95=\"Winter FOT\",A95=\"Done\")),\"Done\",VLOOKUP(C96,'Resource Map'!$B$3:$C$509,2,FALSE))","v":"Gas Peaker"},null,"SCCT Frame WYSW",0,0,0,0,0,0,0,0,0,0,0,0,0,0,0,0,0,0,369.8,0]
[{"$f":"IF(AND(B97<>\"West\",OR(A96=\"Winter FOT\",A96=\"Done\")),\"Done\",VLOOKUP(C97,'Resource Map'!$B$3:$C$509,2,FALSE))","v":"-"},null,"Total SCCT",0,0,0,0,0,0,0,0,0,0,0,0,0,0,184.9,0,0,0,739.6,0]
[{"$f":"IF(AND(B98<>\"West\",OR(A97=\"Winter FOT\",A97=\"Done\")),\"Done\",VLOOKUP(C98,'Resource Map'!$B$3:$C$509,2,FALSE))","v":"Wind"},null,"Wind, GO",0,0,0,0,0,0,0,0,0,0,0,993.55200000000002,0,0,0,0,0,0,0,0]
[{"$f":"IF(AND(B99<>\"West\",OR(A98=\"Winter FOT\",A98=\"Done\")),\"Done\",VLOOKUP(C99,'Resource Map'!$B$3:$C$509,2,FALSE))","v":"Wind"},null,"Wind, WYAE",0,0,0,0,0,1920,0,0,0,0,0,0,0,0,0,0,0,0,0,0]
[{"$f":"IF(AND(B100<>\"West\",OR(A99=\"Winter FOT\",A99=\"Done\")),\"Done\",VLOOKUP(C100,'Resource Map'!$B$3:$C$509,2,FALSE))","v":"Wind+Bat"},null,"Wind+Storage, GO",0,0,0,0,0,0,0,0,0,0,0,30.253,0,76.194999999999993,0,0,0,0,0,0]
[{"$f":"IF(AND(B101<>\"West\",OR(A100=\"Winter FOT\",A100=\"Done\")),\"Done\",VLOOKUP(C101,'Resource Map'!$B$3:$C$509,2,FALSE))","v":"-"},null,"Total Wind",0,0,0,0,0,1920,0,0,0,0,0,1023.8050000000001,0,76.194999999999993,0,0,0,0,0,0]
[{"$f":"IF(AND(B102<>\"West\",OR(A101=\"Winter FOT\",A101=\"Done\")),\"Done\",VLOOKUP(C102,'Resource Map'!$B$3:$C$509,2,FALSE))","v":"Solar+Bat"},null,"Utility Solar+Storage - PV - Utah-S",0,0,0,0,0,300,0,0,0,0,0,0,500,0,0,0,0,0,0,0]
[{"$f":"IF(AND(B103<>\"West\",OR(A102=\"Winter FOT\",A102=\"Done\")),\"Done\",VLOOKUP(C103,'Resource Map'!$B$3:$C$509,2,FALSE))","v":"Solar+Bat"},null,"Utility Solar+Storage - PV - WYSW",0,0,0,0,0,0,0,0,0,0,0,0,0,0,100,0,0,0,0,0]
[{"$f":"IF(AND(B104<>\"West\",OR(A103=\"Winter FOT\",A103=\"Done\")),\"Done\",VLOOKUP(C104,'Resource Map'!$B$3:$C$509,2,FALSE))","v":"Solar+Bat"},null,"Utility Solar+Storage - PV - Huntington",0,0,0,0,0,0,0,0,0,0,0,0,0,0,0,0,0,0,904.024,4.976]
[{"$f":"IF(AND(B105<>\"West\",OR(A104=\"Winter FOT\",A104=\"Done\")),\"Done\",VLOOKUP(C105,'Resource Map'!$B$3:$C$509,2,FALSE))","v":"Solar+Bat"},null,"Utility Solar+Storage - PV - Utah-N",0,0,159.23400000000001,63.747,72.825000000000003,604.19299999999998,0,0,0,0,0,0,0,0,0,0,0,0,0,0]
[{"$f":"IF(AND(B106<>\"West\",OR(A105=\"Winter FOT\",A105=\"Done\")),\"Done\",VLOOKUP(C106,'Resource Map'!$B$3:$C$509,2,FALSE))","v":"-"},null,"Total Solar",0,0,159.23400000000001,63.747,72.825000000000003,904.19299999999998,0,0,0,0,0,0,500,0,100,0,0,0,904.024,4.976]
[{"$f":"IF(AND(B107<>\"West\",OR(A106=\"Winter FOT\",A106=\"Done\")),\"Done\",VLOOKUP(C107,'Resource Map'!$B$3:$C$509,2,FALSE))","v":"Class 1 DSM"},null,"Demand Response, ID-3rd Party Contracts",0,0,0,0,0,0,0,0,0,0,0,0,0,0,0,0,0,0,0,1.827]
[{"$f":"IF(AND(B108<>\"West\",OR(A107=\"Winter FOT\",A107=\"Done\")),\"Done\",VLOOKUP(C108,'Resource Map'!$B$3:$C$509,2,FALSE))","v":"Class 1 DSM"},null,"Demand Response, ID-Irrigate",0,0,0,0,0,0,0,0,0,0,0,0,0,5.1520000000000001,0,0,0,0,3.6539999999999999,1.7889999999999999]
[{"$f":"IF(AND(B109<>\"West\",OR(A108=\"Winter FOT\",A108=\"Done\")),\"Done\",VLOOKUP(C109,'Resource Map'!$B$3:$C$509,2,FALSE))","v":"Class 1 DSM"},null,"Demand Response, UT-Cool/WH",4.0599999999999996,0,7.0039999999999996,0,9.8580000000000005,0,0,7.1660000000000004,0,0,6.6929999999999996,0,0,6.843,0,0,7.008,0,0,7.2370000000000001]
[{"$f":"IF(AND(B110<>\"West\",OR(A109=\"Winter FOT\",A109=\"Done\")),\"Done\",VLOOKUP(C110,'Resource Map'!$B$3:$C$509,2,FALSE))","v":"Class 1 DSM"},null,"Demand Response, UT-3rd Party Contracts",0,0,0,0,0,0,0,0,0,0,0,0,0,0,0,0,0,0,0,48.394999999999996]
[{"$f":"IF(AND(B111<>\"West\",OR(A110=\"Winter FOT\",A110=\"Done\")),\"Done\",VLOOKUP(C111,'Resource Map'!$B$3:$C$509,2,FALSE))","v":"Class 1 DSM"},null,"Demand Response, UT-Irrigate",0,0,0,0,0,0,0,0,0,0,0,0,0,0,0,0,0,0,0,1.927]
[{"$f":"IF(AND(B112<>\"West\",OR(A111=\"Winter FOT\",A111=\"Done\")),\"Done\",VLOOKUP(C112,'Resource Map'!$B$3:$C$509,2,FALSE))","v":"Class 1 DSM"},null,"Demand Response, UT-Thermostat",0,0,0,0,0,0,0,0,0,0,92.516999999999996,32.352000000000004,0,0,0,0,0,0,8.3350000000000009,5.1180000000000003]
[{"$f":"IF(AND(B113<>\"West\",OR(A112=\"Winter FOT\",A112=\"Done\")),\"Done\",VLOOKUP(C113,'Resource Map'!$B$3:$C$509,2,FALSE))","v":"Class 1 DSM"},null,"Demand Response, WY-3rd Party Contracts",0,0,0,0,0,0,0,0,0,0,0,0,0,0,0,0,0,0,0,2.0499999999999998]
[{"$f":"IF(AND(B114<>\"West\",OR(A113=\"Winter FOT\",A113=\"Done\")),\"Done\",VLOOKUP(C114,'Resource Map'!$B$3:$C$509,2,FALSE))","v":"Class 1 DSM"},null,"Demand Response, WY-Irrigate",0,0,0,0,0,0,0,0,0,0,0,0,0,0,0,0,0,0,0,1.7569999999999999]
[{"$f":"IF(AND(B115<>\"West\",OR(A114=\"Winter FOT\",A114=\"Done\")),\"Done\",VLOOKUP(C115,'Resource Map'!$B$3:$C$509,2,FALSE))","v":"Class 1 DSM"},null,"Demand Response, WY-Thermostat",0,0,0,0,0,0,0,0,0,0,0,0,0,0,0,0,0,0,0,19.920999999999999]
[{"$f":"IF(AND(B116<>\"West\",OR(A115=\"Winter FOT\",A115=\"Done\")),\"Done\",VLOOKUP(C116,'Resource Map'!$B$3:$C$509,2,FALSE))","v":"Class 1 DSM"},null,"Demand Response, UT-Ancillary Services",0,0,0,0,8.2520000000000007,0,5.2530000000000001,0,0,0,0,0,0,0,0,0,0,0,3.2410000000000001,0]
[{"$f":"IF(AND(B117<>\"West\",OR(A116=\"Winter FOT\",A116=\"Done\")),\"Done\",VLOOKUP(C117,'Resource Map'!$B$3:$C$509,2,FALSE))","v":"Class 1 DSM"},null,"Demand Response, WY-Ancillary Services",0,0,0,0,0,0,2.9580000000000002,0,0,0,0,0,0,0,0,0,0,0,0,0]
[{"$f":"IF(AND(B118<>\"West\",OR(A117=\"Winter FOT\",A117=\"Done\")),\"Done\",VLOOKUP(C118,'Resource Map'!$B$3:$C$509,2,FALSE))","v":"-"},null,"Demand Response Total",4.0599999999999996,0,7.0039999999999996,0,18.11,0,8.2110000000000003,7.1660000000000004,0,0,99.21,32.352000000000004,0,11.995000000000001,0,0,7.008,0,15.23,90.020999999999987]
[{"$f":"IF(AND(B119<>\"West\",OR(A118=\"Winter FOT\",A118=\"Done\")),\"Done\",VLOOKUP(C119,'Resource Map'!$B$3:$C$509,2,FALSE))","v":"Class 2 DSM"},null,"Energy Efficiency, ID",6,5.25,5.3400000000000007,5.58,7.03,6.92,6.89,6.84,6.73,6.92,6.45,6.23,5.9499999999999993,5.86,5.58,4.42,4.0200000000000005,3.2700000000000005,2.9600000000000004,2.98]
[{"$f":"IF(AND(B120<>\"West\",OR(A119=\"Winter FOT\",A119=\"Done\")),\"Done\",VLOOKUP(C120,'Resource Map'!$B$3:$C$509,2,FALSE))","v":"Class 2 DSM"},null,"Energy Efficiency, UT",58,60.5,60.300000000000011,60.4,68.800000000000011,66.300000000000011,65,62.5,59.400000000000006,57.1,54.2,53.2,50,49.900000000000006,48.7,35.9,32.4,24.6,21.9,25.100000000000005]
[{"$f":"IF(AND(B121<>\"West\",OR(A120=\"Winter FOT\",A120=\"Done\")),\"Done\",VLOOKUP(C121,'Resource Map'!$B$3:$C$509,2,FALSE))","v":"Class 2 DSM"},null,"Energy Efficiency, WY",10,10.17,10.990000000000002,12.010000000000002,13.330000000000002,14.040000000000001,16.47,16.670000000000002,16.57,15.85,15.350000000000001,14.44,12.76,12.05,11.21,8.7899999999999991,8.18,7.0900000000000007,5.19,5.33]
[{"$f":"IF(AND(B122<>\"West\",OR(A121=\"Winter FOT\",A121=\"Done\")),\"Done\",VLOOKUP(C122,'Resource Map'!$B$3:$C$509,2,FALSE))","v":"-"},null,"Energy Efficiency Total",74,75.92,76.630000000000024,77.990000000000009,89.160000000000011,87.260000000000019,88.36,86.01,82.700000000000017,79.86999999999999,76,73.87,68.710000000000008,67.81,65.490000000000009,49.11,44.6,34.96,30.05,33.410000000000004]
[{"$f":"IF(AND(B123<>\"West\",OR(A122=\"Winter FOT\",A122=\"Done\")),\"Done\",VLOOKUP(C123,'Resource Map'!$B$3:$C$509,2,FALSE))","v":"FOT"},null,"FOT East - Summer",0,0,0,0,0,0,0,0,0,30.506,224.43299999999999,300,280.32400000000001,144.93600000000001,300,281.01499999999999,300,300,300,300]
[{"$f":"IF(AND(B124<>\"West\",OR(A123=\"Winter FOT\",A123=\"Done\")),\"Done\",VLOOKUP(C124,'Resource Map'!$B$3:$C$509,2,FALSE))","v":"-"},"West","Existing Plant Retirements and PPA Termination"]
[{"$f":"IF(AND(B125<>\"West\",OR(A124=\"Winter FOT\",A124=\"Done\")),\"Done\",VLOOKUP(C125,'Resource Map'!$B$3:$C$509,2,FALSE))","v":"Coal Removed"},null,"JimBridger 1  (Coal Early Retirement/Conversions)",0,0,0,0,0,-350.5,0,0,0,0,0,0,0,0,0,0,0,0,0,0]
[{"$f":"IF(AND(B126<>\"West\",OR(A125=\"Winter FOT\",A125=\"Done\")),\"Done\",VLOOKUP(C126,'Resource Map'!$B$3:$C$509,2,FALSE))","v":"Coal Removed"},null,"JimBridger 2  (Coal Early Retirement/Conversions)",0,0,0,0,0,0,0,0,0,0,-355.8,0,0,0,0,0,0,0,0,0]
[{"$f":"IF(AND(B127<>\"West\",OR(A126=\"Winter FOT\",A126=\"Done\")),\"Done\",VLOOKUP(C127,'Resource Map'!$B$3:$C$509,2,FALSE))","v":"Coal Removed"},null,"JimBridger 3",0,0,0,0,0,0,0,0,0,0,0,0,0,0,0,0,0,0,0,-348.7]
[{"$f":"IF(AND(B128<>\"West\",OR(A127=\"Winter FOT\",A127=\"Done\")),\"Done\",VLOOKUP(C128,'Resource Map'!$B$3:$C$509,2,FALSE))","v":"Coal Removed"},null,"JimBridger 4",0,0,0,0,0,0,0,0,0,0,0,0,0,0,0,0,0,0,0,-353.3]
[{"$f":"IF(AND(B129<>\"West\",OR(A128=\"Winter FOT\",A128=\"Done\")),\"Done\",VLOOKUP(C129,'Resource Map'!$B$3:$C$509,2,FALSE))","v":"Gas Removed"},null,"Hermiston",0,0,0,0,0,0,0,0,0,0,0,0,0,0,0,0,0,0,-237,0]
[{"$f":"IF(AND(B130<>\"West\",OR(A129=\"Winter FOT\",A129=\"Done\")),\"Done\",VLOOKUP(C130,'Resource Map'!$B$3:$C$509,2,FALSE))","v":"Hydro Removed"},null,"Retire - Hydro",0,-1.1000000000000001,-168.90000000000003,0,-0.7,0,0,-1.4,0,-7.2,0,0,-6.4,0,0,-74.900000000000006,0,-1.2,0,0]
[{"$f":"IF(AND(B131<>\"West\",OR(A130=\"Winter FOT\",A130=\"Done\")),\"Done\",VLOOKUP(C131,'Resource Map'!$B$3:$C$509,2,FALSE))","v":"Wind Removed"},null,"Expire - Wind PPA",0,0,0,-175,0,-41,0,0,0,0,-74.5,-9.9,0,-20,-20,0,0,-10,-10,0]
[{"$f":"IF(AND(B132<>\"West\",OR(A131=\"Winter FOT\",A131=\"Done\")),\"Done\",VLOOKUP(C132,'Resource Map'!$B$3:$C$509,2,FALSE))","v":"Solar Removed"},null,"Expire - Solar PPA",0,0,0,0,0,0,0,0,0,-2,0,0,-67,-48.9,0,0,-0.8,-115,-175.20000000000002,-10.9]
[{"$f":"IF(AND(B133<>\"West\",OR(A132=\"Winter FOT\",A132=\"Done\")),\"Done\",VLOOKUP(C133,'Resource Map'!$B$3:$C$509,2,FALSE))","v":"-"},null,"Expansion Resources"]
[{"$f":"IF(AND(B134<>\"West\",OR(A133=\"Winter FOT\",A133=\"Done\")),\"Done\",VLOOKUP(C134,'Resource Map'!$B$3:$C$509,2,FALSE))","v":"Gas Peaker"},null,"SCCT Frame WV",0,0,0,0,0,0,0,0,0,0,0,0,0,0,0,0,0,0,221.4,221.4]
[{"$f":"IF(AND(B135<>\"West\",OR(A134=\"Winter FOT\",A134=\"Done\")),\"Done\",VLOOKUP(C135,'Resource Map'!$B$3:$C$509,2,FALSE))","v":"-"},null,"Total SCCT",0,0,0,0,0,0,0,0,0,0,0,0,0,0,0,0,0,0,221.4,221.4]
[{"$f":"IF(AND(B136<>\"West\",OR(A135=\"Winter FOT\",A135=\"Done\")),\"Done\",VLOOKUP(C136,'Resource Map'!$B$3:$C$509,2,FALSE))","v":"Solar+Bat"},null,"Utility Solar+Storage - PV - Jbridger",0,0,0,0,0,354,0,0,0,0,359.3,0,0,0,0,0,0,0,0,701.7]
[{"$f":"IF(AND(B137<>\"West\",OR(A136=\"Winter FOT\",A136=\"Done\")),\"Done\",VLOOKUP(C137,'Resource Map'!$B$3:$C$509,2,FALSE))","v":"Solar+Bat"},null,"Utility Solar+Storage - PV - S-Oregon",0,0,0,0,0,500,0,0,0,0,0,0,0,475,0,0,0,0,0,0]
[{"$f":"IF(AND(B138<>\"West\",OR(A137=\"Winter FOT\",A137=\"Done\")),\"Done\",VLOOKUP(C138,'Resource Map'!$B$3:$C$509,2,FALSE))","v":"Solar+Bat"},null,"Utility Solar+Storage - PV - Yakima",0,0,0,0,0,405,0,0,0,0,0,0,0,0,0,0,0,0,0,0]
[{"$f":"IF(AND(B139<>\"West\",OR(A138=\"Winter FOT\",A138=\"Done\")),\"Done\",VLOOKUP(C139,'Resource Map'!$B$3:$C$509,2,FALSE))","v":"-"},null,"Total Solar",0,0,0,0,0,1259,0,0,0,0,359.3,0,0,475,0,0,0,0,0,701.7]
[{"$f":"IF(AND(B140<>\"West\",OR(A139=\"Winter FOT\",A139=\"Done\")),\"Done\",VLOOKUP(C140,'Resource Map'!$B$3:$C$509,2,FALSE))","v":"Class 1 DSM"},null,"Demand Response, OR-Ancillary Services",0,0,0,0,0,0,0,0,0,0,0,0,0,7.5119999999999996,0,0,0,0,0,0]
[{"$f":"IF(AND(B141<>\"West\",OR(A140=\"Winter FOT\",A140=\"Done\")),\"Done\",VLOOKUP(C141,'Resource Map'!$B$3:$C$509,2,FALSE))","v":"Class 1 DSM"},null,"Demand Response, WA-Ancillary Services",0,0,0,0,0,0,0,0,0,0,0,1.851,0,0,0,0,0,0,0,0]
[{"$f":"IF(AND(B142<>\"West\",OR(A141=\"Winter FOT\",A141=\"Done\")),\"Done\",VLOOKUP(C142,'Resource Map'!$B$3:$C$509,2,FALSE))","v":"Class 1 DSM"},null,"Demand Response, OR-Cool/WH",0,0,0,0,0,0,0,0,0,0,0,0,0,0,0,0,0,0,0,3.0270000000000001]
[{"$f":"IF(AND(B143<>\"West\",OR(A142=\"Winter FOT\",A142=\"Done\")),\"Done\",VLOOKUP(C143,'Resource Map'!$B$3:$C$509,2,FALSE))","v":"Class 1 DSM"},null,"Demand Response, OR-3rd Party Contracts",0,0,0,0,0,0,0,0,0,0,0,0,0,0,0,0,0,0,0,7.3940000000000001]
[{"$f":"IF(AND(B144<>\"West\",OR(A143=\"Winter FOT\",A143=\"Done\")),\"Done\",VLOOKUP(C144,'Resource Map'!$B$3:$C$509,2,FALSE))","v":"Class 1 DSM"},null,"Demand Response, OR-Irrigate",0,0,0,0,0,0,0,0,0,0,0,0,0,0,0,0,0,0,13.267999999999999,0]
[{"$f":"IF(AND(B145<>\"West\",OR(A144=\"Winter FOT\",A144=\"Done\")),\"Done\",VLOOKUP(C145,'Resource Map'!$B$3:$C$509,2,FALSE))","v":"Class 1 DSM"},null,"Demand Response, WA-Irrigate",0,0,0,0,0,0,0,0,0,0,0,0,0,0,0,0,0,0,8.3060000000000009,0]
[{"$f":"IF(AND(B146<>\"West\",OR(A145=\"Winter FOT\",A145=\"Done\")),\"Done\",VLOOKUP(C146,'Resource Map'!$B$3:$C$509,2,FALSE))","v":"Class 1 DSM"},null,"Demand Response, WA-Thermostat",0,0,0,0,0,0,0,0,0,0,0,0,0,0,0,0,0,0,0,5.3079999999999998]
[{"$f":"IF(AND(B147<>\"West\",OR(A146=\"Winter FOT\",A146=\"Done\")),\"Done\",VLOOKUP(C147,'Resource Map'!$B$3:$C$509,2,FALSE))","v":"-"},null,"Demand Response  Total",0,0,0,0,0,0,0,0,0,0,0,1.851,0,7.5119999999999996,0,0,0,0,21.573999999999998,15.728999999999999]
[{"$f":"IF(AND(B148<>\"West\",OR(A147=\"Winter FOT\",A147=\"Done\")),\"Done\",VLOOKUP(C148,'Resource Map'!$B$3:$C$509,2,FALSE))","v":"Class 2 DSM"},null,"Energy Efficiency, CA",1,1.5,1.41,1.48,1.74,1.73,1.7599999999999998,1.81,1.8199999999999998,1.92,1.8900000000000001,1.8800000000000003,1.82,1.76,1.6600000000000001,1.3,1.4100000000000001,1.17,0.98000000000000009,0.83000000000000007]
[{"$f":"IF(AND(B149<>\"West\",OR(A148=\"Winter FOT\",A148=\"Done\")),\"Done\",VLOOKUP(C149,'Resource Map'!$B$3:$C$509,2,FALSE))","v":"Class 2 DSM"},null,"Energy Efficiency, OR",40,31.800000000000004,31.3,35.700000000000003,34,33.5,31.3,30.3,32.799999999999997,36.5,32.9,30.599999999999998,29.6,28.5,25.5,25.5,24.400000000000002,24.6,23.5,22.700000000000003]
[{"$f":"IF(AND(B150<>\"West\",OR(A149=\"Winter FOT\",A149=\"Done\")),\"Done\",VLOOKUP(C150,'Resource Map'!$B$3:$C$509,2,FALSE))","v":"Class 2 DSM"},null,"Energy Efficiency, WA",11,9.2500000000000018,9.4400000000000013,9.69,10.910000000000002,10.76,10.799999999999999,10.469999999999999,10.050000000000001,10.109999999999998,9.35,9.0000000000000018,8.44,7.8299999999999992,7.4600000000000017,5.6900000000000013,5.6899999999999995,4.7200000000000015,4.0500000000000007,3.83]
[{"$f":"IF(AND(B151<>\"West\",OR(A150=\"Winter FOT\",A150=\"Done\")),\"Done\",VLOOKUP(C151,'Resource Map'!$B$3:$C$509,2,FALSE))","v":"-"},null,"Energy Efficiency  Total",52,42.550000000000004,42.150000000000006,46.87,46.650000000000006,45.989999999999995,43.86,42.58,44.67,48.53,44.14,41.48,39.86,38.090000000000003,34.620000000000005,32.49,31.5,30.490000000000006,28.53,27.36]
[{"$f":"IF(AND(B152<>\"West\",OR(A151=\"Winter FOT\",A151=\"Done\")),\"Done\",VLOOKUP(C152,'Resource Map'!$B$3:$C$509,2,FALSE))","v":"Battery"},null,"Battery Storage - Portland NC",0,0,0,0,0,0,0,0,0,0,0,0,0,0,0,0,0,0,0,45]
[{"$f":"IF(AND(B153<>\"West\",OR(A152=\"Winter FOT\",A152=\"Done\")),\"Done\",VLOOKUP(C153,'Resource Map'!$B$3:$C$509,2,FALSE))","v":"Battery"},null,"Battery Storage - Walla Walla",0,0,0,0,0,0,0,0,0,0,0,0,0,0,0,0,0,0,0,180]
[{"$f":"IF(AND(B154<>\"West\",OR(A153=\"Winter FOT\",A153=\"Done\")),\"Done\",VLOOKUP(C154,'Resource Map'!$B$3:$C$509,2,FALSE))","v":"Battery"},null,"Battery Storage - Yakima",0,0,0,0,0,0,0,0,0,0,0,0,0,0,0,0,0,0,0,105]
[{"$f":"IF(AND(B155<>\"West\",OR(A154=\"Winter FOT\",A154=\"Done\")),\"Done\",VLOOKUP(C155,'Resource Map'!$B$3:$C$509,2,FALSE))","v":"FOT"},null,"FOT West - Summer",997.68499999999995,719.55500000000006,493.54300000000001,503.89499999999998,499.65800000000002,175.02600000000001,168.51600000000002,198.048,243.309,1075,1075,1075,1075,1075,1075,1075,1051.473,1063.048,1075,1062.377]
[{"$f":"IF(AND(B156<>\"West\",OR(A155=\"Winter FOT\",A155=\"Done\")),\"Done\",VLOOKUP(C156,'Resource Map'!$B$3:$C$509,2,FALSE))","v":"Winter FOT"},null,"FOT West - Winter",151.42700000000002,130.923,268.41499999999996,303.28200000000004,313.94600000000003,50.143999999999998,56.543999999999997,60.296999999999997,109.849,241.696,261.63799999999998,225.95699999999999,247.19899999999998,127.506,75.488,6.915,22.234999999999999,175.01599999999999,0,0]
[{"$f":"IF(AND(B157<>\"West\",OR(A156=\"Winter FOT\",A156=\"Done\")),\"Done\",VLOOKUP(C157,'Resource Map'!$B$3:$C$509,2,FALSE))","v":"Done"}]
[{"$f":"IF(AND(B158<>\"West\",OR(A157=\"Winter FOT\",A157=\"Done\")),\"Done\",VLOOKUP(C158,'Resource Map'!$B$3:$C$509,2,FALSE))","v":"Done"}]
[{"$f":"IF(AND(B159<>\"West\",OR(A158=\"Winter FOT\",A158=\"Done\")),\"Done\",VLOOKUP(C159,'Resource Map'!$B$3:$C$509,2,FALSE))","v":"Done"}]
[{"$f":"IF(AND(B160<>\"West\",OR(A159=\"Winter FOT\",A159=\"Done\")),\"Done\",VLOOKUP(C160,'Resource Map'!$B$3:$C$509,2,FALSE))","v":"Done"}]
[{"$f":"IF(AND(B161<>\"West\",OR(A160=\"Winter FOT\",A160=\"Done\")),\"Done\",VLOOKUP(C161,'Resource Map'!$B$3:$C$509,2,FALSE))","v":"Done"}]
[{"$f":"IF(AND(B162<>\"West\",OR(A161=\"Winter FOT\",A161=\"Done\")),\"Done\",VLOOKUP(C162,'Resource Map'!$B$3:$C$509,2,FALSE))","v":"Done"}]
[{"$f":"IF(AND(B163<>\"West\",OR(A162=\"Winter FOT\",A162=\"Done\")),\"Done\",VLOOKUP(C163,'Resource Map'!$B$3:$C$509,2,FALSE))","v":"Done"}]
[{"$f":"IF(AND(B164<>\"West\",OR(A163=\"Winter FOT\",A163=\"Done\")),\"Done\",VLOOKUP(C164,'Resource Map'!$B$3:$C$509,2,FALSE))","v":"Done"}]
[{"$f":"IF(AND(B165<>\"West\",OR(A164=\"Winter FOT\",A164=\"Done\")),\"Done\",VLOOKUP(C165,'Resource Map'!$B$3:$C$509,2,FALSE))","v":"Done"}]
[{"$f":"IF(AND(B166<>\"West\",OR(A165=\"Winter FOT\",A165=\"Done\")),\"Done\",VLOOKUP(C166,'Resource Map'!$B$3:$C$509,2,FALSE))","v":"Done"}]
[{"$f":"IF(AND(B167<>\"West\",OR(A166=\"Winter FOT\",A166=\"Done\")),\"Done\",VLOOKUP(C167,'Resource Map'!$B$3:$C$509,2,FALSE))","v":"Done"}]
[{"$f":"IF(AND(B168<>\"West\",OR(A167=\"Winter FOT\",A167=\"Done\")),\"Done\",VLOOKUP(C168,'Resource Map'!$B$3:$C$509,2,FALSE))","v":"Done"}]
[{"$f":"IF(AND(B169<>\"West\",OR(A168=\"Winter FOT\",A168=\"Done\")),\"Done\",VLOOKUP(C169,'Resource Map'!$B$3:$C$509,2,FALSE))","v":"Done"}]
[{"$f":"IF(AND(B170<>\"West\",OR(A169=\"Winter FOT\",A169=\"Done\")),\"Done\",VLOOKUP(C170,'Resource Map'!$B$3:$C$509,2,FALSE))","v":"Done"}]
[{"$f":"IF(AND(B171<>\"West\",OR(A170=\"Winter FOT\",A170=\"Done\")),\"Done\",VLOOKUP(C171,'Resource Map'!$B$3:$C$509,2,FALSE))","v":"Done"}]
[{"$f":"IF(AND(B172<>\"West\",OR(A171=\"Winter FOT\",A171=\"Done\")),\"Done\",VLOOKUP(C172,'Resource Map'!$B$3:$C$509,2,FALSE))","v":"Done"}]
[{"$f":"IF(AND(B173<>\"West\",OR(A172=\"Winter FOT\",A172=\"Done\")),\"Done\",VLOOKUP(C173,'Resource Map'!$B$3:$C$509,2,FALSE))","v":"Done"}]
[{"$f":"IF(AND(B174<>\"West\",OR(A173=\"Winter FOT\",A173=\"Done\")),\"Done\",VLOOKUP(C174,'Resource Map'!$B$3:$C$509,2,FALSE))","v":"Done"}]
[{"$f":"IF(AND(B175<>\"West\",OR(A174=\"Winter FOT\",A174=\"Done\")),\"Done\",VLOOKUP(C175,'Resource Map'!$B$3:$C$509,2,FALSE))","v":"Done"}]
[{"$f":"IF(AND(B176<>\"West\",OR(A175=\"Winter FOT\",A175=\"Done\")),\"Done\",VLOOKUP(C176,'Resource Map'!$B$3:$C$509,2,FALSE))","v":"Done"}]
[{"$f":"IF(AND(B177<>\"West\",OR(A176=\"Winter FOT\",A176=\"Done\")),\"Done\",VLOOKUP(C177,'Resource Map'!$B$3:$C$509,2,FALSE))","v":"Done"}]
[{"$f":"IF(AND(B178<>\"West\",OR(A177=\"Winter FOT\",A177=\"Done\")),\"Done\",VLOOKUP(C178,'Resource Map'!$B$3:$C$509,2,FALSE))","v":"Done"}]
[{"$f":"IF(AND(B179<>\"West\",OR(A178=\"Winter FOT\",A178=\"Done\")),\"Done\",VLOOKUP(C179,'Resource Map'!$B$3:$C$509,2,FALSE))","v":"Done"}]
[{"$f":"IF(AND(B180<>\"West\",OR(A179=\"Winter FOT\",A179=\"Done\")),\"Done\",VLOOKUP(C180,'Resource Map'!$B$3:$C$509,2,FALSE))","v":"Done"}]
[{"$f":"IF(AND(B181<>\"West\",OR(A180=\"Winter FOT\",A180=\"Done\")),\"Done\",VLOOKUP(C181,'Resource Map'!$B$3:$C$509,2,FALSE))","v":"Done"}]
[{"$f":"IF(AND(B182<>\"West\",OR(A181=\"Winter FOT\",A181=\"Done\")),\"Done\",VLOOKUP(C182,'Resource Map'!$B$3:$C$509,2,FALSE))","v":"Done"}]
[{"$f":"IF(AND(B183<>\"West\",OR(A182=\"Winter FOT\",A182=\"Done\")),\"Done\",VLOOKUP(C183,'Resource Map'!$B$3:$C$509,2,FALSE))","v":"Done"}]
[{"$f":"IF(AND(B184<>\"West\",OR(A183=\"Winter FOT\",A183=\"Done\")),\"Done\",VLOOKUP(C184,'Resource Map'!$B$3:$C$509,2,FALSE))","v":"Done"}]
[{"$f":"IF(AND(B185<>\"West\",OR(A184=\"Winter FOT\",A184=\"Done\")),\"Done\",VLOOKUP(C185,'Resource Map'!$B$3:$C$509,2,FALSE))","v":"Done"}]
[{"$f":"IF(AND(B186<>\"West\",OR(A185=\"Winter FOT\",A185=\"Done\")),\"Done\",VLOOKUP(C186,'Resource Map'!$B$3:$C$509,2,FALSE))","v":"Done"}]
[{"$f":"IF(AND(B187<>\"West\",OR(A186=\"Winter FOT\",A186=\"Done\")),\"Done\",VLOOKUP(C187,'Resource Map'!$B$3:$C$509,2,FALSE))","v":"Done"}]
[{"$f":"IF(AND(B188<>\"West\",OR(A187=\"Winter FOT\",A187=\"Done\")),\"Done\",VLOOKUP(C188,'Resource Map'!$B$3:$C$509,2,FALSE))","v":"Done"}]
[{"$f":"IF(AND(B189<>\"West\",OR(A188=\"Winter FOT\",A188=\"Done\")),\"Done\",VLOOKUP(C189,'Resource Map'!$B$3:$C$509,2,FALSE))","v":"Done"}]
[{"$f":"IF(AND(B190<>\"West\",OR(A189=\"Winter FOT\",A189=\"Done\")),\"Done\",VLOOKUP(C190,'Resource Map'!$B$3:$C$509,2,FALSE))","v":"Done"}]
[{"$f":"IF(AND(B191<>\"West\",OR(A190=\"Winter FOT\",A190=\"Done\")),\"Done\",VLOOKUP(C191,'Resource Map'!$B$3:$C$509,2,FALSE))","v":"Done"}]
[{"$f":"IF(AND(B192<>\"West\",OR(A191=\"Winter FOT\",A191=\"Done\")),\"Done\",VLOOKUP(C192,'Resource Map'!$B$3:$C$509,2,FALSE))","v":"Done"}]
[{"$f":"IF(AND(B193<>\"West\",OR(A192=\"Winter FOT\",A192=\"Done\")),\"Done\",VLOOKUP(C193,'Resource Map'!$B$3:$C$509,2,FALSE))","v":"Done"}]
[{"$f":"IF(AND(B194<>\"West\",OR(A193=\"Winter FOT\",A193=\"Done\")),\"Done\",VLOOKUP(C194,'Resource Map'!$B$3:$C$509,2,FALSE))","v":"Done"}]
[{"$f":"IF(AND(B195<>\"West\",OR(A194=\"Winter FOT\",A194=\"Done\")),\"Done\",VLOOKUP(C195,'Resource Map'!$B$3:$C$509,2,FALSE))","v":"Done"}]
[{"$f":"IF(AND(B196<>\"West\",OR(A195=\"Winter FOT\",A195=\"Done\")),\"Done\",VLOOKUP(C196,'Resource Map'!$B$3:$C$509,2,FALSE))","v":"Done"}]
[{"$f":"IF(AND(B197<>\"West\",OR(A196=\"Winter FOT\",A196=\"Done\")),\"Done\",VLOOKUP(C197,'Resource Map'!$B$3:$C$509,2,FALSE))","v":"Done"}]
[{"$f":"IF(AND(B198<>\"West\",OR(A197=\"Winter FOT\",A197=\"Done\")),\"Done\",VLOOKUP(C198,'Resource Map'!$B$3:$C$509,2,FALSE))","v":"Done"}]
[{"$f":"IF(AND(B199<>\"West\",OR(A198=\"Winter FOT\",A198=\"Done\")),\"Done\",VLOOKUP(C199,'Resource Map'!$B$3:$C$509,2,FALSE))","v":"Done"}]
[{"$f":"IF(AND(B200<>\"West\",OR(A199=\"Winter FOT\",A199=\"Done\")),\"Done\",VLOOKUP(C200,'Resource Map'!$B$3:$C$509,2,FALSE))","v":"Done"}]
[{"$f":"IF(AND(B201<>\"West\",OR(A200=\"Winter FOT\",A200=\"Done\")),\"Done\",VLOOKUP(C201,'Resource Map'!$B$3:$C$509,2,FALSE))","v":"Done"}]
[{"$f":"IF(AND(B202<>\"West\",OR(A201=\"Winter FOT\",A201=\"Done\")),\"Done\",VLOOKUP(C202,'Resource Map'!$B$3:$C$509,2,FALSE))","v":"Done"}]
[{"$f":"IF(AND(B203<>\"West\",OR(A202=\"Winter FOT\",A202=\"Done\")),\"Done\",VLOOKUP(C203,'Resource Map'!$B$3:$C$509,2,FALSE))","v":"Done"}]
[{"$f":"IF(AND(B204<>\"West\",OR(A203=\"Winter FOT\",A203=\"Done\")),\"Done\",VLOOKUP(C204,'Resource Map'!$B$3:$C$509,2,FALSE))","v":"Done"}]
[{"$f":"IF(AND(B205<>\"West\",OR(A204=\"Winter FOT\",A204=\"Done\")),\"Done\",VLOOKUP(C205,'Resource Map'!$B$3:$C$509,2,FALSE))","v":"Done"}]
[{"$f":"IF(AND(B206<>\"West\",OR(A205=\"Winter FOT\",A205=\"Done\")),\"Done\",VLOOKUP(C206,'Resource Map'!$B$3:$C$509,2,FALSE))","v":"Done"}]
[{"$f":"IF(AND(B207<>\"West\",OR(A206=\"Winter FOT\",A206=\"Done\")),\"Done\",VLOOKUP(C207,'Resource Map'!$B$3:$C$509,2,FALSE))","v":"Done"}]
[{"$f":"IF(AND(B208<>\"West\",OR(A207=\"Winter FOT\",A207=\"Done\")),\"Done\",VLOOKUP(C208,'Resource Map'!$B$3:$C$509,2,FALSE))","v":"Done"}]
[{"$f":"IF(AND(B209<>\"West\",OR(A208=\"Winter FOT\",A208=\"Done\")),\"Done\",VLOOKUP(C209,'Resource Map'!$B$3:$C$509,2,FALSE))","v":"Done"}]
[{"$f":"IF(AND(B210<>\"West\",OR(A209=\"Winter FOT\",A209=\"Done\")),\"Done\",VLOOKUP(C210,'Resource Map'!$B$3:$C$509,2,FALSE))","v":"Done"}]
[{"$f":"IF(AND(B211<>\"West\",OR(A210=\"Winter FOT\",A210=\"Done\")),\"Done\",VLOOKUP(C211,'Resource Map'!$B$3:$C$509,2,FALSE))","v":"Done"}]
[{"$f":"IF(AND(B212<>\"West\",OR(A211=\"Winter FOT\",A211=\"Done\")),\"Done\",VLOOKUP(C212,'Resource Map'!$B$3:$C$509,2,FALSE))","v":"Done"}]
[{"$f":"IF(AND(B213<>\"West\",OR(A212=\"Winter FOT\",A212=\"Done\")),\"Done\",VLOOKUP(C213,'Resource Map'!$B$3:$C$509,2,FALSE))","v":"Done"}]
[{"$f":"IF(AND(B214<>\"West\",OR(A213=\"Winter FOT\",A213=\"Done\")),\"Done\",VLOOKUP(C214,'Resource Map'!$B$3:$C$509,2,FALSE))","v":"Done"}]
[{"$f":"IF(AND(B215<>\"West\",OR(A214=\"Winter FOT\",A214=\"Done\")),\"Done\",VLOOKUP(C215,'Resource Map'!$B$3:$C$509,2,FALSE))","v":"Done"}]
[{"$f":"IF(AND(B216<>\"West\",OR(A215=\"Winter FOT\",A215=\"Done\")),\"Done\",VLOOKUP(C216,'Resource Map'!$B$3:$C$509,2,FALSE))","v":"Done"}]
[{"$f":"IF(AND(B217<>\"West\",OR(A216=\"Winter FOT\",A216=\"Done\")),\"Done\",VLOOKUP(C217,'Resource Map'!$B$3:$C$509,2,FALSE))","v":"Done"}]
[{"$f":"IF(AND(B218<>\"West\",OR(A217=\"Winter FOT\",A217=\"Done\")),\"Done\",VLOOKUP(C218,'Resource Map'!$B$3:$C$509,2,FALSE))","v":"Done"}]
[{"$f":"IF(AND(B219<>\"West\",OR(A218=\"Winter FOT\",A218=\"Done\")),\"Done\",VLOOKUP(C219,'Resource Map'!$B$3:$C$509,2,FALSE))","v":"Done"}]
[{"$f":"IF(AND(B220<>\"West\",OR(A219=\"Winter FOT\",A219=\"Done\")),\"Done\",VLOOKUP(C220,'Resource Map'!$B$3:$C$509,2,FALSE))","v":"Done"}]
[{"$f":"IF(AND(B221<>\"West\",OR(A220=\"Winter FOT\",A220=\"Done\")),\"Done\",VLOOKUP(C221,'Resource Map'!$B$3:$C$509,2,FALSE))","v":"Done"}]
[{"$f":"IF(AND(B222<>\"West\",OR(A221=\"Winter FOT\",A221=\"Done\")),\"Done\",VLOOKUP(C222,'Resource Map'!$B$3:$C$509,2,FALSE))","v":"Done"}]
[{"$f":"IF(AND(B223<>\"West\",OR(A222=\"Winter FOT\",A222=\"Done\")),\"Done\",VLOOKUP(C223,'Resource Map'!$B$3:$C$509,2,FALSE))","v":"Done"}]
[{"$f":"IF(AND(B224<>\"West\",OR(A223=\"Winter FOT\",A223=\"Done\")),\"Done\",VLOOKUP(C224,'Resource Map'!$B$3:$C$509,2,FALSE))","v":"Done"}]
[{"$f":"IF(AND(B225<>\"West\",OR(A224=\"Winter FOT\",A224=\"Done\")),\"Done\",VLOOKUP(C225,'Resource Map'!$B$3:$C$509,2,FALSE))","v":"Done"}]
[{"$f":"IF(AND(B226<>\"West\",OR(A225=\"Winter FOT\",A225=\"Done\")),\"Done\",VLOOKUP(C226,'Resource Map'!$B$3:$C$509,2,FALSE))","v":"Done"}]
[{"$f":"IF(AND(B227<>\"West\",OR(A226=\"Winter FOT\",A226=\"Done\")),\"Done\",VLOOKUP(C227,'Resource Map'!$B$3:$C$509,2,FALSE))","v":"Done"}]
[{"$f":"IF(AND(B228<>\"West\",OR(A227=\"Winter FOT\",A227=\"Done\")),\"Done\",VLOOKUP(C228,'Resource Map'!$B$3:$C$509,2,FALSE))","v":"Done"}]
[{"$f":"IF(AND(B229<>\"West\",OR(A228=\"Winter FOT\",A228=\"Done\")),\"Done\",VLOOKUP(C229,'Resource Map'!$B$3:$C$509,2,FALSE))","v":"Done"}]
[{"$f":"IF(AND(B230<>\"West\",OR(A229=\"Winter FOT\",A229=\"Done\")),\"Done\",VLOOKUP(C230,'Resource Map'!$B$3:$C$509,2,FALSE))","v":"Done"}]
[{"$f":"IF(AND(B231<>\"West\",OR(A230=\"Winter FOT\",A230=\"Done\")),\"Done\",VLOOKUP(C231,'Resource Map'!$B$3:$C$509,2,FALSE))","v":"Done"}]
[{"$f":"IF(AND(B232<>\"West\",OR(A231=\"Winter FOT\",A231=\"Done\")),\"Done\",VLOOKUP(C232,'Resource Map'!$B$3:$C$509,2,FALSE))","v":"Done"}]
[{"$f":"IF(AND(B233<>\"West\",OR(A232=\"Winter FOT\",A232=\"Done\")),\"Done\",VLOOKUP(C233,'Resource Map'!$B$3:$C$509,2,FALSE))","v":"Done"}]
[{"$f":"IF(AND(B234<>\"West\",OR(A233=\"Winter FOT\",A233=\"Done\")),\"Done\",VLOOKUP(C234,'Resource Map'!$B$3:$C$509,2,FALSE))","v":"Done"}]
[{"$f":"IF(AND(B235<>\"West\",OR(A234=\"Winter FOT\",A234=\"Done\")),\"Done\",VLOOKUP(C235,'Resource Map'!$B$3:$C$509,2,FALSE))","v":"Done"}]
[{"$f":"IF(AND(B236<>\"West\",OR(A235=\"Winter FOT\",A235=\"Done\")),\"Done\",VLOOKUP(C236,'Resource Map'!$B$3:$C$509,2,FALSE))","v":"Done"}]
[{"$f":"IF(AND(B237<>\"West\",OR(A236=\"Winter FOT\",A236=\"Done\")),\"Done\",VLOOKUP(C237,'Resource Map'!$B$3:$C$509,2,FALSE))","v":"Done"}]
[{"$f":"IF(AND(B238<>\"West\",OR(A237=\"Winter FOT\",A237=\"Done\")),\"Done\",VLOOKUP(C238,'Resource Map'!$B$3:$C$509,2,FALSE))","v":"Done"}]
[{"$f":"IF(AND(B239<>\"West\",OR(A238=\"Winter FOT\",A238=\"Done\")),\"Done\",VLOOKUP(C239,'Resource Map'!$B$3:$C$509,2,FALSE))","v":"Done"}]
[{"$f":"IF(AND(B240<>\"West\",OR(A239=\"Winter FOT\",A239=\"Done\")),\"Done\",VLOOKUP(C240,'Resource Map'!$B$3:$C$509,2,FALSE))","v":"Done"}]
[{"$f":"IF(AND(B241<>\"West\",OR(A240=\"Winter FOT\",A240=\"Done\")),\"Done\",VLOOKUP(C241,'Resource Map'!$B$3:$C$509,2,FALSE))","v":"Done"}]
[{"$f":"IF(AND(B242<>\"West\",OR(A241=\"Winter FOT\",A241=\"Done\")),\"Done\",VLOOKUP(C242,'Resource Map'!$B$3:$C$509,2,FALSE))","v":"Done"}]
[{"$f":"IF(AND(B243<>\"West\",OR(A242=\"Winter FOT\",A242=\"Done\")),\"Done\",VLOOKUP(C243,'Resource Map'!$B$3:$C$509,2,FALSE))","v":"Done"}]
[{"$f":"IF(AND(B244<>\"West\",OR(A243=\"Winter FOT\",A243=\"Done\")),\"Done\",VLOOKUP(C244,'Resource Map'!$B$3:$C$509,2,FALSE))","v":"Done"}]
[{"$f":"IF(AND(B245<>\"West\",OR(A244=\"Winter FOT\",A244=\"Done\")),\"Done\",VLOOKUP(C245,'Resource Map'!$B$3:$C$509,2,FALSE))","v":"Done"}]
[{"$f":"IF(AND(B246<>\"West\",OR(A245=\"Winter FOT\",A245=\"Done\")),\"Done\",VLOOKUP(C246,'Resource Map'!$B$3:$C$509,2,FALSE))","v":"Done"}]
[{"$f":"IF(AND(B247<>\"West\",OR(A246=\"Winter FOT\",A246=\"Done\")),\"Done\",VLOOKUP(C247,'Resource Map'!$B$3:$C$509,2,FALSE))","v":"Done"}]
[{"$f":"IF(AND(B248<>\"West\",OR(A247=\"Winter FOT\",A247=\"Done\")),\"Done\",VLOOKUP(C248,'Resource Map'!$B$3:$C$509,2,FALSE))","v":"Done"}]
[{"$f":"IF(AND(B249<>\"West\",OR(A248=\"Winter FOT\",A248=\"Done\")),\"Done\",VLOOKUP(C249,'Resource Map'!$B$3:$C$509,2,FALSE))","v":"Done"}]
[{"$f":"IF(AND(B250<>\"West\",OR(A249=\"Winter FOT\",A249=\"Done\")),\"Done\",VLOOKUP(C250,'Resource Map'!$B$3:$C$509,2,FALSE))","v":"Done"}]
[{"$f":"IF(AND(B251<>\"West\",OR(A250=\"Winter FOT\",A250=\"Done\")),\"Done\",VLOOKUP(C251,'Resource Map'!$B$3:$C$509,2,FALSE))","v":"Done"}]
[{"$f":"IF(AND(B252<>\"West\",OR(A251=\"Winter FOT\",A251=\"Done\")),\"Done\",VLOOKUP(C252,'Resource Map'!$B$3:$C$509,2,FALSE))","v":"Done"}]
[{"$f":"IF(AND(B253<>\"West\",OR(A252=\"Winter FOT\",A252=\"Done\")),\"Done\",VLOOKUP(C253,'Resource Map'!$B$3:$C$509,2,FALSE))","v":"Done"}]
[{"$f":"IF(AND(B254<>\"West\",OR(A253=\"Winter FOT\",A253=\"Done\")),\"Done\",VLOOKUP(C254,'Resource Map'!$B$3:$C$509,2,FALSE))","v":"Done"}]
[{"$f":"IF(AND(B255<>\"West\",OR(A254=\"Winter FOT\",A254=\"Done\")),\"Done\",VLOOKUP(C255,'Resource Map'!$B$3:$C$509,2,FALSE))","v":"Done"}]
[{"$f":"IF(AND(B256<>\"West\",OR(A255=\"Winter FOT\",A255=\"Done\")),\"Done\",VLOOKUP(C256,'Resource Map'!$B$3:$C$509,2,FALSE))","v":"Done"}]
[{"$f":"IF(AND(B257<>\"West\",OR(A256=\"Winter FOT\",A256=\"Done\")),\"Done\",VLOOKUP(C257,'Resource Map'!$B$3:$C$509,2,FALSE))","v":"Done"}]
[{"$f":"IF(AND(B258<>\"West\",OR(A257=\"Winter FOT\",A257=\"Done\")),\"Done\",VLOOKUP(C258,'Resource Map'!$B$3:$C$509,2,FALSE))","v":"Done"}]
[{"$f":"IF(AND(B259<>\"West\",OR(A258=\"Winter FOT\",A258=\"Done\")),\"Done\",VLOOKUP(C259,'Resource Map'!$B$3:$C$509,2,FALSE))","v":"Done"}]
[{"$f":"IF(AND(B260<>\"West\",OR(A259=\"Winter FOT\",A259=\"Done\")),\"Done\",VLOOKUP(C260,'Resource Map'!$B$3:$C$509,2,FALSE))","v":"Done"}]
[{"$f":"IF(AND(B261<>\"West\",OR(A260=\"Winter FOT\",A260=\"Done\")),\"Done\",VLOOKUP(C261,'Resource Map'!$B$3:$C$509,2,FALSE))","v":"Done"}]
[{"$f":"IF(AND(B262<>\"West\",OR(A261=\"Winter FOT\",A261=\"Done\")),\"Done\",VLOOKUP(C262,'Resource Map'!$B$3:$C$509,2,FALSE))","v":"Done"}]
[{"$f":"IF(AND(B263<>\"West\",OR(A262=\"Winter FOT\",A262=\"Done\")),\"Done\",VLOOKUP(C263,'Resource Map'!$B$3:$C$509,2,FALSE))","v":"Done"}]
[{"$f":"IF(AND(B264<>\"West\",OR(A263=\"Winter FOT\",A263=\"Done\")),\"Done\",VLOOKUP(C264,'Resource Map'!$B$3:$C$509,2,FALSE))","v":"Done"}]
[{"$f":"IF(AND(B265<>\"West\",OR(A264=\"Winter FOT\",A264=\"Done\")),\"Done\",VLOOKUP(C265,'Resource Map'!$B$3:$C$509,2,FALSE))","v":"Done"}]
[{"$f":"IF(AND(B266<>\"West\",OR(A265=\"Winter FOT\",A265=\"Done\")),\"Done\",VLOOKUP(C266,'Resource Map'!$B$3:$C$509,2,FALSE))","v":"Done"}]
[{"$f":"IF(AND(B267<>\"West\",OR(A266=\"Winter FOT\",A266=\"Done\")),\"Done\",VLOOKUP(C267,'Resource Map'!$B$3:$C$509,2,FALSE))","v":"Done"}]
[{"$f":"IF(AND(B268<>\"West\",OR(A267=\"Winter FOT\",A267=\"Done\")),\"Done\",VLOOKUP(C268,'Resource Map'!$B$3:$C$509,2,FALSE))","v":"Done"}]
[{"$f":"IF(AND(B269<>\"West\",OR(A268=\"Winter FOT\",A268=\"Done\")),\"Done\",VLOOKUP(C269,'Resource Map'!$B$3:$C$509,2,FALSE))","v":"Done"}]
[{"$f":"IF(AND(B270<>\"West\",OR(A269=\"Winter FOT\",A269=\"Done\")),\"Done\",VLOOKUP(C270,'Resource Map'!$B$3:$C$509,2,FALSE))","v":"Done"}]
[{"$f":"IF(AND(B271<>\"West\",OR(A270=\"Winter FOT\",A270=\"Done\")),\"Done\",VLOOKUP(C271,'Resource Map'!$B$3:$C$509,2,FALSE))","v":"Done"}]
[{"$f":"IF(AND(B272<>\"West\",OR(A271=\"Winter FOT\",A271=\"Done\")),\"Done\",VLOOKUP(C272,'Resource Map'!$B$3:$C$509,2,FALSE))","v":"Done"}]
[{"$f":"IF(AND(B273<>\"West\",OR(A272=\"Winter FOT\",A272=\"Done\")),\"Done\",VLOOKUP(C273,'Resource Map'!$B$3:$C$509,2,FALSE))","v":"Done"}]
[{"$f":"IF(AND(B274<>\"West\",OR(A273=\"Winter FOT\",A273=\"Done\")),\"Done\",VLOOKUP(C274,'Resource Map'!$B$3:$C$509,2,FALSE))","v":"Done"}]
[{"$f":"IF(AND(B275<>\"West\",OR(A274=\"Winter FOT\",A274=\"Done\")),\"Done\",VLOOKUP(C275,'Resource Map'!$B$3:$C$509,2,FALSE))","v":"Done"}]
[{"$f":"IF(AND(B276<>\"West\",OR(A275=\"Winter FOT\",A275=\"Done\")),\"Done\",VLOOKUP(C276,'Resource Map'!$B$3:$C$509,2,FALSE))","v":"Done"}]
[{"$f":"IF(AND(B277<>\"West\",OR(A276=\"Winter FOT\",A276=\"Done\")),\"Done\",VLOOKUP(C277,'Resource Map'!$B$3:$C$509,2,FALSE))","v":"Done"}]
[{"$f":"IF(AND(B278<>\"West\",OR(A277=\"Winter FOT\",A277=\"Done\")),\"Done\",VLOOKUP(C278,'Resource Map'!$B$3:$C$509,2,FALSE))","v":"Done"}]
[{"$f":"IF(AND(B279<>\"West\",OR(A278=\"Winter FOT\",A278=\"Done\")),\"Done\",VLOOKUP(C279,'Resource Map'!$B$3:$C$509,2,FALSE))","v":"Done"}]
[{"$f":"IF(AND(B280<>\"West\",OR(A279=\"Winter FOT\",A279=\"Done\")),\"Done\",VLOOKUP(C280,'Resource Map'!$B$3:$C$509,2,FALSE))","v":"Done"}]
[{"$f":"IF(AND(B281<>\"West\",OR(A280=\"Winter FOT\",A280=\"Done\")),\"Done\",VLOOKUP(C281,'Resource Map'!$B$3:$C$509,2,FALSE))","v":"Done"}]
[{"$f":"IF(AND(B282<>\"West\",OR(A281=\"Winter FOT\",A281=\"Done\")),\"Done\",VLOOKUP(C282,'Resource Map'!$B$3:$C$509,2,FALSE))","v":"Done"}]
[{"$f":"IF(AND(B283<>\"West\",OR(A282=\"Winter FOT\",A282=\"Done\")),\"Done\",VLOOKUP(C283,'Resource Map'!$B$3:$C$509,2,FALSE))","v":"Done"}]
[{"$f":"IF(AND(B284<>\"West\",OR(A283=\"Winter FOT\",A283=\"Done\")),\"Done\",VLOOKUP(C284,'Resource Map'!$B$3:$C$509,2,FALSE))","v":"Done"}]
[{"$f":"IF(AND(B285<>\"West\",OR(A284=\"Winter FOT\",A284=\"Done\")),\"Done\",VLOOKUP(C285,'Resource Map'!$B$3:$C$509,2,FALSE))","v":"Done"}]
[{"$f":"IF(AND(B286<>\"West\",OR(A285=\"Winter FOT\",A285=\"Done\")),\"Done\",VLOOKUP(C286,'Resource Map'!$B$3:$C$509,2,FALSE))","v":"Done"}]
[{"$f":"IF(AND(B287<>\"West\",OR(A286=\"Winter FOT\",A286=\"Done\")),\"Done\",VLOOKUP(C287,'Resource Map'!$B$3:$C$509,2,FALSE))","v":"Done"}]
[{"$f":"IF(AND(B288<>\"West\",OR(A287=\"Winter FOT\",A287=\"Done\")),\"Done\",VLOOKUP(C288,'Resource Map'!$B$3:$C$509,2,FALSE))","v":"Done"}]
[{"$f":"IF(AND(B289<>\"West\",OR(A288=\"Winter FOT\",A288=\"Done\")),\"Done\",VLOOKUP(C289,'Resource Map'!$B$3:$C$509,2,FALSE))","v":"Done"}]
[{"$f":"IF(AND(B290<>\"West\",OR(A289=\"Winter FOT\",A289=\"Done\")),\"Done\",VLOOKUP(C290,'Resource Map'!$B$3:$C$509,2,FALSE))","v":"Done"}]
[{"$f":"IF(AND(B291<>\"West\",OR(A290=\"Winter FOT\",A290=\"Done\")),\"Done\",VLOOKUP(C291,'Resource Map'!$B$3:$C$509,2,FALSE))","v":"Done"}]
[{"$f":"IF(AND(B292<>\"West\",OR(A291=\"Winter FOT\",A291=\"Done\")),\"Done\",VLOOKUP(C292,'Resource Map'!$B$3:$C$509,2,FALSE))","v":"Done"}]
[{"$f":"IF(AND(B293<>\"West\",OR(A292=\"Winter FOT\",A292=\"Done\")),\"Done\",VLOOKUP(C293,'Resource Map'!$B$3:$C$509,2,FALSE))","v":"Done"}]
[{"$f":"IF(AND(B294<>\"West\",OR(A293=\"Winter FOT\",A293=\"Done\")),\"Done\",VLOOKUP(C294,'Resource Map'!$B$3:$C$509,2,FALSE))","v":"Done"}]
[{"$f":"IF(AND(B295<>\"West\",OR(A294=\"Winter FOT\",A294=\"Done\")),\"Done\",VLOOKUP(C295,'Resource Map'!$B$3:$C$509,2,FALSE))","v":"Done"}]
[{"$f":"IF(AND(B296<>\"West\",OR(A295=\"Winter FOT\",A295=\"Done\")),\"Done\",VLOOKUP(C296,'Resource Map'!$B$3:$C$509,2,FALSE))","v":"Done"}]
[{"$f":"IF(AND(B297<>\"West\",OR(A296=\"Winter FOT\",A296=\"Done\")),\"Done\",VLOOKUP(C297,'Resource Map'!$B$3:$C$509,2,FALSE))","v":"Done"}]
[{"$f":"IF(AND(B298<>\"West\",OR(A297=\"Winter FOT\",A297=\"Done\")),\"Done\",VLOOKUP(C298,'Resource Map'!$B$3:$C$509,2,FALSE))","v":"Done"}]
[{"$f":"IF(AND(B299<>\"West\",OR(A298=\"Winter FOT\",A298=\"Done\")),\"Done\",VLOOKUP(C299,'Resource Map'!$B$3:$C$509,2,FALSE))","v":"Done"}]
[{"$f":"IF(AND(B300<>\"West\",OR(A299=\"Winter FOT\",A299=\"Done\")),\"Done\",VLOOKUP(C300,'Resource Map'!$B$3:$C$509,2,FALSE))","v":"Done"}]
[{"$f":"IF(AND(B301<>\"West\",OR(A300=\"Winter FOT\",A300=\"Done\")),\"Done\",VLOOKUP(C301,'Resource Map'!$B$3:$C$509,2,FALSE))","v":"Done"}]
[{"$f":"IF(AND(B302<>\"West\",OR(A301=\"Winter FOT\",A301=\"Done\")),\"Done\",VLOOKUP(C302,'Resource Map'!$B$3:$C$509,2,FALSE))","v":"Done"}]

{"sheet":"Delta Compare Rel - Pre","index":8,"n_rows":48,"n_cols":27,"rows_kept":48,"cut":false,"hidden":false,"merged":[]}
[]
[]
[null,null,"Coal"]
[null,null,"Cumulative",2019,2020,2021,2022,2023,2024,2025,2026,2027,2028,2029,2030,2031,2032,2033,2034,2035,2036,2037,2038]
[null,null,"Coal Removed",{"$f":"'Data Compare Rel'!D8-'Data Compare Pre'!D8","v":0},{"$f":"'Data Compare Rel'!E8-'Data Compare Pre'!E8","v":0},{"$f":"'Data Compare Rel'!F8-'Data Compare Pre'!F8","v":0},{"$f":"'Data Compare Rel'!G8-'Data Compare Pre'!G8","v":0},{"$f":"'Data Compare Rel'!H8-'Data Compare Pre'!H8","v":0},{"$f":"'Data Compare Rel'!I8-'Data Compare Pre'!I8","v":0},{"$f":"'Data Compare Rel'!J8-'Data Compare Pre'!J8","v":0},{"$f":"'Data Compare Rel'!K8-'Data Compare Pre'!K8","v":0},{"$f":"'Data Compare Rel'!L8-'Data Compare Pre'!L8","v":0},{"$f":"'Data Compare Rel'!M8-'Data Compare Pre'!M8","v":0},{"$f":"'Data Compare Rel'!N8-'Data Compare Pre'!N8","v":0},{"$f":"'Data Compare Rel'!O8-'Data Compare Pre'!O8","v":0},{"$f":"'Data Compare Rel'!P8-'Data Compare Pre'!P8","v":0},{"$f":"'Data Compare Rel'!Q8-'Data Compare Pre'!Q8","v":0},{"$f":"'Data Compare Rel'!R8-'Data Compare Pre'!R8","v":0},{"$f":"'Data Compare Rel'!S8-'Data Compare Pre'!S8","v":0},{"$f":"'Data Compare Rel'!T8-'Data Compare Pre'!T8","v":0},{"$f":"'Data Compare Rel'!U8-'Data Compare Pre'!U8","v":0},{"$f":"'Data Compare Rel'!V8-'Data Compare Pre'!V8","v":0},{"$f":"'Data Compare Rel'!W8-'Data Compare Pre'!W8","v":0}]
[]
[null,null,"Renewable and Storage"]
[null,null,"Cumulative",2019,2020,2021,2022,2023,2024,2025,2026,2027,2028,2029,2030,2031,2032,2033,2034,2035,2036,2037,2038,null,"Wind","Solar","Battery"]
[null,null,"Wind",{"$f":"'Data Compare Rel'!D24-'Data Compare Pre'!D24","v":0},{"$f":"'Data Compare Rel'!E24-'Data Compare Pre'!E24","v":0},{"$f":"'Data Compare Rel'!F24-'Data Compare Pre'!F24","v":0},{"$f":"'Data Compare Rel'!G24-'Data Compare Pre'!G24","v":0},{"$f":"'Data Compare Rel'!H24-'Data Compare Pre'!H24","v":0},{"$f":"'Data Compare Rel'!I24-'Data Compare Pre'!I24","v":0},{"$f":"'Data Compare Rel'!J24-'Data Compare Pre'!J24","v":0},{"$f":"'Data Compare Rel'!K24-'Data Compare Pre'!K24","v":0},{"$f":"'Data Compare Rel'!L24-'Data Compare Pre'!L24","v":0},{"$f":"'Data Compare Rel'!M24-'Data Compare Pre'!M24","v":0},{"$f":"'Data Compare Rel'!N24-'Data Compare Pre'!N24","v":0},{"$f":"'Data Compare Rel'!O24-'Data Compare Pre'!O24","v":4.7999999999774445E-2},{"$f":"'Data Compare Rel'!P24-'Data Compare Pre'!P24","v":4.7999999999774445E-2},{"$f":"'Data Compare Rel'!Q24-'Data Compare Pre'!Q24","v":4.7999999999774445E-2},{"$f":"'Data Compare Rel'!R24-'Data Compare Pre'!R24","v":4.7999999999774445E-2},{"$f":"'Data Compare Rel'!S24-'Data Compare Pre'!S24","v":4.7999999999774445E-2},{"$f":"'Data Compare Rel'!T24-'Data Compare Pre'!T24","v":4.7999999999774445E-2},{"$f":"'Data Compare Rel'!U24-'Data Compare Pre'!U24","v":4.7999999999774445E-2},{"$f":"'Data Compare Rel'!V24-'Data Compare Pre'!V24","v":4.7999999999774445E-2},{"$f":"'Data Compare Rel'!W24-'Data Compare Pre'!W24","v":4.7999999999774445E-2},null,{"$f":"'Data Compare Rel'!Y24-'Data Compare Pre'!Y24","v":0},{"$f":"'Data Compare Rel'!Z24-'Data Compare Pre'!Z24","v":0.20099999999911233},{"$f":"0.25*W11+0.25*W12+W13","v":1065.0382499999998}]
[null,null,"Solar",{"$f":"'Data Compare Rel'!D25-'Data Compare Pre'!D25","v":0},{"$f":"'Data Compare Rel'!E25-'Data Compare Pre'!E25","v":0},{"$f":"'Data Compare Rel'!F25-'Data Compare Pre'!F25","v":0},{"$f":"'Data Compare Rel'!G25-'Data Compare Pre'!G25","v":0},{"$f":"'Data Compare Rel'!H25-'Data Compare Pre'!H25","v":0},{"$f":"'Data Compare Rel'!I25-'Data Compare Pre'!I25","v":0},{"$f":"'Data Compare Rel'!J25-'Data Compare Pre'!J25","v":0},{"$f":"'Data Compare Rel'!K25-'Data Compare Pre'!K25","v":0},{"$f":"'Data Compare Rel'!L25-'Data Compare Pre'!L25","v":0},{"$f":"'Data Compare Rel'!M25-'Data Compare Pre'!M25","v":0},{"$f":"'Data Compare Rel'!N25-'Data Compare Pre'!N25","v":0},{"$f":"'Data Compare Rel'!O25-'Data Compare Pre'!O25","v":0},{"$f":"'Data Compare Rel'!P25-'Data Compare Pre'!P25","v":0},{"$f":"'Data Compare Rel'!Q25-'Data Compare Pre'!Q25","v":0},{"$f":"'Data Compare Rel'!R25-'Data Compare Pre'!R25","v":0},{"$f":"'Data Compare Rel'!S25-'Data Compare Pre'!S25","v":0},{"$f":"'Data Compare Rel'!T25-'Data Compare Pre'!T25","v":0},{"$f":"'Data Compare Rel'!U25-'Data Compare Pre'!U25","v":0},{"$f":"'Data Compare Rel'!V25-'Data Compare Pre'!V25","v":0},{"$f":"'Data Compare Rel'!W25-'Data Compare Pre'!W25","v":0}]
[null,null,"Wind+Bat",{"$f":"'Data Compare Rel'!D26-'Data Compare Pre'!D26","v":0},{"$f":"'Data Compare Rel'!E26-'Data Compare Pre'!E26","v":0},{"$f":"'Data Compare Rel'!F26-'Data Compare Pre'!F26","v":0},{"$f":"'Data Compare Rel'!G26-'Data Compare Pre'!G26","v":0},{"$f":"'Data Compare Rel'!H26-'Data Compare Pre'!H26","v":0},{"$f":"'Data Compare Rel'!I26-'Data Compare Pre'!I26","v":0},{"$f":"'Data Compare Rel'!J26-'Data Compare Pre'!J26","v":0},{"$f":"'Data Compare Rel'!K26-'Data Compare Pre'!K26","v":0},{"$f":"'Data Compare Rel'!L26-'Data Compare Pre'!L26","v":0},{"$f":"'Data Compare Rel'!M26-'Data Compare Pre'!M26","v":0},{"$f":"'Data Compare Rel'!N26-'Data Compare Pre'!N26","v":0},{"$f":"'Data Compare Rel'!O26-'Data Compare Pre'!O26","v":-5.3000000000000824E-2},{"$f":"'Data Compare Rel'!P26-'Data Compare Pre'!P26","v":-5.3000000000000824E-2},{"$f":"'Data Compare Rel'!Q26-'Data Compare Pre'!Q26","v":-4.7999999999987608E-2},{"$f":"'Data Compare Rel'!R26-'Data Compare Pre'!R26","v":-4.7999999999987608E-2},{"$f":"'Data Compare Rel'!S26-'Data Compare Pre'!S26","v":-4.7999999999987608E-2},{"$f":"'Data Compare Rel'!T26-'Data Compare Pre'!T26","v":-4.7999999999987608E-2},{"$f":"'Data Compare Rel'!U26-'Data Compare Pre'!U26","v":-4.7999999999987608E-2},{"$f":"'Data Compare Rel'!V26-'Data Compare Pre'!V26","v":-4.7999999999987608E-2},{"$f":"'Data Compare Rel'!W26-'Data Compare Pre'!W26","v":-4.7999999999987608E-2}]
[null,null,"Solar+Bat",{"$f":"'Data Compare Rel'!D27-'Data Compare Pre'!D27","v":0},{"$f":"'Data Compare Rel'!E27-'Data Compare Pre'!E27","v":0},{"$f":"'Data Compare Rel'!F27-'Data Compare Pre'!F27","v":-3.4000000000020236E-2},{"$f":"'Data Compare Rel'!G27-'Data Compare Pre'!G27","v":1.9000000000005457E-2},{"$f":"'Data Compare Rel'!H27-'Data Compare Pre'!H27","v":-5.9999999999718057E-3},{"$f":"'Data Compare Rel'!I27-'Data Compare Pre'!I27","v":9.9999999974897946E-4},{"$f":"'Data Compare Rel'!J27-'Data Compare Pre'!J27","v":9.9999999974897946E-4},{"$f":"'Data Compare Rel'!K27-'Data Compare Pre'!K27","v":9.9999999974897946E-4},{"$f":"'Data Compare Rel'!L27-'Data Compare Pre'!L27","v":9.9999999974897946E-4},{"$f":"'Data Compare Rel'!M27-'Data Compare Pre'!M27","v":9.9999999974897946E-4},{"$f":"'Data Compare Rel'!N27-'Data Compare Pre'!N27","v":0.10099999999965803},{"$f":"'Data Compare Rel'!O27-'Data Compare Pre'!O27","v":0.10099999999965803},{"$f":"'Data Compare Rel'!P27-'Data Compare Pre'!P27","v":0.10099999999965803},{"$f":"'Data Compare Rel'!Q27-'Data Compare Pre'!Q27","v":0.10099999999965803},{"$f":"'Data Compare Rel'!R27-'Data Compare Pre'!R27","v":0.10099999999965803},{"$f":"'Data Compare Rel'!S27-'Data Compare Pre'!S27","v":0.10099999999965803},{"$f":"'Data Compare Rel'!T27-'Data Compare Pre'!T27","v":0.10099999999965803},{"$f":"'Data Compare Rel'!U27-'Data Compare Pre'!U27","v":0.10099999999965803},{"$f":"'Data Compare Rel'!V27-'Data Compare Pre'!V27","v":7.699999999931606E-2},{"$f":"'Data Compare Rel'!W27-'Data Compare Pre'!W27","v":0.20099999999911233}]
[null,null,"Battery",{"$f":"'Data Compare Rel'!D28-'Data Compare Pre'!D28","v":0},{"$f":"'Data Compare Rel'!E28-'Data Compare Pre'!E28","v":0},{"$f":"'Data Compare Rel'!F28-'Data Compare Pre'!F28","v":0},{"$f":"'Data Compare Rel'!G28-'Data Compare Pre'!G28","v":0},{"$f":"'Data Compare Rel'!H28-'Data Compare Pre'!H28","v":0},{"$f":"'Data Compare Rel'!I28-'Data Compare Pre'!I28","v":0},{"$f":"'Data Compare Rel'!J28-'Data Compare Pre'!J28","v":0},{"$f":"'Data Compare Rel'!K28-'Data Compare Pre'!K28","v":0},{"$f":"'Data Compare Rel'!L28-'Data Compare Pre'!L28","v":0},{"$f":"'Data Compare Rel'!M28-'Data Compare Pre'!M28","v":240},{"$f":"'Data Compare Rel'!N28-'Data Compare Pre'!N28","v":240},{"$f":"'Data Compare Rel'!O28-'Data Compare Pre'!O28","v":570},{"$f":"'Data Compare Rel'!P28-'Data Compare Pre'!P28","v":570},{"$f":"'Data Compare Rel'!Q28-'Data Compare Pre'!Q28","v":615},{"$f":"'Data Compare Rel'!R28-'Data Compare Pre'!R28","v":810},{"$f":"'Data Compare Rel'!S28-'Data Compare Pre'!S28","v":810},{"$f":"'Data Compare Rel'!T28-'Data Compare Pre'!T28","v":810},{"$f":"'Data Compare Rel'!U28-'Data Compare Pre'!U28","v":810},{"$f":"'Data Compare Rel'!V28-'Data Compare Pre'!V28","v":930},{"$f":"'Data Compare Rel'!W28-'Data Compare Pre'!W28","v":1065}]
[null,null,"Pumped Storage",{"$f":"'Data Compare Rel'!D29-'Data Compare Pre'!D29","v":0},{"$f":"'Data Compare Rel'!E29-'Data Compare Pre'!E29","v":0},{"$f":"'Data Compare Rel'!F29-'Data Compare Pre'!F29","v":0},{"$f":"'Data Compare Rel'!G29-'Data Compare Pre'!G29","v":0},{"$f":"'Data Compare Rel'!H29-'Data Compare Pre'!H29","v":0},{"$f":"'Data Compare Rel'!I29-'Data Compare Pre'!I29","v":0},{"$f":"'Data Compare Rel'!J29-'Data Compare Pre'!J29","v":0},{"$f":"'Data Compare Rel'!K29-'Data Compare Pre'!K29","v":0},{"$f":"'Data Compare Rel'!L29-'Data Compare Pre'!L29","v":0},{"$f":"'Data Compare Rel'!M29-'Data Compare Pre'!M29","v":0},{"$f":"'Data Compare Rel'!N29-'Data Compare Pre'!N29","v":0},{"$f":"'Data Compare Rel'!O29-'Data Compare Pre'!O29","v":0},{"$f":"'Data Compare Rel'!P29-'Data Compare Pre'!P29","v":0},{"$f":"'Data Compare Rel'!Q29-'Data Compare Pre'!Q29","v":0},{"$f":"'Data Compare Rel'!R29-'Data Compare Pre'!R29","v":0},{"$f":"'Data Compare Rel'!S29-'Data Compare Pre'!S29","v":0},{"$f":"'Data Compare Rel'!T29-'Data Compare Pre'!T29","v":0},{"$f":"'Data Compare Rel'!U29-'Data Compare Pre'!U29","v":0},{"$f":"'Data Compare Rel'!V29-'Data Compare Pre'!V29","v":0},{"$f":"'Data Compare Rel'!W29-'Data Compare Pre'!W29","v":0}]
[null,null,"Renewable Removed",{"$f":"'Data Compare Rel'!D30-'Data Compare Pre'!D30","v":0},{"$f":"'Data Compare Rel'!E30-'Data Compare Pre'!E30","v":0},{"$f":"'Data Compare Rel'!F30-'Data Compare Pre'!F30","v":0},{"$f":"'Data Compare Rel'!G30-'Data Compare Pre'!G30","v":0},{"$f":"'Data Compare Rel'!H30-'Data Compare Pre'!H30","v":0},{"$f":"'Data Compare Rel'!I30-'Data Compare Pre'!I30","v":0},{"$f":"'Data Compare Rel'!J30-'Data Compare Pre'!J30","v":0},{"$f":"'Data Compare Rel'!K30-'Data Compare Pre'!K30","v":0},{"$f":"'Data Compare Rel'!L30-'Data Compare Pre'!L30","v":0},{"$f":"'Data Compare Rel'!M30-'Data Compare Pre'!M30","v":0},{"$f":"'Data Compare Rel'!N30-'Data Compare Pre'!N30","v":0},{"$f":"'Data Compare Rel'!O30-'Data Compare Pre'!O30","v":0},{"$f":"'Data Compare Rel'!P30-'Data Compare Pre'!P30","v":0},{"$f":"'Data Compare Rel'!Q30-'Data Compare Pre'!Q30","v":0},{"$f":"'Data Compare Rel'!R30-'Data Compare Pre'!R30","v":0},{"$f":"'Data Compare Rel'!S30-'Data Compare Pre'!S30","v":0},{"$f":"'Data Compare Rel'!T30-'Data Compare Pre'!T30","v":0},{"$f":"'Data Compare Rel'!U30-'Data Compare Pre'!U30","v":0},{"$f":"'Data Compare Rel'!V30-'Data Compare Pre'!V30","v":0},{"$f":"'Data Compare Rel'!W30-'Data Compare Pre'!W30","v":0}]
[]
[null,null,"Gas"]
[null,null,"Cumulative",2019,2020,2021,2022,2023,2024,2025,2026,2027,2028,2029,2030,2031,2032,2033,2034,2035,2036,2037,2038]
[null,null,"Gas Peaker",{"$f":"'Data Compare Rel'!D40-'Data Compare Pre'!D40","v":0},{"$f":"'Data Compare Rel'!E40-'Data Compare Pre'!E40","v":0},{"$f":"'Data Compare Rel'!F40-'Data Compare Pre'!F40","v":0},{"$f":"'Data Compare Rel'!G40-'Data Compare Pre'!G40","v":0},{"$f":"'Data Compare Rel'!H40-'Data Compare Pre'!H40","v":0},{"$f":"'Data Compare Rel'!I40-'Data Compare Pre'!I40","v":0},{"$f":"'Data Compare Rel'!J40-'Data Compare Pre'!J40","v":0},{"$f":"'Data Compare Rel'!K40-'Data Compare Pre'!K40","v":0},{"$f":"'Data Compare Rel'!L40-'Data Compare Pre'!L40","v":0},{"$f":"'Data Compare Rel'!M40-'Data Compare Pre'!M40","v":0},{"$f":"'Data Compare Rel'!N40-'Data Compare Pre'!N40","v":0},{"$f":"'Data Compare Rel'!O40-'Data Compare Pre'!O40","v":554.70000000000005},{"$f":"'Data Compare Rel'!P40-'Data Compare Pre'!P40","v":554.70000000000005},{"$f":"'Data Compare Rel'!Q40-'Data Compare Pre'!Q40","v":554.70000000000005},{"$f":"'Data Compare Rel'!R40-'Data Compare Pre'!R40","v":369.80000000000007},{"$f":"'Data Compare Rel'!S40-'Data Compare Pre'!S40","v":369.80000000000007},{"$f":"'Data Compare Rel'!T40-'Data Compare Pre'!T40","v":369.80000000000007},{"$f":"'Data Compare Rel'!U40-'Data Compare Pre'!U40","v":369.80000000000007},{"$f":"'Data Compare Rel'!V40-'Data Compare Pre'!V40","v":221.40000000000009},{"$f":"'Data Compare Rel'!W40-'Data Compare Pre'!W40","v":0}]
[null,null,"Gas CCCT",{"$f":"'Data Compare Rel'!D41-'Data Compare Pre'!D41","v":0},{"$f":"'Data Compare Rel'!E41-'Data Compare Pre'!E41","v":0},{"$f":"'Data Compare Rel'!F41-'Data Compare Pre'!F41","v":0},{"$f":"'Data Compare Rel'!G41-'Data Compare Pre'!G41","v":0},{"$f":"'Data Compare Rel'!H41-'Data Compare Pre'!H41","v":0},{"$f":"'Data Compare Rel'!I41-'Data Compare Pre'!I41","v":0},{"$f":"'Data Compare Rel'!J41-'Data Compare Pre'!J41","v":0},{"$f":"'Data Compare Rel'!K41-'Data Compare Pre'!K41","v":0},{"$f":"'Data Compare Rel'!L41-'Data Compare Pre'!L41","v":0},{"$f":"'Data Compare Rel'!M41-'Data Compare Pre'!M41","v":0},{"$f":"'Data Compare Rel'!N41-'Data Compare Pre'!N41","v":0},{"$f":"'Data Compare Rel'!O41-'Data Compare Pre'!O41","v":0},{"$f":"'Data Compare Rel'!P41-'Data Compare Pre'!P41","v":0},{"$f":"'Data Compare Rel'!Q41-'Data Compare Pre'!Q41","v":0},{"$f":"'Data Compare Rel'!R41-'Data Compare Pre'!R41","v":0},{"$f":"'Data Compare Rel'!S41-'Data Compare Pre'!S41","v":0},{"$f":"'Data Compare Rel'!T41-'Data Compare Pre'!T41","v":0},{"$f":"'Data Compare Rel'!U41-'Data Compare Pre'!U41","v":0},{"$f":"'Data Compare Rel'!V41-'Data Compare Pre'!V41","v":0},{"$f":"'Data Compare Rel'!W41-'Data Compare Pre'!W41","v":0}]
[null,null,"Gas Conv.",{"$f":"'Data Compare Rel'!D42-'Data Compare Pre'!D42","v":0},{"$f":"'Data Compare Rel'!E42-'Data Compare Pre'!E42","v":0},{"$f":"'Data Compare Rel'!F42-'Data Compare Pre'!F42","v":0},{"$f":"'Data Compare Rel'!G42-'Data Compare Pre'!G42","v":0},{"$f":"'Data Compare Rel'!H42-'Data Compare Pre'!H42","v":0},{"$f":"'Data Compare Rel'!I42-'Data Compare Pre'!I42","v":0},{"$f":"'Data Compare Rel'!J42-'Data Compare Pre'!J42","v":0},{"$f":"'Data Compare Rel'!K42-'Data Compare Pre'!K42","v":0},{"$f":"'Data Compare Rel'!L42-'Data Compare Pre'!L42","v":0},{"$f":"'Data Compare Rel'!M42-'Data Compare Pre'!M42","v":0},{"$f":"'Data Compare Rel'!N42-'Data Compare Pre'!N42","v":0},{"$f":"'Data Compare Rel'!O42-'Data Compare Pre'!O42","v":0},{"$f":"'Data Compare Rel'!P42-'Data Compare Pre'!P42","v":0},{"$f":"'Data Compare Rel'!Q42-'Data Compare Pre'!Q42","v":0},{"$f":"'Data Compare Rel'!R42-'Data Compare Pre'!R42","v":0},{"$f":"'Data Compare Rel'!S42-'Data Compare Pre'!S42","v":0},{"$f":"'Data Compare Rel'!T42-'Data Compare Pre'!T42","v":0},{"$f":"'Data Compare Rel'!U42-'Data Compare Pre'!U42","v":0},{"$f":"'Data Compare Rel'!V42-'Data Compare Pre'!V42","v":0},{"$f":"'Data Compare Rel'!W42-'Data Compare Pre'!W42","v":0}]
[null,null,"Gas Removed",{"$f":"'Data Compare Rel'!D43-'Data Compare Pre'!D43","v":0},{"$f":"'Data Compare Rel'!E43-'Data Compare Pre'!E43","v":0},{"$f":"'Data Compare Rel'!F43-'Data Compare Pre'!F43","v":0},{"$f":"'Data Compare Rel'!G43-'Data Compare Pre'!G43","v":0},{"$f":"'Data Compare Rel'!H43-'Data Compare Pre'!H43","v":0},{"$f":"'Data Compare Rel'!I43-'Data Compare Pre'!I43","v":0},{"$f":"'Data Compare Rel'!J43-'Data Compare Pre'!J43","v":0},{"$f":"'Data Compare Rel'!K43-'Data Compare Pre'!K43","v":0},{"$f":"'Data Compare Rel'!L43-'Data Compare Pre'!L43","v":0},{"$f":"'Data Compare Rel'!M43-'Data Compare Pre'!M43","v":0},{"$f":"'Data Compare Rel'!N43-'Data Compare Pre'!N43","v":0},{"$f":"'Data Compare Rel'!O43-'Data Compare Pre'!O43","v":0},{"$f":"'Data Compare Rel'!P43-'Data Compare Pre'!P43","v":0},{"$f":"'Data Compare Rel'!Q43-'Data Compare Pre'!Q43","v":0},{"$f":"'Data Compare Rel'!R43-'Data Compare Pre'!R43","v":0},{"$f":"'Data Compare Rel'!S43-'Data Compare Pre'!S43","v":0},{"$f":"'Data Compare Rel'!T43-'Data Compare Pre'!T43","v":0},{"$f":"'Data Compare Rel'!U43-'Data Compare Pre'!U43","v":0},{"$f":"'Data Compare Rel'!V43-'Data Compare Pre'!V43","v":0},{"$f":"'Data Compare Rel'!W43-'Data Compare Pre'!W43","v":0}]
[]
[null,null,"Demand-Side Management"]
[null,null,"Cumulative",2019,2020,2021,2022,2023,2024,2025,2026,2027,2028,2029,2030,2031,2032,2033,2034,2035,2036,2037,2038]
[null,null,"Class 2 DSM",{"$f":"'Data Compare Rel'!D51-'Data Compare Pre'!D51","v":0},{"$f":"'Data Compare Rel'!E51-'Data Compare Pre'!E51","v":11.940000000000026},{"$f":"'Data Compare Rel'!F51-'Data Compare Pre'!F51","v":25.850000000000023},{"$f":"'Data Compare Rel'!G51-'Data Compare Pre'!G51","v":39.139999999999986},{"$f":"'Data Compare Rel'!H51-'Data Compare Pre'!H51","v":47.409999999999968},{"$f":"'Data Compare Rel'!I51-'Data Compare Pre'!I51","v":63.059999999999945},{"$f":"'Data Compare Rel'!J51-'Data Compare Pre'!J51","v":77.839999999999918},{"$f":"'Data Compare Rel'!K51-'Data Compare Pre'!K51","v":93.079999999999814},{"$f":"'Data Compare Rel'!L51-'Data Compare Pre'!L51","v":107.08999999999992},{"$f":"'Data Compare Rel'!M51-'Data Compare Pre'!M51","v":116.45000000000005},{"$f":"'Data Compare Rel'!N51-'Data Compare Pre'!N51","v":122.46000000000026},{"$f":"'Data Compare Rel'!O51-'Data Compare Pre'!O51","v":130.27000000000044},{"$f":"'Data Compare Rel'!P51-'Data Compare Pre'!P51","v":135.2000000000005},{"$f":"'Data Compare Rel'!Q51-'Data Compare Pre'!Q51","v":137.43000000000052},{"$f":"'Data Compare Rel'!R51-'Data Compare Pre'!R51","v":143.11000000000058},{"$f":"'Data Compare Rel'!S51-'Data Compare Pre'!S51","v":143.38000000000056},{"$f":"'Data Compare Rel'!T51-'Data Compare Pre'!T51","v":145.08000000000084},{"$f":"'Data Compare Rel'!U51-'Data Compare Pre'!U51","v":148.66000000000099},{"$f":"'Data Compare Rel'!V51-'Data Compare Pre'!V51","v":151.23000000000093},{"$f":"'Data Compare Rel'!W51-'Data Compare Pre'!W51","v":153.72000000000116}]
[null,null,"Class 1 DSM",{"$f":"'Data Compare Rel'!D52-'Data Compare Pre'!D52","v":0},{"$f":"'Data Compare Rel'!E52-'Data Compare Pre'!E52","v":0},{"$f":"'Data Compare Rel'!F52-'Data Compare Pre'!F52","v":0},{"$f":"'Data Compare Rel'!G52-'Data Compare Pre'!G52","v":0},{"$f":"'Data Compare Rel'!H52-'Data Compare Pre'!H52","v":0},{"$f":"'Data Compare Rel'!I52-'Data Compare Pre'!I52","v":0},{"$f":"'Data Compare Rel'!J52-'Data Compare Pre'!J52","v":0},{"$f":"'Data Compare Rel'!K52-'Data Compare Pre'!K52","v":0},{"$f":"'Data Compare Rel'!L52-'Data Compare Pre'!L52","v":0},{"$f":"'Data Compare Rel'!M52-'Data Compare Pre'!M52","v":0},{"$f":"'Data Compare Rel'!N52-'Data Compare Pre'!N52","v":0},{"$f":"'Data Compare Rel'!O52-'Data Compare Pre'!O52","v":0},{"$f":"'Data Compare Rel'!P52-'Data Compare Pre'!P52","v":0},{"$f":"'Data Compare Rel'!Q52-'Data Compare Pre'!Q52","v":0},{"$f":"'Data Compare Rel'!R52-'Data Compare Pre'!R52","v":0},{"$f":"'Data Compare Rel'!S52-'Data Compare Pre'!S52","v":0},{"$f":"'Data Compare Rel'!T52-'Data Compare Pre'!T52","v":0},{"$f":"'Data Compare Rel'!U52-'Data Compare Pre'!U52","v":0},{"$f":"'Data Compare Rel'!V52-'Data Compare Pre'!V52","v":0},{"$f":"'Data Compare Rel'!W52-'Data Compare Pre'!W52","v":0}]
[]
[null,null,"FOTs"]
[null,null,"Incremental",2019,2020,2021,2022,2023,2024,2025,2026,2027,2028,2029,2030,2031,2032,2033,2034,2035,2036,2037,2038]
[null,null,"FOT",{"$f":"'Data Compare Rel'!D56-'Data Compare Pre'!D56","v":0},{"$f":"'Data Compare Rel'!E56-'Data Compare Pre'!E56","v":-5.0000000001091394E-3},{"$f":"'Data Compare Rel'!F56-'Data Compare Pre'!F56","v":1.6999999999995907E-2},{"$f":"'Data Compare Rel'!G56-'Data Compare Pre'!G56","v":-1.4999999999986358E-2},{"$f":"'Data Compare Rel'!H56-'Data Compare Pre'!H56","v":-1.8000000000029104E-2},{"$f":"'Data Compare Rel'!I56-'Data Compare Pre'!I56","v":-1.0000000000047748E-3},{"$f":"'Data Compare Rel'!J56-'Data Compare Pre'!J56","v":8.9999999999861302E-3},{"$f":"'Data Compare Rel'!K56-'Data Compare Pre'!K56","v":-7.9999999999813554E-3},{"$f":"'Data Compare Rel'!L56-'Data Compare Pre'!L56","v":1.099999999999568E-2},{"$f":"'Data Compare Rel'!M56-'Data Compare Pre'!M56","v":3.9999999999054126E-3},{"$f":"'Data Compare Rel'!N56-'Data Compare Pre'!N56","v":-2.9999999999290594E-3},{"$f":"'Data Compare Rel'!O56-'Data Compare Pre'!O56","v":0},{"$f":"'Data Compare Rel'!P56-'Data Compare Pre'!P56","v":-4.0000000001327862E-3},{"$f":"'Data Compare Rel'!Q56-'Data Compare Pre'!Q56","v":-5.9999999998581188E-3},{"$f":"'Data Compare Rel'!R56-'Data Compare Pre'!R56","v":0},{"$f":"'Data Compare Rel'!S56-'Data Compare Pre'!S56","v":-4.9999999998817657E-3},{"$f":"'Data Compare Rel'!T56-'Data Compare Pre'!T56","v":1.5000000000100044E-2},{"$f":"'Data Compare Rel'!U56-'Data Compare Pre'!U56","v":-1.0999999999967258E-2},{"$f":"'Data Compare Rel'!V56-'Data Compare Pre'!V56","v":0},{"$f":"'Data Compare Rel'!W56-'Data Compare Pre'!W56","v":-1.3999999999896318E-2}]
[]
[]
[null,null,null,2019,2020,2021,2022,2023,2024,2025,2026,2027,2028,2029,2030,2031,2032,2033,2034,2035,2036,2037,2038]
[null,null,"Coal Removed",{"$f":"D5","v":0},{"$f":"E5","v":0},0,0,0,0,0,0,0,0,0,0,0,0,0,0,0,0,0,0]
[null,null,"Wind",{"$f":"D9","v":0},0,0,0,0,0,0,0,0,0,0,4.7999999999774445E-2,4.7999999999774445E-2,4.7999999999774445E-2,4.7999999999774445E-2,4.7999999999774445E-2,4.7999999999774445E-2,4.7999999999774445E-2,4.7999999999774445E-2,4.7999999999774445E-2]
[null,null,"Solar",{"$f":"D10","v":0},0,0,0,0,0,0,0,0,0,0,0,0,0,0,0,0,0,0,0]
[null,null,"Wind+Bat",{"$f":"D11","v":0},0,0,0,0,0,0,0,0,0,0,-5.3000000000000824E-2,-5.3000000000000824E-2,-4.7999999999987608E-2,-4.7999999999987608E-2,-4.7999999999987608E-2,-4.7999999999987608E-2,-4.7999999999987608E-2,-4.7999999999987608E-2,-4.7999999999987608E-2]
[null,null,"Solar+Bat",{"$f":"D12","v":0},0,-3.4000000000020236E-2,1.9000000000005457E-2,-5.9999999999718057E-3,9.9999999974897946E-4,9.9999999974897946E-4,9.9999999974897946E-4,9.9999999974897946E-4,9.9999999974897946E-4,0.10099999999965803,0.10099999999965803,0.10099999999965803,0.10099999999965803,0.10099999999965803,0.10099999999965803,0.10099999999965803,0.10099999999965803,7.699999999931606E-2,0.20099999999911233]
[null,null,"Battery",{"$f":"D13","v":0},0,0,0,0,0,0,0,0,240,240,570,570,615,810,810,810,810,930,1065]
[null,null,"Pumped Storage",{"$f":"D14","v":0},0,0,0,0,0,0,0,0,0,0,0,0,0,0,0,0,0,0,0]
[null,null,"Gas",{"$f":"SUM(D19:D22)","v":0},{"$f":"SUM(E19:E22)","v":0},0,0,0,0,0,0,0,0,0,554.70000000000005,554.70000000000005,554.70000000000005,369.80000000000007,369.80000000000007,369.80000000000007,369.80000000000007,221.40000000000009,0]
[null,null,"Class 1 DSM",{"$f":"D27","v":0},{"$f":"E27","v":0},0,0,0,0,0,0,0,0,0,0,0,0,0,0,0,0,0,0]
[null,null,"Class 2 DSM",{"$f":"D26","v":0},{"$f":"E26","v":11.940000000000026},25.850000000000023,39.139999999999986,47.409999999999968,63.059999999999945,77.839999999999918,93.079999999999814,107.08999999999992,116.45000000000005,122.46000000000026,130.27000000000044,135.2000000000005,137.43000000000052,143.11000000000058,143.38000000000056,145.08000000000084,148.66000000000099,151.23000000000093,153.72000000000116]
[null,null,"FOT",{"$f":"D31","v":0},{"$f":"E31","v":-5.0000000001091394E-3},1.6999999999995907E-2,-1.4999999999986358E-2,-1.8000000000029104E-2,-1.0000000000047748E-3,8.9999999999861302E-3,-7.9999999999813554E-3,1.099999999999568E-2,3.9999999999054126E-3,-2.9999999999290594E-3,0,-4.0000000001327862E-3,-5.9999999998581188E-3,0,-4.9999999998817657E-3,1.5000000000100044E-2,-1.0999999999967258E-2,0,-1.3999999999896318E-2]
[]
[]
[null,null,"Existing Capacity Removed",{"$f":"D5+D15+D22","v":0},{"$f":"E5+E15+E22","v":0},0,0,0,0,0,0,0,0,0,0,0,0,0,0,0,0,0,0]

{"sheet":"Resource Map","index":9,"n_rows":335,"n_cols":7,"rows_kept":335,"cut":false,"hidden":false,"merged":[]}
[]
[null,"Name/Defined Resource",null,null,null,null,"All Types"]
[null,"Battery Storage - East","Battery",{"$f":"MATCH(C3,$G$3:$G$21,0)","v":1},null,null,"Battery"]
[null,"Battery Storage - West","Battery",{"$f":"MATCH(C4,$G$3:$G$21,0)","v":1},null,null,"Class 1 DSM"]
[null,"Battery Storage - Utah-N","Battery",{"$f":"MATCH(C5,$G$3:$G$21,0)","v":1},null,null,"Class 2 DSM"]
[null,"Battery Storage - Utah-S","Battery",{"$f":"MATCH(C6,$G$3:$G$21,0)","v":1},null,null,"Coal Removed"]
[null,"Battery Storage - WYSW","Battery",{"$f":"MATCH(C7,$G$3:$G$21,0)","v":1},null,null,"FOT"]
[null,"Battery Storage - Idaho","Battery",{"$f":"MATCH(C8,$G$3:$G$21,0)","v":1},null,null,"Gas CCCT"]
[null,"Battery Storage - S-Oregon","Battery",{"$f":"MATCH(C9,$G$3:$G$21,0)","v":1},null,null,"Gas Conv."]
[null,"Battery Storage - Willamette Valley","Battery",1,null,null,"Gas Peaker"]
[null,"Battery Storage - Portland NC","Battery",1,null,null,"Gas Removed"]
[null,"Battery Storage - Walla Walla","Battery",1,null,null,"Hydro Removed"]
[null,"Battery Storage - Yakima","Battery",1,null,null,"Other Removed"]
[null,"CAES - East","Pumped Storage",12,null,null,"Pumped Storage"]
[null,"CCCT - DJohns - F 1x1","Gas CCCT",6,null,null,"Solar"]
[null,"CCCT - DJohns - F 2x1","Gas CCCT",6,null,null,"Solar Removed"]
[null,"CCCT - DJohns - G 1x1","Gas CCCT",6,null,null,"Solar+Bat"]
[null,"CCCT - DJohns - G 2x1","Gas CCCT",6,null,null,"Wind"]
[null,"CCCT - DJohns - J 1x1","Gas CCCT",6,null,null,"Wind Removed"]
[null,"CCCT - DJohns - J 2x1","Gas CCCT",6,null,null,"Wind+Bat"]
[null,"CCCT - Goshen - F 1x1","Gas CCCT",6,null,null,"Winter FOT"]
[null,"CCCT - Goshen - G 1x1","Gas CCCT",6]
[null,"CCCT - Goshen - G 2x1","Gas CCCT",6]
[null,"CCCT - Goshen - J 1x1","Gas CCCT",6]
[null,"CCCT - Goshen - J 2x1","Gas CCCT",6]
[null,"CCCT - Hunter - F 1x1","Gas CCCT",6]
[null,"CCCT - Hunter - F 2x1","Gas CCCT",6]
[null,"CCCT - Hunter - G 1x1","Gas CCCT",6]
[null,"CCCT - Hunter - G 2x1","Gas CCCT",6]
[null,"CCCT - Hunter - J 1x1","Gas CCCT",6]
[null,"CCCT - Hunter - J 2x1","Gas CCCT",6]
[null,"CCCT - Huntington - F 1x1","Gas CCCT",6]
[null,"CCCT - Huntington - F 2x1","Gas CCCT",6]
[null,"CCCT - Huntington - G 1x1","Gas CCCT",6]
[null,"CCCT - Huntington - G 2x1","Gas CCCT",6]
[null,"CCCT - Huntington - J 1x1","Gas CCCT",6]
[null,"CCCT - Huntington - J 2x1","Gas CCCT",6]
[null,"CCCT - Jbridger - G 1x1","Gas CCCT",6]
[null,"CCCT - Jbridger - G 2x1","Gas CCCT",6]
[null,"CCCT - Jbridger - J 1x1","Gas CCCT",6]
[null,"CCCT - Jbridger - J 2x1","Gas CCCT",6]
[null,"CCCT - Naughton - J 1x1","Gas CCCT",6]
[null,"CCCT - Naughton - J 2x1","Gas CCCT",6]
[null,"CCCT - PortlandNC - F 2x1","Gas CCCT",6]
[null,"CCCT - PortlandNC - G 1x1","Gas CCCT",6]
[null,"CCCT - PortlandNC - G 2x1","Gas CCCT",6]
[null,"CCCT - PortlandNC - J 1x1","Gas CCCT",6]
[null,"CCCT - PortlandNC - J 2x1","Gas CCCT",6]
[null,"CCCT - SOregonCal - F 2x1","Gas CCCT",6]
[null,"CCCT - SOregonCal - G 1x1","Gas CCCT",6]
[null,"CCCT - SOregonCal - G 2x1","Gas CCCT",6]
[null,"CCCT - SOregonCal - J 1x1","Gas CCCT",6]
[null,"CCCT - SOregonCal - J 2x1","Gas CCCT",6]
[null,"CCCT - Utah-N - F 1x1","Gas CCCT",6]
[null,"CCCT - Utah-N - F 2x1","Gas CCCT",6]
[null,"CCCT - Utah-N - G 1x1","Gas CCCT",6]
[null,"CCCT - Utah-N - G 2x1","Gas CCCT",6]
[null,"CCCT - Utah-N - J 1x1","Gas CCCT",6]
[null,"CCCT - Utah-N - J 2x1","Gas CCCT",6]
[null,"CCCT - Utah-S - F 1x1","Gas CCCT",6]
[null,"CCCT - Utah-S - F 2x1","Gas CCCT",6]
[null,"CCCT - Utah-S - G 1x1","Gas CCCT",6]
[null,"CCCT - Utah-S - G 2x1","Gas CCCT",6]
[null,"CCCT - Utah-S - J 1x1","Gas CCCT",6]
[null,"CCCT - Utah-S - J 2x1","Gas CCCT",6]
[null,"CCCT - Walla Walla - F 2x1","Gas CCCT",6]
[null,"CCCT - Walla Walla - G 1x1","Gas CCCT",6]
[null,"CCCT - Walla Walla - G 2x1","Gas CCCT",6]
[null,"CCCT - Walla Walla - J 1x1","Gas CCCT",6]
[null,"CCCT - WillamValcc - F 2x1","Gas CCCT",6]
[null,"CCCT - WillamValcc - G 1x1","Gas CCCT",6]
[null,"CCCT - WillamValcc - G 2x1","Gas CCCT",6]
[null,"CCCT - WillamValcc - J 1x1","Gas CCCT",6]
[null,"CCCT - WillamValcc - J 2x1","Gas CCCT",6]
[null,"CCCT - Wyoming-NE - F 1x1","Gas CCCT",6]
[null,"CCCT - Wyoming-NE - F 2x1","Gas CCCT",6]
[null,"CCCT - Wyoming-NE - G 1x1","Gas CCCT",{"$f":"MATCH(C77,$G$3:$G$21,0)","v":6}]
[null,"CCCT - Wyoming-NE - G 2x1","Gas CCCT",6]
[null,"CCCT - Wyoming-NE - J 1x1","Gas CCCT",6]
[null,"CCCT - Wyoming-NE - J 2x1","Gas CCCT",6]
[null,"CCCT - Wyoming-SW - F 1x1","Gas CCCT",6]
[null,"CCCT - Wyoming-SW - G 1x1","Gas CCCT",6]
[null,"CCCT - Wyoming-SW - G 2x1","Gas CCCT",6]
[null,"CCCT - Wyoming-SW - J 1x1","Gas CCCT",6]
[null,"CCCT - Wyoming-SW - J 2x1","Gas CCCT",6]
[null,"CCCT - Yakima - G 1x1","Gas CCCT",6]
[null,"Cholla 4","Coal Removed",4]
[null,"Cholla 4  (Coal Early Retirement/Conversions)","Coal Removed",4]
[null,"Coal Ret_AZ - Gas RePower","Gas Conv.",7]
[null,"Coal Ret_Bridger -Gas RePower","Gas Conv.",7]
[null,"Coal Ret_CO - Gas RePower","Gas Conv.",7]
[null,"Coal Ret_WY - Gas RePower","Gas Conv.",7]
[null,"Colstrip 3","Coal Removed",4]
[null,"Colstrip 3  (Coal Early Retirement/Conversions)","Coal Removed",4]
[null,"Colstrip 4","Coal Removed",4]
[null,"Colstrip 4  (Coal Early Retirement/Conversions)","Coal Removed",4]
[null,"Craig 1","Coal Removed",4]
[null,"Craig 1  (Coal Early Retirement/Conversions)","Coal Removed",4]
[null,"Craig 2","Coal Removed",4]
[null,"Craig 2  (Coal Early Retirement/Conversions)","Coal Removed",4]
[null,"DaveJohnston 1","Coal Removed",4]
[null,"DaveJohnston 2","Coal Removed",4]
[null,"DaveJohnston 3","Coal Removed",4]
[null,"DaveJohnston 4","Coal Removed",4]
[null,"Demand Response  Total","-",{"$error":"#N/A"}]
[null,"Demand Response Total","-",{"$error":"#N/A"}]
[null,"Demand Response, CA-3rd Party Contracts","Class 1 DSM",2]
[null,"Demand Response, CA-Cool/WH","Class 1 DSM",2]
[null,"Demand Response, CA-ICE storage","Class 1 DSM",2]
[null,"Demand Response, CA-Irrigate","Class 1 DSM",2]
[null,"Demand Response, CA-Thermostat","Class 1 DSM",2]
[null,"Demand Response, CA-Wtr-3rd Party Contracts","Class 1 DSM",2]
[null,"Demand Response, CA-Wtr-Cool/WH","Class 1 DSM",2]
[null,"Demand Response, CA-Wtr-Space HT","Class 1 DSM",2]
[null,"Demand Response, CA-Wtr-Thermostat","Class 1 DSM",2]
[null,"Demand Response, ID-3rd Party Contracts","Class 1 DSM",2]
[null,"Demand Response, ID-Cool/WH","Class 1 DSM",2]
[null,"Demand Response, ID-ICE storage","Class 1 DSM",2]
[null,"Demand Response, ID-Irrigate","Class 1 DSM",2]
[null,"Demand Response, ID-Smart APPl","Class 1 DSM",2]
[null,"Demand Response, ID-Thermostat","Class 1 DSM",2]
[null,"Demand Response, ID-Wtr-3rd Party Contracts","Class 1 DSM",2]
[null,"Demand Response, ID-Wtr-Cool/WH","Class 1 DSM",2]
[null,"Demand Response, ID-Wtr-Smart APPl","Class 1 DSM",2]
[null,"Demand Response, ID-Wtr-Space HT","Class 1 DSM",2]
[null,"Demand Response, ID-Wtr-Thermostat","Class 1 DSM",2]
[null,"Demand Response, OR-3rd Party Contracts","Class 1 DSM",2]
[null,"Demand Response, OR-Ancillary Services","Class 1 DSM",2]
[null,"Demand Response, OR-Cool/WH","Class 1 DSM",2]
[null,"Demand Response, OR-Elec Vehicle","Class 1 DSM",2]
[null,"Demand Response, OR-ICE storage","Class 1 DSM",2]
[null,"Demand Response, OR-Irrigate","Class 1 DSM",2]
[null,"Demand Response, OR-Room AC","Class 1 DSM",2]
[null,"Demand Response, OR-Smart APPl","Class 1 DSM",2]
[null,"Demand Response, OR-Thermostat","Class 1 DSM",2]
[null,"Demand Response, OR-Wtr-3rd Party Contracts","Class 1 DSM",2]
[null,"Demand Response, OR-Wtr-Cool/WH","Class 1 DSM",2]
[null,"Demand Response, OR-Wtr-Elec Vehicle","Class 1 DSM",2]
[null,"Demand Response, OR-Wtr-Smart APPl","Class 1 DSM",2]
[null,"Demand Response, OR-Wtr-Space HT","Class 1 DSM",2]
[null,"Demand Response, OR-Wtr-Thermostat","Class 1 DSM",{"$f":"MATCH(C141,$G$3:$G$21,0)","v":2}]
[null,"Demand Response, UT-3rd Party Contracts","Class 1 DSM",2]
[null,"Demand Response, UT-Ancillary Services","Class 1 DSM",2]
[null,"Demand Response, UT-Cool/WH","Class 1 DSM",2]
[null,"Demand Response, UT-Elec Vehicle","Class 1 DSM",2]
[null,"Demand Response, UT-ICE storage","Class 1 DSM",2]
[null,"Demand Response, UT-Irrigate","Class 1 DSM",2]
[null,"Demand Response, UT-Room AC","Class 1 DSM",2]
[null,"Demand Response, UT-Smart APPl","Class 1 DSM",2]
[null,"Demand Response, UT-Thermostat","Class 1 DSM",2]
[null,"Demand Response, UT-Wtr-3rd Party Contracts","Class 1 DSM",2]
[null,"Demand Response, UT-Wtr-Cool/WH","Class 1 DSM",2]
[null,"Demand Response, UT-Wtr-Elec Vehicle","Class 1 DSM",2]
[null,"Demand Response, UT-Wtr-Smart APPl","Class 1 DSM",2]
[null,"Demand Response, UT-Wtr-Space HT","Class 1 DSM",2]
[null,"Demand Response, UT-Wtr-Thermostat","Class 1 DSM",2]
[null,"Demand Response, WA-3rd Party Contracts","Class 1 DSM",2]
[null,"Demand Response, WA-Ancillary Services","Class 1 DSM",2]
[null,"Demand Response, WA-Cool/WH","Class 1 DSM",2]
[null,"Demand Response, WA-ICE storage","Class 1 DSM",2]
[null,"Demand Response, WA-Irrigate","Class 1 DSM",2]
[null,"Demand Response, WA-Room AC","Class 1 DSM",2]
[null,"Demand Response, WA-Smart APPl","Class 1 DSM",2]
[null,"Demand Response, WA-Thermostat","Class 1 DSM",2]
[null,"Demand Response, WA-Wtr-3rd Party Contracts","Class 1 DSM",2]
[null,"Demand Response, WA-Wtr-Cool/WH","Class 1 DSM",2]
[null,"Demand Response, WA-Wtr-Smart APPl","Class 1 DSM",2]
[null,"Demand Response, WA-Wtr-Space HT","Class 1 DSM",2]
[null,"Demand Response, WA-Wtr-Thermostat","Class 1 DSM",2]
[null,"Demand Response, WY-3rd Party Contracts","Class 1 DSM",2]
[null,"Demand Response, WY-Ancillary Services","Class 1 DSM",2]
[null,"Demand Response, WY-Cool/WH","Class 1 DSM",2]
[null,"Demand Response, WY-ICE storage","Class 1 DSM",2]
[null,"Demand Response, WY-Irrigate","Class 1 DSM",2]
[null,"Demand Response, WY-Room AC","Class 1 DSM",2]
[null,"Demand Response, WY-Smart APPl","Class 1 DSM",2]
[null,"Demand Response, WY-Thermostat","Class 1 DSM",2]
[null,"Demand Response, WY-Wtr-3rd Party Contracts","Class 1 DSM",2]
[null,"Demand Response, WY-Wtr-Cool/WH","Class 1 DSM",2]
[null,"Demand Response, WY-Wtr-Smart APPl","Class 1 DSM",2]
[null,"Demand Response, WY-Wtr-Space HT","Class 1 DSM",2]
[null,"Demand Response, WY-Wtr-Thermostat","Class 1 DSM",2]
[null,"Energy Efficiency  Total","-",{"$error":"#N/A"}]
[null,"Energy Efficiency Total","-",{"$error":"#N/A"}]
[null,"Energy Efficiency, CA","Class 2 DSM",3]
[null,"Energy Efficiency, ID","Class 2 DSM",3]
[null,"Energy Efficiency, OR","Class 2 DSM",3]
[null,"Energy Efficiency, UT","Class 2 DSM",3]
[null,"Energy Efficiency, WA","Class 2 DSM",3]
[null,"Energy Efficiency, WY","Class 2 DSM",3]
[null,"Existing Plant Retirements and PPA Termination","-",{"$error":"#N/A"}]
[null,"Expansion Resources","-",{"$error":"#N/A"}]
[null,"Expire - Solar PPA","Solar Removed",14]
[null,"Expire - Wind PPA","Wind Removed",17]
[null,"FOT","FOT",5]
[null,"FOT East - Summer","FOT",5]
[null,"FOT East - Winter","Winter FOT",19]
[null,"FOT West - Summer","FOT",5]
[null,"FOT West - Winter","Winter FOT",19]
[null,"Gadsby 1-6","Gas Removed",9]
[null,"Geothermal, Greenfield - East","?",{"$error":"#N/A"}]
[null,"Geothermal, Greenfield - West","?",{"$error":"#N/A"}]
[null,"Hayden 1","Coal Removed",4]
[null,"Hayden 1  (Coal Early Retirement/Conversions)","Coal Removed",4]
[null,"Hayden 2","Coal Removed",{"$f":"MATCH(C205,$G$3:$G$21,0)","v":4}]
[null,"Hayden 2  (Coal Early Retirement/Conversions)","Coal Removed",4]
[null,"Hermiston","Gas Removed",{"$f":"MATCH(C207,$G$3:$G$21,0)","v":9}]
[null,"Hunter 1","Coal Removed",4]
[null,"Hunter 1  (Coal Early Retirement/Conversions)","Coal Removed",4]
[null,"Hunter 2","Coal Removed",4]
[null,"Hunter 2  (Coal Early Retirement/Conversions)","Coal Removed",4]
[null,"Hunter 3","Coal Removed",4]
[null,"Hunter 3  (Coal Early Retirement/Conversions)","Coal Removed",4]
[null,"Huntington 1","Coal Removed",4]
[null,"Huntington 1  (Coal Early Retirement/Conversions)","Coal Removed",4]
[null,"Huntington 2","Coal Removed",4]
[null,"Huntington 2  (Coal Early Retirement/Conversions)","Coal Removed",4]
[null,"IC Aero GO","Gas Peaker",8]
[null,"IC Aero HTN","Gas Peaker",8]
[null,"IC Aero HTR","Gas Peaker",8]
[null,"IC Aero JB","Gas Peaker",8]
[null,"IC Aero NTN","Gas Peaker",8]
[null,"IC Aero PO","Gas Peaker",8]
[null,"IC Aero SO","Gas Peaker",8]
[null,"IC Aero UN","Gas Peaker",8]
[null,"IC Aero US","Gas Peaker",8]
[null,"IC Aero WV","Gas Peaker",8]
[null,"IC Aero WW","Gas Peaker",8]
[null,"IC Aero WYAE","Gas Peaker",8]
[null,"IC Aero WYD","Gas Peaker",8]
[null,"IC Aero WYNE","Gas Peaker",8]
[null,"IC Aero WYSW","Gas Peaker",8]
[null,"JimBridger 1","Coal Removed",4]
[null,"JimBridger 1  (Coal Early Retirement/Conversions)","Coal Removed",4]
[null,"JimBridger 2","Coal Removed",4]
[null,"JimBridger 2  (Coal Early Retirement/Conversions)","Coal Removed",4]
[null,"JimBridger 3","Coal Removed",4]
[null,"JimBridger 3  (Coal Early Retirement/Conversions)","Coal Removed",4]
[null,"JimBridger 4","Coal Removed",4]
[null,"JimBridger 4  (Coal Early Retirement/Conversions)","Coal Removed",4]
[null,"Naughton 1","Coal Removed",4]
[null,"Naughton 1  (Coal Early Retirement/Conversions)","Coal Removed",4]
[null,"Naughton 2","Coal Removed",4]
[null,"Naughton 2  (Coal Early Retirement/Conversions)","Coal Removed",4]
[null,"Naughton 3","Coal Removed",4]
[null,"Naughton 3  (Coal Early Retirement/Conversions)","Coal Removed",4]
[null,"Pump Storage - East","Pumped Storage",12]
[null,"Pump Storage - West","Pumped Storage",12]
[null,"Reciprocating Engine - East","Gas Peaker",8]
[null,"Retire - Hydro","Hydro Removed",10]
[null,"Retire - Other","Other Removed",11]
[null,"Retire - Wind","Wind Removed",17]
[null,"SCCT Aero DJ","Gas Peaker",8]
[null,"SCCT Aero GO","Gas Peaker",8]
[null,"SCCT Aero HTN","Gas Peaker",8]
[null,"SCCT Aero HTR","Gas Peaker",8]
[null,"SCCT Aero JB","Gas Peaker",8]
[null,"SCCT Aero NTN","Gas Peaker",8]
[null,"SCCT Aero PNC","Gas Peaker",8]
[null,"SCCT Aero SO","Gas Peaker",8]
[null,"SCCT Aero UN","Gas Peaker",8]
[null,"SCCT Aero US","Gas Peaker",8]
[null,"SCCT Aero WV","Gas Peaker",8]
[null,"SCCT Aero WW","Gas Peaker",8]
[null,"SCCT Aero WYD","Gas Peaker",8]
[null,"SCCT Aero WYNE","Gas Peaker",8]
[null,"SCCT Aero WYSW","Gas Peaker",8]
[null,"SCCT Frame DJ","Gas Peaker",8]
[null,"SCCT Frame HTN","Gas Peaker",8]
[null,"SCCT Frame HTR","Gas Peaker",8]
[null,"SCCT Frame ID","Gas Peaker",{"$f":"MATCH(C271,$G$3:$G$21,0)","v":8}]
[null,"SCCT Frame JB","Gas Peaker",8]
[null,"SCCT Frame NTN","Gas Peaker",8]
[null,"SCCT Frame PNC","Gas Peaker",8]
[null,"SCCT Frame SO","Gas Peaker",8]
[null,"SCCT Frame UTN","Gas Peaker",8]
[null,"SCCT Frame UTS","Gas Peaker",8]
[null,"SCCT Frame WV","Gas Peaker",8]
[null,"SCCT Frame WW","Gas Peaker",8]
[null,"SCCT Frame WYAE","Gas Peaker",8]
[null,"SCCT Frame WYD","Gas Peaker",8]
[null,"SCCT Frame WYNE","Gas Peaker",8]
[null,"SCCT Frame WYSW","Gas Peaker",8]
[null,"SCCT Frame YK","Gas Peaker",8]
[null,"Total CCCT","-",{"$error":"#N/A"}]
[null,"Total SCCT","-",{"$error":"#N/A"}]
[null,"Total Solar","-",{"$error":"#N/A"}]
[null,"Total Wind","-",{"$error":"#N/A"}]
[null,"Utility Biomass - West","?",{"$error":"#N/A"}]
[null,"Utility Solar - PV - Borah","Solar",13]
[null,"Utility Solar - PV - GO","Solar",13]
[null,"Utility Solar - PV - Hunter","Solar",13]
[null,"Utility Solar - PV - Huntington","Solar",13]
[null,"Utility Solar - PV - jbridger","Solar",13]
[null,"Utility Solar - PV - Naughton","Solar",13]
[null,"Utility Solar - PV - S-Oregon","Solar",13]
[null,"Utility Solar - PV - Utah-N","Solar",13]
[null,"Utility Solar - PV - Utah-S","Solar",13]
[null,"Utility Solar - PV - Walla Walla","Solar",13]
[null,"Utility Solar - PV - WYNE","Solar",13]
[null,"Utility Solar - PV - WYSW","Solar",13]
[null,"Utility Solar - PV - Yakima","Solar",13]
[null,"Utility Solar+Storage - PV - Borah","Solar+Bat",15]
[null,"Utility Solar+Storage - PV - GO","Solar+Bat",15]
[null,"Utility Solar+Storage - PV - Hunter","Solar+Bat",15]
[null,"Utility Solar+Storage - PV - Huntington","Solar+Bat",15]
[null,"Utility Solar+Storage - PV - Jbridger","Solar+Bat",15]
[null,"Utility Solar+Storage - PV - S-Oregon","Solar+Bat",15]
[null,"Utility Solar+Storage - PV - Utah-S","Solar+Bat",15]
[null,"Utility Solar+Storage - PV - WYSW","Solar+Bat",15]
[null,"Utility Solar+Storage - PV - Yakima","Solar+Bat",15]
[null,"UTS IGCC CCS","Gas Conv.",7]
[null,"Wind, Borah","Wind",16]
[null,"Wind, Djohnston","Wind",16]
[null,"Wind, GO","Wind",16]
[null,"Wind, Jbridger","Wind",16]
[null,"Wind, SO","Wind",16]
[null,"Wind, UT","Wind",16]
[null,"Wind, WallaW","Wind",16]
[null,"Wind, WV","Wind",16]
[null,"Wind, WYAE","Wind",16]
[null,"Wind, WYNE","Wind",16]
[null,"Wind, WYSW","Wind",16]
[null,"Wind, YK","Wind",16]
[null,"Wind+Storage, Borah","Wind+Bat",18]
[null,"Wind+Storage, GO","Wind+Bat",18]
[null,"Wind+Storage, jbridger","Wind+Bat",{"$f":"MATCH(C327,$G$3:$G$21,0)","v":18}]
[null,"Wind+Storage, PNC","Wind+Bat",18]
[null,"Wind+Storage, UT","Wind+Bat",18]
[null,"Wind+Storage, WYAE","Wind+Bat",18]
[null,"Wind+Storage, YK","Wind+Bat",18]
[null,"WY IGCC CCS","Gas Conv.",7]
[null,"Wyodak","Coal Removed",4]
[null,"Wyodak  (Coal Early Retirement/Conversions)","Coal Removed",4]
[null,"Utility Solar+Storage - PV - Utah-N","Solar+Bat",15]