{"text_format":"1","workbook":"xlsx","n_sheets":43,"sheets":["Ex 1 HDD","Exhibit 1.1","Exhibit 1.2","Exhibit 1.3","Ex 2 Clay Basin","Ex 2 Aquifers","Ex 2 Spire Storage West","Exhibit 2.1","Exhibit 2.2","Exhibit 2.3","Exhibit 2.4","Exhibit 2.5","Exhibit 2.6","Exhibit Firm Sales Volume","Exhibit 3.1","Exhibit 3.2","Exhibit 3.3","Exhibit 3.4","Ex 4 Purchase Gas","Exhibit 4.1","Exhibit 4.2","Exhibit 4.3","Ex 5 Purchase Gas Cost","Exhibit 5.1","Exhibit 5.2","Exhibit 5.3","Ex 6 Purch Gas Unit Cost","Exhibit 6.1","Exhibit 6.2","Ex 7 Co. Owned Gas","Exhibit 7.1","Exhibit 7.2","Exhibit 7.3","Ex 8 New Drill","Exhibit 8.1","Exhibit 8.2","Exhibit 8.3","Company Nom Groups","Normal Purchase %","IRP Pruch Cover Sheet","Shut-In","Deleted Exhibit 2.5","Deleted Exhibit 2.6"],"not_rendered":{"charts":28,"images":0,"macros":1,"external_links":11,"defined_names":1378,"comments":3,"pivot_tables":0},"unopened":[],"bounds":{"document_bytes":16777216,"sheet_cells":100000,"rows_first":2000,"rows_last":500,"rows_between":2000,"halvings":0,"cell_chars":16384,"cell_head_chars":4096},"cells_cut":0,"cells_raw":0,"read":"whole","date_system":"1900"}

{"sheet":"Ex 1 HDD","index":0,"n_rows":36,"n_cols":9,"rows_kept":36,"cut":false,"hidden":false,"merged":[[0,0,0,5],[1,0,1,5],[1,8,1,9],[26,0,26,6],[4,0,4,6]]}
["Heating Degree Days",null,null,null,null,null,"Docket",null,"Dominion Energy Utah"]
[null,null,null,null,null,null,null,null,"Docket No. 19-057-01"]
[null,null,null,null,null,null,null,null,"DEU Variance Exhibit"]
[]
[]
[]
{"$rows_left_out":31}
{"sheet":"Exhibit 1.1","index":1,"n_rows":32,"n_cols":17,"rows_kept":32,"cut":false,"hidden":false,"merged":[]}
[]
[]
[]
[]
[]
[]
{"$rows_left_out":27}
{"sheet":"Exhibit 1.2","index":2,"n_rows":32,"n_cols":17,"rows_kept":32,"cut":false,"hidden":false,"merged":[]}
[]
[]
[]
[]
[]
[]
{"$rows_left_out":27}
{"sheet":"Exhibit 1.3","index":3,"n_rows":32,"n_cols":17,"rows_kept":32,"cut":false,"hidden":false,"merged":[]}
[]
[]
[]
[]
[]
[]
{"$rows_left_out":27}
{"sheet":"Ex 2 Clay Basin","index":4,"n_rows":76,"n_cols":21,"rows_kept":76,"cut":false,"hidden":false,"merged":[[3,0,3,8],[0,0,0,8],[4,0,4,8],[1,0,1,4],[2,0,2,5]]}
["Clay Basin Ending Inventory (MDths)"]
[]
[]
[]
[null,null,null,null,null,null,null,null,null,null,null,null,"Plan Year 1",1106]
[null,null,null,null,null,null,null,null,null,null,"Month/Year","Month","Inj","With","Total"]
{"$rows_left_out":71}
{"sheet":"Ex 2 Aquifers","index":5,"n_rows":48,"n_cols":21,"rows_kept":48,"cut":false,"hidden":false,"merged":[[31,0,31,11],[2,0,2,14],[1,0,1,14],[3,0,3,9]]}
["Total Aquifer Storage Ending Inventory (MDths)"]
[]
[]
[null,null,null,null,null,null,null,null,null,null,null,null,null,null,1082,1106]
[]
[null,null,null,null,null,null,null,1.0549999999999999,null,null,null,null,"Month/Year","Month","Inj","With","Total"]
{"$rows_left_out":43}
{"sheet":"Ex 2 Spire Storage West","index":6,"n_rows":21,"n_cols":17,"rows_kept":21,"cut":false,"hidden":false,"merged":[]}
[]
[]
[]
[]
[null,null,null,null,null,null,null,null,null,null,null,null,null,null,1082,1106]
[null,null,null,null,null,null,null,1000,null,null,null,null,null,"Month","Inj","With","Total"]
{"$rows_left_out":16}
{"sheet":"Exhibit 2.1","index":7,"n_rows":32,"n_cols":23,"rows_kept":32,"cut":false,"hidden":false,"merged":[]}
[]
[]
[]
[]
[]
[]
{"$rows_left_out":27}
{"sheet":"Exhibit 2.2","index":8,"n_rows":32,"n_cols":17,"rows_kept":32,"cut":false,"hidden":false,"merged":[]}
[]
[]
[]
[]
[]
[]
{"$rows_left_out":27}
{"sheet":"Exhibit 2.3","index":9,"n_rows":32,"n_cols":17,"rows_kept":32,"cut":false,"hidden":false,"merged":[]}
[]
[]
[]
[]
[]
[]
{"$rows_left_out":27}
{"sheet":"Exhibit 2.4","index":10,"n_rows":32,"n_cols":17,"rows_kept":32,"cut":false,"hidden":false,"merged":[]}
[]
[]
[]
[]
[]
[]
{"$rows_left_out":27}
{"sheet":"Exhibit 2.5","index":11,"n_rows":32,"n_cols":17,"rows_kept":32,"cut":false,"hidden":false,"merged":[]}
[]
[]
[]
[]
[]
[]
{"$rows_left_out":27}
{"sheet":"Exhibit 2.6","index":12,"n_rows":32,"n_cols":17,"rows_kept":32,"cut":false,"hidden":false,"merged":[]}
[]
[]
[]
[]
[]
[]
{"$rows_left_out":27}
{"sheet":"Exhibit Firm Sales Volume","index":13,"n_rows":20,"n_cols":9,"rows_kept":20,"cut":false,"hidden":false,"merged":[[1,0,1,9],[5,7,5,9]]}
["Demand"]
[]
[]
[]
[]
[null,null,null,null,null,null,null,"Cumulative"]
{"$rows_left_out":15}
{"sheet":"Exhibit 3.1","index":14,"n_rows":32,"n_cols":17,"rows_kept":32,"cut":false,"hidden":false,"merged":[]}
[]
[]
[]
[]
[]
[]
{"$rows_left_out":27}
{"sheet":"Exhibit 3.2","index":15,"n_rows":32,"n_cols":17,"rows_kept":32,"cut":false,"hidden":false,"merged":[]}
[]
[]
[]
[]
[]
[]
{"$rows_left_out":27}
{"sheet":"Exhibit 3.3","index":16,"n_rows":32,"n_cols":17,"rows_kept":32,"cut":false,"hidden":false,"merged":[]}
[]
[]
[]
[]
[]
[]
{"$rows_left_out":27}
{"sheet":"Exhibit 3.4","index":17,"n_rows":54,"n_cols":8,"rows_kept":54,"cut":false,"hidden":false,"merged":[[8,2,8,3],[8,4,8,5],[8,6,8,7]]}
[null,null,null,null,null,null,null,"Dominion Energy Utah"]
[null,null,null,null,null,null,null,"Docket No. 19-057-01"]
[null,null,null,null,null,null,null,"DEU Variance Exhibit 3.4"]
[]
[]
[null,"IRP Variance"]
{"$rows_left_out":49}
{"sheet":"Ex 4 Purchase Gas","index":18,"n_rows":23,"n_cols":13,"rows_kept":23,"cut":false,"hidden":false,"merged":[[5,6,5,7]]}
["Purchase Gas Variance (Brady Included) MDths"]
[]
[]
[]
[]
[null,null,null,null,null,null,"Cumulative"]
{"$rows_left_out":18}
{"sheet":"Exhibit 4.1","index":19,"n_rows":32,"n_cols":17,"rows_kept":32,"cut":false,"hidden":false,"merged":[]}
[]
[]
[]
[]
[]
[]
{"$rows_left_out":27}
{"sheet":"Exhibit 4.2","index":20,"n_rows":31,"n_cols":17,"rows_kept":31,"cut":false,"hidden":false,"merged":[]}
[]
[]
[]
[]
[]
[]
{"$rows_left_out":26}
{"sheet":"Exhibit 4.3","index":21,"n_rows":32,"n_cols":17,"rows_kept":32,"cut":false,"hidden":false,"merged":[]}
[]
[]
[]
[]
[]
[]
{"$rows_left_out":27}
{"sheet":"Ex 5 Purchase Gas Cost","index":22,"n_rows":21,"n_cols":6,"rows_kept":21,"cut":false,"hidden":false,"merged":[[1,0,1,6],[0,0,0,6],[2,0,2,7],[5,4,5,5]]}
["Purchase Gas Cost Variance ($1,000's)"]
[]
[]
[]
[]
[null,null,null,null,"Cumulative"]
{"$rows_left_out":16}
{"sheet":"Exhibit 5.1","index":23,"n_rows":32,"n_cols":17,"rows_kept":32,"cut":false,"hidden":false,"merged":[]}
[]
[]
[]
[]
[]
[]
{"$rows_left_out":27}
{"sheet":"Exhibit 5.2","index":24,"n_rows":33,"n_cols":17,"rows_kept":33,"cut":false,"hidden":false,"merged":[]}
[]
[]
[]
[]
[]
[]
{"$rows_left_out":28}
{"sheet":"Exhibit 5.3","index":25,"n_rows":32,"n_cols":17,"rows_kept":32,"cut":false,"hidden":false,"merged":[]}
[]
[]
[]
[]
[]
[]
{"$rows_left_out":27}
{"sheet":"Ex 6 Purch Gas Unit Cost","index":26,"n_rows":47,"n_cols":13,"rows_kept":47,"cut":false,"hidden":false,"merged":[[0,0,0,5],[1,0,1,7],[2,0,2,7],[46,2,46,13]]}
["Purchase Gas Unit Cost Variance ($1,000's)"]
[]
[]
[]
[]
[null,null,null,null,"Actual","Actual","Actual",null,"Normal","Normal","Normal"]
{"$rows_left_out":42}
{"sheet":"Exhibit 6.1","index":27,"n_rows":32,"n_cols":17,"rows_kept":32,"cut":false,"hidden":false,"merged":[]}
[]
[]
[]
[]
[]
[]
{"$rows_left_out":27}
{"sheet":"Exhibit 6.2","index":28,"n_rows":32,"n_cols":17,"rows_kept":32,"cut":false,"hidden":false,"merged":[]}
[]
[]
[]
[]
[]
[]
{"$rows_left_out":27}
{"sheet":"Ex 7 Co. Owned Gas","index":29,"n_rows":21,"n_cols":17,"rows_kept":21,"cut":false,"hidden":false,"merged":[[0,0,0,7],[2,14,2,19],[1,0,1,7],[2,0,2,10]]}
["Cost-of-Service Gas Variance (MDths)"]
[]
[]
[]
[]
[null,null,null,null,null,null,null,"Cumulative"]
{"$rows_left_out":16}
{"sheet":"Exhibit 7.1","index":30,"n_rows":33,"n_cols":17,"rows_kept":33,"cut":false,"hidden":false,"merged":[]}
[]
[]
[]
[]
[]
[]
{"$rows_left_out":28}
{"sheet":"Exhibit 7.2","index":31,"n_rows":32,"n_cols":17,"rows_kept":32,"cut":false,"hidden":false,"merged":[]}
[]
[]
[]
[]
[]
[]
{"$rows_left_out":27}
{"sheet":"Exhibit 7.3","index":32,"n_rows":32,"n_cols":17,"rows_kept":32,"cut":false,"hidden":false,"merged":[]}
[]
[]
[]
[]
[]
[]
{"$rows_left_out":27}
{"sheet":"Ex 8 New Drill","index":33,"n_rows":19,"n_cols":13,"rows_kept":19,"cut":false,"hidden":false,"merged":[[0,0,0,9],[1,0,1,9],[2,0,2,9]]}
["Isolated New Drill Component (MDths)"]
[]
[]
[]
[]
[null,null,null,null,null,null,null,null,null,"Cumulative",null,"Cumulative"]
{"$rows_left_out":14}
{"sheet":"Exhibit 8.1","index":34,"n_rows":32,"n_cols":17,"rows_kept":32,"cut":false,"hidden":false,"merged":[]}
[]
[]
[]
[]
[]
[]
{"$rows_left_out":27}
{"sheet":"Exhibit 8.2","index":35,"n_rows":32,"n_cols":17,"rows_kept":32,"cut":false,"hidden":false,"merged":[]}
[]
[]
[]
[]
[]
[]
{"$rows_left_out":27}
{"sheet":"Exhibit 8.3","index":36,"n_rows":32,"n_cols":17,"rows_kept":32,"cut":false,"hidden":false,"merged":[]}
[]
[]
[]
[]
[]
[]
{"$rows_left_out":27}
{"sheet":"Company Nom Groups","index":37,"n_rows":217,"n_cols":96,"rows_kept":217,"cut":false,"hidden":true,"merged":[[102,55,108,55],[48,53,54,53],[48,54,54,54],[48,55,54,55],[56,53,57,53],[1,29,1,31],[2,29,2,31],[1,41,1,43],[2,41,2,43],[1,45,1,47],[1,17,1,19],[2,17,2,19],[1,25,1,27],[2,25,2,27],[1,21,1,23],[2,21,2,23],[1,49,1,51],[2,49,2,51],[58,33,59,33],[1,37,1,39],[2,37,2,39],[2,45,2,47],[50,35,56,35],[114,33,116,33],[111,53,112,53],[102,53,108,53],[102,54,108,54],[1,89,1,91],[60,74,61,74],[2,89,2,91],[1,58,1,60],[2,58,2,60],[1,62,1,64],[50,34,56,34],[50,33,56,33],[104,35,110,35],[104,34,110,34],[104,33,110,33],[1,70,1,72],[117,74,118,74],[51,75,59,75],[51,74,59,74],[51,73,59,73],[106,75,116,75],[106,74,116,74],[106,73,116,73],[1,93,1,95],[2,93,2,95],[2,62,2,64],[1,66,1,68],[2,66,2,68],[2,70,2,72],[2,81,2,83],[2,85,2,87],[1,81,1,83],[1,85,1,87]]}
["Company Nom Groups"]
["Withdrawn Gross Volume (MDths)",null,null,1106,null,null,null,null,null,null,null,null,null,null,null,null,null,"June 2019 Cost-of-Service",null,null,null,"July 2019 Cost-of-Service",null,null,null,"August 2019 Cost-of-Service",null,null,null,"First Quarter Cost-of-Service",null,null,null,null,null,null,null,"September 2019 Cost-of-Service",null,null,null,"October 2019 Cost-of-Service",null,null,null,"November 2019 Cost-of-Service",null,null,null,"Second Quarter Cost-of-Service",null,null,null,null,null,null,null,null,"December 2019 Cost-of-Service",null,null,null,"January 2020 Cost-of-Service",null,null,null,"February 2020 Cost-of-Service",null,null,null,"Third Quarter Cost-of-Service",null,null,null,null,null,null,null,null,null,null,"March 2020 Cost-of-Service",null,null,null,"April 2020 Cost-of-Service",null,null,null,"May 2020 Cost-of-Service",null,null,null,"Fourth Quarter Cost-of-Service"]
["Source: IRP Base Case, Monthly Custom Report Writer",null,null,null,null,null,null,null,null,null,null,null,null,null,null,null,null,"Variance   Mdth",null,null,null,"Variance   Mdth",null,null,null,"Variance   Mdth",null,null,null,"Variance   Mdth",null,null,null,null,null,null,null,"Variance   Mdth",null,null,null,"Variance   Mdth",null,null,null,"Variance   Mdth",null,null,null,"Variance   Mdth",null,null,null,null,null,null,null,null,"Variance   Mdth",null,null,null,"Variance   Mdth",null,null,null,"Variance   Mdth",null,null,null,"Variance   Mdth",null,null,null,null,null,null,null,null,null,null,"Variance   Mdth",null,null,null,"Variance   Mdth",null,null,null,"Variance   Mdth",null,null,null,"Variance   Mdth"]
[null,2,3,4,5,6,7,8,9,10,11,12,13]
["Nomination Group Production","2019-06-01","2019-07-01","2019-08-01","2019-09-01","2019-10-01","2019-11-01","2019-12-01","2020-01-01","2020-02-01","2020-03-01","2020-04-01","2020-05-01","Total",null,null,null,"Nomination Group","Actual ","Normal",null,"Nomination Group","Actual ","Normal",null,"Nomination Group","Actual ","Normal",null,"Nomination Group","Actual ","Normal",null,null,null,null,null,"Nomination Group","Actual ","Normal",null,"Nomination Group","Actual ","Normal",null,{"$f":"AP5","v":"Nomination Group"},{"$f":"AQ5","v":"Actual "},"Normal",null,{"$f":"AT5","v":"Nomination Group"},{"$f":"AU5","v":"Actual "},{"$f":"AV5","v":"Normal"},null,null,null,null,null,null,"Nomination Group","Actual ","Normal",null,"Nomination Group","Actual ","Normal",null,"Nomination Group","Actual ","Normal",null,{"$f":"BO5","v":"Nomination Group"},{"$f":"BP5","v":"Actual "},{"$f":"BQ5","v":"Normal"},null,null,null,null,null,null,null,null,"Nomination Group","Actual ","Normal",null,"Nomination Group","Actual ","Normal",null,"Nomination Group","Actual ","Normal",null,"Nomination Group","Actual ","Normal"]
["BIRCH CREEK",126.669,130.07,129.251,124.29600000000001,127.63,122.739,126.03400000000001,125.24299999999999,116.426,123.675,118.935,122.131,{"$f":"SUM(B6:M6)","v":1493.0989999999999},null,null,null,{"$f":"A6","v":"BIRCH CREEK"},{"$f":"IFERROR(VLOOKUP(R6,$R$122:$S$216,2,FALSE),0)","v":142.053},{"$f":"IFERROR(VLOOKUP(R6,$A$6:$M$125,2,FALSE),\"\")","v":126.669},null,{"$f":"R6","v":"BIRCH CREEK"},{"$f":"IFERROR(VLOOKUP(V6,$V$122:$W$216,2,FALSE),0)","v":143.52000000000001},{"$f":"IFERROR(VLOOKUP(V6,$A$6:$M$125,3,FALSE),\"\")","v":130.07},null,{"$f":"R6","v":"BIRCH CREEK"},{"$f":"IFERROR(VLOOKUP(A6,$Z$122:$AA$216,2,FALSE),0)","v":149.054},{"$f":"IFERROR(VLOOKUP(Z6,$A$6:$M$125,4,FALSE),\"\")","v":129.251},null,{"$f":"R6","v":"BIRCH CREEK"},{"$f":"SUM(S6,W6,AA6)","v":434.62699999999995},{"$f":"SUM(T6,X6,AB6)","v":385.99},null,null,null,null,null,{"$f":"AD6","v":"BIRCH CREEK"},{"$f":"IFERROR(VLOOKUP(AL6,$AL$122:$AM$212,2,FALSE),0)","v":129.584},{"$f":"IFERROR(VLOOKUP(AL6,$A$6:$M$125,5,FALSE),\"\")","v":124.29600000000001},null,{"$f":"AL6","v":"BIRCH CREEK"},{"$f":"IFERROR(VLOOKUP(AP6,$AP$122:$AQ$221,2,FALSE),0)","v":123.797},{"$f":"IFERROR(VLOOKUP($AP6,$A$6:$M$125,6,FALSE),\"\")","v":127.63},null,{"$f":"AP6","v":"BIRCH CREEK"},{"$f":"IFERROR(VLOOKUP(AT6,$AT$122:$AU$214,2,FALSE),0)","v":116.63200000000001},{"$f":"IFERROR(VLOOKUP($AT6,$A$6:$M$125,7,FALSE),\"\")","v":122.739},null,{"$f":"AT6","v":"BIRCH CREEK"},{"$f":"SUM(AM6,AQ6,AU6)","v":370.01300000000003},{"$f":"SUM(AN6,AR6,AV6)","v":374.66499999999996},null,null,null,null,null,null,{"$f":"R6","v":"BIRCH CREEK"},{"$f":"IFERROR(VLOOKUP($BG6,$BG$120:$BH$215,2,FALSE),0)","v":101.006},{"$f":"IFERROR(VLOOKUP($BG6,$A$6:$M$125,8,FALSE),\"\")","v":126.03400000000001},null,{"$f":"R6","v":"BIRCH CREEK"},{"$f":"IFERROR(VLOOKUP($BK6,$BK$120:$BL$215,2,FALSE),0)","v":113.621},{"$f":"IFERROR(VLOOKUP($BK6,$A$6:$M$125,9,FALSE),\"\")","v":125.24299999999999},null,{"$f":"A6","v":"BIRCH CREEK"},{"$f":"IFERROR(VLOOKUP($BO6,$BO$120:$BP$215,2,FALSE),0)","v":112.086},{"$f":"IFERROR(VLOOKUP($BO6,$A$6:$M$125,10,FALSE),0)","v":116.426},null,{"$f":"A6","v":"BIRCH CREEK"},{"$f":"SUM(BH6,BL6,BP6)","v":326.71300000000002},{"$f":"SUM(BI6,BM6,BQ6)","v":367.70299999999997},null,null,null,null,null,null,null,null,{"$f":"A6","v":"BIRCH CREEK"},2.7,{"$f":"IFERROR(VLOOKUP($A6,$A$6:$M$125,11,FALSE),\"\")","v":123.675},null,{"$f":"A6","v":"BIRCH CREEK"},2.7,{"$f":"IFERROR(VLOOKUP($A6,$A$6:$M$125,12,FALSE),\"\")","v":118.935},null,{"$f":"A6","v":"BIRCH CREEK"},2.7,{"$f":"IFERROR(VLOOKUP($A6,$A$6:$M$125,13,FALSE),\"\")","v":122.131},null,"BIRCH CREEK",0,386.68978881835937]
{"$rows_left_out":212}
{"sheet":"Normal Purchase %","index":38,"n_rows":34,"n_cols":15,"rows_kept":34,"cut":false,"hidden":true,"merged":[[1,0,1,8]]}
[]
[]
[null,2,3,4,5,6,7,8,9]
["Month","Actual Purchase Mdth","Normal Purchase Mdth","Actual Company Mdth","Normal Company Mdths","Actual Purchase as Percent of Total","Normal Purchase as Percent of Total","Actual Cost-of-Service as Percent of Total","Normal Cost-of-Service as Percent of Total",null,"Check Should = 100%","Check Should = 100%"]
[{"$f":"'Ex 1 HDD'!A8","v":"2019-06-01"},{"$f":"'Ex 4 Purchase Gas'!B8","v":0},{"$f":"'Ex 4 Purchase Gas'!C8","v":777.38300000000004},{"$f":"'Ex 7 Co. Owned Gas'!B8","v":5977.3370000000004},{"$f":"'Ex 7 Co. Owned Gas'!C8","v":5747.91},{"$f":"IFERROR(B5/(B5+D5),0)","v":0},{"$f":"C5/(C5+E5)","v":0.11913380747807034},{"$f":"IFERROR(D5/(D5+B5),0)","v":1},{"$f":"E5/(E5+C5)","v":0.88086619252192966},null,{"$f":"F5+H5","v":1},{"$f":"G5+I5","v":1}]
[{"$f":"'Ex 1 HDD'!A9","v":"2019-07-01"},{"$f":"'Ex 4 Purchase Gas'!B9","v":0},{"$f":"'Ex 4 Purchase Gas'!C9","v":0},{"$f":"'Ex 7 Co. Owned Gas'!B9","v":6115.5940000000019},{"$f":"'Ex 7 Co. Owned Gas'!C9","v":5860.6560000000009},{"$f":"IFERROR(B6/(B6+D6),0)","v":0},0,{"$f":"IFERROR(D6/(D6+B6),0)","v":1},1,null,1,1]
{"$rows_left_out":29}
{"sheet":"IRP Pruch Cover Sheet","index":39,"n_rows":15,"n_cols":5,"rows_kept":15,"cut":false,"hidden":true,"merged":[]}
[null,2,3,4,5]
[null,{"$f":"'Normal Purchase %'!F24","v":"Actual Purchase as Percent of Total"},{"$f":"'Normal Purchase %'!G24","v":"Normal Purchase as Percent of Total"},{"$f":"'Normal Purchase %'!H24","v":"Actual Cost-of-Service as Percent of Total"},{"$f":"'Normal Purchase %'!I24","v":"Normal Cost-of-Service as Percent of Total"}]
[]
[{"$f":"'Normal Purchase %'!E25","v":"2019-12-01"},{"$f":"VLOOKUP($A4,'Normal Purchase %'!$E$25:$I$27,'IRP Pruch Cover Sheet'!B$1,FALSE)","v":0.64313317358250277},{"$f":"VLOOKUP($A4,'Normal Purchase %'!$E$25:$I$27,'IRP Pruch Cover Sheet'!C$1,FALSE)","v":0.64767170508374183},{"$f":"VLOOKUP($A4,'Normal Purchase %'!$E$25:$I$27,'IRP Pruch Cover Sheet'!D$1,FALSE)","v":0.35686682641749712},{"$f":"VLOOKUP($A4,'Normal Purchase %'!$E$25:$I$27,'IRP Pruch Cover Sheet'!E$1,FALSE)","v":0.35232829491625817}]
[{"$f":"'Normal Purchase %'!E26","v":"2020-01-01"},{"$f":"VLOOKUP($A5,'Normal Purchase %'!$E$25:$I$27,'IRP Pruch Cover Sheet'!B$1,FALSE)","v":0.60106579236478264},{"$f":"VLOOKUP($A5,'Normal Purchase %'!$E$25:$I$27,'IRP Pruch Cover Sheet'!C$1,FALSE)","v":0.68469220441838141},{"$f":"VLOOKUP($A5,'Normal Purchase %'!$E$25:$I$27,'IRP Pruch Cover Sheet'!D$1,FALSE)","v":0.39893420763521736},{"$f":"VLOOKUP($A5,'Normal Purchase %'!$E$25:$I$27,'IRP Pruch Cover Sheet'!E$1,FALSE)","v":0.31530779558161864}]
[{"$f":"'Normal Purchase %'!E27","v":"2020-02-01"},{"$f":"VLOOKUP($A6,'Normal Purchase %'!$E$25:$I$27,'IRP Pruch Cover Sheet'!B$1,FALSE)","v":0.62823058965115619},{"$f":"VLOOKUP($A6,'Normal Purchase %'!$E$25:$I$27,'IRP Pruch Cover Sheet'!C$1,FALSE)","v":0.65636320003096382},{"$f":"VLOOKUP($A6,'Normal Purchase %'!$E$25:$I$27,'IRP Pruch Cover Sheet'!D$1,FALSE)","v":0.37176941034884375},{"$f":"VLOOKUP($A6,'Normal Purchase %'!$E$25:$I$27,'IRP Pruch Cover Sheet'!E$1,FALSE)","v":0.34363679996903612}]
{"$rows_left_out":10}
{"sheet":"Shut-In","index":40,"n_rows":75,"n_cols":11,"rows_kept":75,"cut":false,"hidden":true,"merged":[[0,0,0,1],[1,0,1,1]]}
["Actual Data from Jennifer Beasley"]
["Estimates…See Company Nom Groups herein"]
[]
[null,"June","July","August","Total Dth for Quarter",null,null,"December","January","February","Total Dth for Quarter"]
["Estimated Shut-in (dth/day)",{"$f":"'Company Nom Groups'!B134","v":0},{"$f":"'Company Nom Groups'!C134","v":0},{"$f":"'Company Nom Groups'!D134","v":13668.904843687707},{"$f":"SUM(B5:D5)","v":13668.904843687707},null,"Estimated Shut-in (dth/day)",{"$f":"H41/30","v":0},{"$f":"I41/30","v":0},0,{"$f":"K41","v":0}]
["Actual Shut-in  (dth/day)",0,0,0,0,null,"Acutal Shut-in  (dth/day)",{"$f":"H75/30","v":0},{"$f":"I75/31","v":0},0,{"$f":"K75","v":0}]
{"$rows_left_out":70}
{"sheet":"Deleted Exhibit 2.5","index":41,"n_rows":32,"n_cols":17,"rows_kept":32,"cut":false,"hidden":true,"merged":[]}
[]
[]
[]
[]
[]
[]
{"$rows_left_out":27}
{"sheet":"Deleted Exhibit 2.6","index":42,"n_rows":32,"n_cols":17,"rows_kept":32,"cut":false,"hidden":true,"merged":[]}
[]
[]
[]
[]
[]
[]
{"$rows_left_out":26}