{"text_format":"1","workbook":"xlsx","n_sheets":43,"sheets":["Ex 1 HDD","Exhibit 1.1","Exhibit 1.2","Exhibit 1.3","Ex 2 Clay Basin","Ex 2 Aquifers","Ex 2 Spire Storage West","Exhibit 2.1","Exhibit 2.3","Exhibit 2.2","Exhibit 2.3 ","Exhibit 2.4 ","Exhibit 2.6","Exhibit Firm Sales Volume","Exhibit 3.1","Exhibit 3.2","Exhibit 3.3","Exhibit 3.4","Ex 4 Purchase Gas","Exhibit 4.1","Exhibit 4.2","Exhibit 4.3","Ex 5 Purchase Gas Cost","Exhibit 5.1","Exhibit 5.2","Exhibit 5.3","Ex 6 Purch Gas Unit Cost","Exhibit 6.1","Exhibit 6.2","Ex 7 Co. Owned Gas","Exhibit 7.1","Exhibit 7.2","Exhibit 7.3","Ex 8 New Drill","Exhibit 8.1","Exhibit 8.2","Exhibit 8.3","Company Nom Groups","Normal Purchase %","IRP Pruch Cover Sheet","Shut-In","Deleted Exhibit 2.5","Deleted Exhibit 2.6"],"not_rendered":{"charts":28,"images":0,"macros":1,"external_links":11,"defined_names":1378,"comments":3,"pivot_tables":0},"unopened":[],"bounds":{"document_bytes":16777216,"sheet_cells":100000,"rows_first":2000,"rows_last":500,"rows_between":2000,"halvings":0,"cell_chars":16384,"cell_head_chars":4096},"cells_cut":0,"cells_raw":0,"read":"whole","date_system":"1900"}

{"sheet":"Ex 1 HDD","index":0,"n_rows":20,"n_cols":9,"rows_kept":20,"cut":false,"hidden":false,"merged":[[0,0,0,5],[1,0,1,5],[1,8,1,9],[26,0,26,6],[4,0,4,6]]}
["Heating Degree Days",null,null,null,null,null,"Docket",null,"Dominion Energy Utah"]
[null,null,null,null,null,null,null,null,"Docket No. 21-057-01"]
[null,null,null,null,null,null,null,null,"DEU Variance Exhibit"]
[]
[]
[]
{"$rows_left_out":15}
{"sheet":"Exhibit 1.1","index":1,"n_rows":32,"n_cols":17,"rows_kept":32,"cut":false,"hidden":false,"merged":[]}
[]
[]
[]
[]
[]
[]
{"$rows_left_out":27}
{"sheet":"Exhibit 1.2","index":2,"n_rows":32,"n_cols":17,"rows_kept":32,"cut":false,"hidden":false,"merged":[]}
[]
[]
[]
[]
[]
[]
{"$rows_left_out":27}
{"sheet":"Exhibit 1.3","index":3,"n_rows":32,"n_cols":17,"rows_kept":32,"cut":false,"hidden":false,"merged":[]}
[]
[]
[]
[]
[]
[]
{"$rows_left_out":27}
{"sheet":"Ex 2 Clay Basin","index":4,"n_rows":44,"n_cols":17,"rows_kept":44,"cut":false,"hidden":false,"merged":[[3,0,3,8],[0,0,0,8],[4,0,4,8],[1,0,1,4],[2,0,2,5]]}
["Clay Basin Ending Inventory (MDths)"]
[]
[]
[]
[null,null,null,null,null,null,null,null,null,null,null,null,"Plan Year 1",1106]
[null,null,null,null,null,null,null,null,null,null,"Month/Year","Month","Inj","With","Total"]
{"$rows_left_out":39}
{"sheet":"Ex 2 Aquifers","index":5,"n_rows":20,"n_cols":17,"rows_kept":20,"cut":false,"hidden":false,"merged":[[2,0,2,14],[1,0,1,14],[3,0,3,9]]}
["Total Aquifer Storage Ending Inventory (MDths)"]
[]
[]
[null,null,null,null,null,null,null,null,null,null,null,null,null,null,1082,1106]
[]
[null,null,null,null,null,null,null,1.0549999999999999,null,null,null,null,"Month/Year","Month","Inj","With","Total"]
{"$rows_left_out":15}
{"sheet":"Ex 2 Spire Storage West","index":6,"n_rows":21,"n_cols":17,"rows_kept":21,"cut":false,"hidden":true,"merged":[]}
[]
[]
[]
[]
[null,null,null,null,null,null,null,null,null,null,null,null,null,null,1082,1106]
[null,null,null,null,null,null,null,1000,null,null,null,null,null,"Month","Inj","With","Total"]
{"$rows_left_out":16}
{"sheet":"Exhibit 2.1","index":7,"n_rows":32,"n_cols":17,"rows_kept":32,"cut":false,"hidden":false,"merged":[]}
[]
[]
[]
[]
[]
[]
{"$rows_left_out":27}
{"sheet":"Exhibit 2.3","index":8,"n_rows":32,"n_cols":17,"rows_kept":32,"cut":false,"hidden":true,"merged":[]}
[]
[]
[]
[]
[]
[]
{"$rows_left_out":27}
{"sheet":"Exhibit 2.2","index":9,"n_rows":32,"n_cols":17,"rows_kept":32,"cut":false,"hidden":false,"merged":[]}
[]
[]
[]
[]
[]
[]
{"$rows_left_out":27}
{"sheet":"Exhibit 2.3 ","index":10,"n_rows":32,"n_cols":17,"rows_kept":32,"cut":false,"hidden":false,"merged":[]}
[]
[]
[]
[]
[]
[]
{"$rows_left_out":27}
{"sheet":"Exhibit 2.4 ","index":11,"n_rows":32,"n_cols":17,"rows_kept":32,"cut":false,"hidden":false,"merged":[]}
[]
[]
[]
[]
[]
[]
{"$rows_left_out":27}
{"sheet":"Exhibit 2.6","index":12,"n_rows":32,"n_cols":17,"rows_kept":32,"cut":false,"hidden":true,"merged":[]}
[]
[]
[]
[]
[]
[]
{"$rows_left_out":27}
{"sheet":"Exhibit Firm Sales Volume","index":13,"n_rows":20,"n_cols":8,"rows_kept":20,"cut":false,"hidden":false,"merged":[[1,0,1,9],[5,6,5,8]]}
["Demand"]
[]
[]
[]
[]
[null,null,null,null,null,null,"Cumulative"]
{"$rows_left_out":15}
{"sheet":"Exhibit 3.1","index":14,"n_rows":32,"n_cols":17,"rows_kept":32,"cut":false,"hidden":false,"merged":[]}
[]
[]
[]
[]
[]
[]
{"$rows_left_out":27}
{"sheet":"Exhibit 3.2","index":15,"n_rows":32,"n_cols":17,"rows_kept":32,"cut":false,"hidden":false,"merged":[]}
[]
[]
[]
[]
[]
[]
{"$rows_left_out":27}
{"sheet":"Exhibit 3.3","index":16,"n_rows":32,"n_cols":17,"rows_kept":32,"cut":false,"hidden":false,"merged":[]}
[]
[]
[]
[]
[]
[]
{"$rows_left_out":27}
{"sheet":"Exhibit 3.4","index":17,"n_rows":52,"n_cols":8,"rows_kept":52,"cut":false,"hidden":false,"merged":[[8,2,8,3],[8,4,8,5],[8,6,8,7]]}
[null,null,null,null,null,null,null,"Dominion Energy Utah"]
[null,null,null,null,null,null,null,"Docket No. 21-057-01"]
[null,null,null,null,null,null,null,"DEU Variance Exhibit 3.4"]
[]
[]
[null,"IRP Variance"]
{"$rows_left_out":47}
{"sheet":"Ex 4 Purchase Gas","index":18,"n_rows":23,"n_cols":13,"rows_kept":23,"cut":false,"hidden":false,"merged":[[5,6,5,7]]}
["Purchase Gas Variance (Brady Included) MDths"]
[]
[]
[]
[]
[null,null,null,null,null,null,"Cumulative"]
{"$rows_left_out":18}
{"sheet":"Exhibit 4.1","index":19,"n_rows":32,"n_cols":17,"rows_kept":32,"cut":false,"hidden":false,"merged":[]}
[]
[]
[]
[]
[]
[]
{"$rows_left_out":27}
{"sheet":"Exhibit 4.2","index":20,"n_rows":31,"n_cols":17,"rows_kept":31,"cut":false,"hidden":false,"merged":[]}
[]
[]
[]
[]
[]
[]
{"$rows_left_out":26}
{"sheet":"Exhibit 4.3","index":21,"n_rows":32,"n_cols":17,"rows_kept":32,"cut":false,"hidden":false,"merged":[]}
[]
[]
[]
[]
[]
[]
{"$rows_left_out":27}
{"sheet":"Ex 5 Purchase Gas Cost","index":22,"n_rows":21,"n_cols":6,"rows_kept":21,"cut":false,"hidden":false,"merged":[[1,0,1,6],[0,0,0,6],[2,0,2,7],[5,4,5,5]]}
["Purchase Gas Cost Variance ($1,000's)"]
[]
[]
[]
[]
[null,null,null,null,"Cumulative"]
{"$rows_left_out":16}
{"sheet":"Exhibit 5.1","index":23,"n_rows":32,"n_cols":16,"rows_kept":32,"cut":false,"hidden":false,"merged":[]}
[]
[]
[]
[]
[]
[]
{"$rows_left_out":27}
{"sheet":"Exhibit 5.2","index":24,"n_rows":32,"n_cols":17,"rows_kept":32,"cut":false,"hidden":false,"merged":[]}
[]
[]
[]
[]
[]
[]
{"$rows_left_out":27}
{"sheet":"Exhibit 5.3","index":25,"n_rows":32,"n_cols":17,"rows_kept":32,"cut":false,"hidden":false,"merged":[]}
[]
[]
[]
[]
[]
[]
{"$rows_left_out":27}
{"sheet":"Ex 6 Purch Gas Unit Cost","index":26,"n_rows":19,"n_cols":13,"rows_kept":19,"cut":false,"hidden":false,"merged":[[0,0,0,5],[1,0,1,7],[2,0,2,7],[46,2,46,13]]}
["Purchase Gas Unit Cost Variance ($1,000's)"]
[]
[]
[]
[]
[null,null,null,null,"Actual","Actual","Actual",null,"Normal","Normal","Normal"]
{"$rows_left_out":14}
{"sheet":"Exhibit 6.1","index":27,"n_rows":32,"n_cols":17,"rows_kept":32,"cut":false,"hidden":false,"merged":[]}
[]
[]
[]
[]
[]
[]
{"$rows_left_out":27}
{"sheet":"Exhibit 6.2","index":28,"n_rows":32,"n_cols":17,"rows_kept":32,"cut":false,"hidden":false,"merged":[]}
[]
[]
[]
[]
[]
[]
{"$rows_left_out":27}
{"sheet":"Ex 7 Co. Owned Gas","index":29,"n_rows":21,"n_cols":17,"rows_kept":21,"cut":false,"hidden":false,"merged":[[0,0,0,7],[2,14,2,19],[1,0,1,7],[2,0,2,10]]}
["Cost-of-Service Gas Variance (MDths)"]
[]
[]
[]
[]
[null,null,null,null,null,null,null,"Cumulative"]
{"$rows_left_out":16}
{"sheet":"Exhibit 7.1","index":30,"n_rows":33,"n_cols":17,"rows_kept":33,"cut":false,"hidden":false,"merged":[]}
[]
[]
[]
[]
[]
[]
{"$rows_left_out":28}
{"sheet":"Exhibit 7.2","index":31,"n_rows":32,"n_cols":17,"rows_kept":32,"cut":false,"hidden":false,"merged":[]}
[]
[]
[]
[]
[]
[]
{"$rows_left_out":27}
{"sheet":"Exhibit 7.3","index":32,"n_rows":32,"n_cols":17,"rows_kept":32,"cut":false,"hidden":false,"merged":[]}
[]
[]
[]
[]
[]
[]
{"$rows_left_out":27}
{"sheet":"Ex 8 New Drill","index":33,"n_rows":1489,"n_cols":28,"rows_kept":1489,"cut":false,"hidden":false,"merged":[[0,0,0,9],[1,0,1,9],[2,0,2,9],[22,0,25,4]]}
["Isolated New Drill Component (MDths)"]
[]
[]
[]
[]
[null,null,null,null,null,null,null,null,null,"Cumulative",null,"Cumulative"]
{"$rows_left_out":1484}
{"sheet":"Exhibit 8.1","index":34,"n_rows":32,"n_cols":17,"rows_kept":32,"cut":false,"hidden":false,"merged":[]}
[]
[]
[]
[]
[]
[]
{"$rows_left_out":27}
{"sheet":"Exhibit 8.2","index":35,"n_rows":32,"n_cols":17,"rows_kept":32,"cut":false,"hidden":false,"merged":[]}
[]
[]
[]
[]
[]
[]
{"$rows_left_out":27}
{"sheet":"Exhibit 8.3","index":36,"n_rows":32,"n_cols":17,"rows_kept":32,"cut":false,"hidden":false,"merged":[]}
[]
[]
[]
[]
[]
[]
{"$rows_left_out":27}
{"sheet":"Company Nom Groups","index":37,"n_rows":214,"n_cols":96,"rows_kept":214,"cut":false,"hidden":true,"merged":[[1,93,1,95],[2,93,2,95],[2,62,2,64],[1,66,1,68],[2,66,2,68],[2,70,2,72],[2,81,2,83],[2,85,2,87],[1,81,1,83],[1,85,1,87],[1,89,1,91],[2,89,2,91],[95,35,101,35],[95,34,101,34],[95,33,101,33],[1,70,1,72],[124,74,125,74],[51,74,59,74],[51,73,59,73],[97,74,122,74],[97,73,122,73],[102,53,103,53],[94,53,99,53],[94,54,99,54],[60,74,61,74],[1,58,1,60],[2,58,2,60],[1,62,1,64],[51,75,59,75],[97,75,122,75],[1,49,1,51],[2,49,2,51],[58,33,59,33],[1,37,1,39],[2,37,2,39],[2,45,2,47],[50,35,56,35],[50,34,56,34],[50,33,56,33],[94,55,99,55],[48,53,54,53],[48,54,54,54],[48,55,54,55],[56,53,57,53],[1,17,1,19],[2,17,2,19],[1,25,1,27],[2,25,2,27],[1,21,1,23],[2,21,2,23],[1,29,1,31],[2,29,2,31],[1,41,1,43],[2,41,2,43],[1,45,1,47]]}
["Company Nom Groups"]
["Withdrawn Gross Volume (MDths)",null,null,1106,null,null,null,null,null,null,null,null,null,null,null,null,null,"June 2021 Cost-of-Service",null,null,null,"July 2021 Cost-of-Service",null,null,null,"August 2021 Cost-of-Service",null,null,null,"First Quarter Cost-of-Service",null,null,null,null,null,null,null,"September 2021 Cost-of-Service",null,null,null,"October 2021 Cost-of-Service",null,null,null,"November 2021 Cost-of-Service",null,null,null,"Second Quarter Cost-of-Service",null,null,null,null,null,null,null,null,"December 2021 Cost-of-Service",null,null,null,"January 2022 Cost-of-Service",null,null,null,"February 2022 Cost-of-Service",null,null,null,"Third Quarter Cost-of-Service",null,null,null,null,null,null,null,null,null,null,"March 2022 Cost-of-Service",null,null,null,"April 2022 Cost-of-Service",null,null,null,"May 2022 Cost-of-Service",null,null,null,"Fourth Quarter Cost-of-Service"]
["Source: IRP Base Case, Monthly Custom Report Writer",null,null,null,null,null,null,null,null,null,null,null,null,null,null,null,null,"Variance   Mdth",null,null,null,"Variance   Mdth",null,null,null,"Variance   Mdth",null,null,null,"Variance   Mdth",null,null,null,null,null,null,null,"Variance   Mdth",null,null,null,"Variance   Mdth",null,null,null,"Variance   Mdth",null,null,null,"Variance   Mdth",null,null,null,null,null,null,null,null,"Variance   Mdth",null,null,null,"Variance   Mdth",null,null,null,"Variance   Mdth",null,null,null,"Variance   Mdth",null,null,null,null,null,null,null,null,null,null,"Variance   Mdth",null,null,null,"Variance   Mdth",null,null,null,"Variance   Mdth",null,null,null,"Variance   Mdth"]
[null,2,3,4,5,6,7,8,9,10,11,12,13]
["Nomination Group Production","2021-06-01","2021-07-01","2021-08-01","2021-09-01","2021-10-01","2021-11-01","2021-12-01","2022-01-01","2022-02-01","2022-03-01","2022-04-01","2022-05-01","Total",null,null,null,"Nomination Group","Actual ","Normal",null,"Nomination Group","Actual ","Normal",null,"Nomination Group","Actual ","Normal",null,"Nomination Group","Actual ","Normal",null,null,null,null,null,"Nomination Group","Actual ","Normal",null,"Nomination Group","Actual ","Normal",null,{"$f":"AP5","v":"Nomination Group"},{"$f":"AQ5","v":"Actual "},"Normal",null,{"$f":"AT5","v":"Nomination Group"},{"$f":"AU5","v":"Actual "},{"$f":"AV5","v":"Normal"},null,null,null,null,null,null,{"$f":"AX5","v":"Nomination Group"},{"$f":"AY5","v":"Actual "},"Normal",null,"Nomination Group","Actual ","Normal",null,"Nomination Group","Actual ","Normal",null,{"$f":"BO5","v":"Nomination Group"},{"$f":"BP5","v":"Actual "},{"$f":"BQ5","v":"Normal"},null,null,null,null,null,null,null,null,"Nomination Group","Actual ","Normal",null,"Nomination Group","Actual ","Normal",null,"Nomination Group","Actual ","Normal",null,"Nomination Group","Actual ","Normal"]
["BIRCH CREEK",117.702,120.89400000000001,120.16800000000001,115.596,118.739,114.22799999999999,117.33799999999999,116.64400000000001,104.73699999999999,115.28,110.91,113.937,{"$f":"SUM(B6:M6)","v":1386.173},null,null,null,{"$f":"A6","v":"BIRCH CREEK"},{"$f":"IFERROR(VLOOKUP(R6,$R$119:$S$213,2,FALSE),0)","v":123.146},{"$f":"IFERROR(VLOOKUP(R6,$A$6:$M$123,2,FALSE),\"\")","v":117.702},null,{"$f":"R6","v":"BIRCH CREEK"},{"$f":"IFERROR(VLOOKUP(V6,$V$119:$W$213,2,FALSE),0)","v":127.01600000000001},{"$f":"IFERROR(VLOOKUP(V6,$A$6:$M$123,3,FALSE),\"\")","v":120.89400000000001},null,{"$f":"R6","v":"BIRCH CREEK"},{"$f":"IFERROR(VLOOKUP(A6,$Z$119:$AA$213,2,FALSE),0)","v":127.571},{"$f":"IFERROR(VLOOKUP(Z6,$A$6:$M$123,4,FALSE),\"\")","v":120.16800000000001},null,{"$f":"R6","v":"BIRCH CREEK"},{"$f":"SUM(S6,W6,AA6)","v":377.733},{"$f":"SUM(T6,X6,AB6)","v":358.76400000000001},null,null,null,null,null,{"$f":"AD6","v":"BIRCH CREEK"},{"$f":"IFERROR(VLOOKUP(AL6,$AL$119:$AM$209,2,FALSE),0)","v":122.727},{"$f":"IFERROR(VLOOKUP(AL6,$A$6:$M$123,5,FALSE),\"\")","v":115.596},null,{"$f":"AL6","v":"BIRCH CREEK"},{"$f":"IFERROR(VLOOKUP(AP6,$AP$119:$AQ$218,2,FALSE),0)","v":123.94799999999999},{"$f":"IFERROR(VLOOKUP($AP6,$A$6:$M$123,6,FALSE),\"\")","v":118.739},null,{"$f":"AP6","v":"BIRCH CREEK"},{"$f":"IFERROR(VLOOKUP(AT6,$AT$119:$AU$211,2,FALSE),0)","v":116.887},{"$f":"IFERROR(VLOOKUP($AT6,$A$6:$M$123,7,FALSE),\"\")","v":114.22799999999999},null,{"$f":"AT6","v":"BIRCH CREEK"},{"$f":"SUM(AM6,AQ6,AU6)","v":363.56200000000001},{"$f":"SUM(AN6,AR6,AV6)","v":348.56299999999999},null,null,null,null,null,null,{"$f":"AX6","v":"BIRCH CREEK"},{"$f":"IFERROR(VLOOKUP(BG6,$BG$119:$BH$211,2,FALSE),0)","v":120.91500000000001},{"$f":"IFERROR(VLOOKUP($BG6,$A$6:$M$123,8,FALSE),\"\")","v":117.33799999999999},null,{"$f":"BG6","v":"BIRCH CREEK"},{"$f":"IFERROR(VLOOKUP(BK6,$BK$119:$BL$211,2,FALSE),0)","v":124.309},{"$f":"IFERROR(VLOOKUP($BG6,$A$6:$M$123,9,FALSE),\"\")","v":116.64400000000001},null,{"$f":"A6","v":"BIRCH CREEK"},{"$f":"IFERROR(VLOOKUP($BO6,$BO$119:$BP$211,2,FALSE),0)","v":113.126},{"$f":"IFERROR(VLOOKUP($BO6,$A$6:$M$123,10,FALSE),0)","v":104.73699999999999},null,{"$f":"A6","v":"BIRCH CREEK"},{"$f":"SUM(BH6,BL6,BP6)","v":358.35},{"$f":"SUM(BI6,BM6,BQ6)","v":338.71899999999999},null,null,null,null,null,null,null,null,{"$f":"A6","v":"BIRCH CREEK"},{"$f":"VLOOKUP(CD6,CD$119:CE$203,2,FALSE)","v":122.512},{"$f":"IFERROR(VLOOKUP($A6,$A$6:$M$123,11,FALSE),\"\")","v":115.28},null,{"$f":"A6","v":"BIRCH CREEK"},{"$f":"VLOOKUP(CH6,CH$119:CI$203,2,FALSE)","v":113.696},{"$f":"IFERROR(VLOOKUP($A6,$A$6:$M$123,12,FALSE),\"\")","v":110.91},null,{"$f":"A6","v":"BIRCH CREEK"},{"$f":"VLOOKUP(CL6,CL$119:CM$203,2,FALSE)","v":134.923},{"$f":"IFERROR(VLOOKUP($A6,$A$6:$M$123,13,FALSE),\"\")","v":113.937},null,{"$f":"CL6","v":"BIRCH CREEK"},{"$f":"CE6+CI6+CM6","v":371.13099999999997},{"$f":"CF6+CJ6+CN6","v":340.12700000000001}]
{"$rows_left_out":209}
{"sheet":"Normal Purchase %","index":38,"n_rows":34,"n_cols":15,"rows_kept":34,"cut":false,"hidden":true,"merged":[[1,0,1,8]]}
[]
["Source:  The whole numbers come from Purchase Gas and Company Owned Gas sheets.  The percentages are then calculated from those numbers."]
[null,2,3,4,5,6,7,8,9]
["Month","Actual Purchase Mdth","Normal Purchase Mdth","Actual Company Mdth","Normal Company Mdths","Actual Purchase as Percent of Total","Normal Purchase as Percent of Total","Actual Cost-of-Service as Percent of Total","Normal Cost-of-Service as Percent of Total",null,"Check Should = 100%","Check Should = 100%"]
[{"$f":"'Ex 1 HDD'!A8","v":"2021-06-01"},{"$f":"'Ex 4 Purchase Gas'!B8","v":0},{"$f":"'Ex 4 Purchase Gas'!C8","v":528.77499999999998},{"$f":"'Ex 7 Co. Owned Gas'!B8","v":4656.1660000000002},{"$f":"'Ex 7 Co. Owned Gas'!C8","v":4722.1770000000006},{"$f":"IFERROR(B5/(B5+D5),0)","v":0},{"$f":"C5/(C5+E5)","v":0.1007007872096336},{"$f":"IFERROR(D5/(D5+B5),0)","v":1},{"$f":"E5/(E5+C5)","v":0.89929921279036651},null,{"$f":"F5+H5","v":1},{"$f":"G5+I5","v":1}]
[{"$f":"'Ex 1 HDD'!A9","v":"2021-07-01"},{"$f":"'Ex 4 Purchase Gas'!B9","v":0},{"$f":"'Ex 4 Purchase Gas'!C9","v":58.161999999999999},{"$f":"'Ex 7 Co. Owned Gas'!B9","v":4613.5949999999993},{"$f":"'Ex 7 Co. Owned Gas'!C9","v":4800.3310000000019},{"$f":"IFERROR(B6/(B6+D6),0)","v":0},1.1971201769766874E-2,{"$f":"IFERROR(D6/(D6+B6),0)","v":1},0.98802879823023304,null,1,0.99999999999999989]
{"$rows_left_out":29}
{"sheet":"IRP Pruch Cover Sheet","index":39,"n_rows":15,"n_cols":6,"rows_kept":15,"cut":false,"hidden":true,"merged":[]}
[null,null,2,3,4,5]
[null,null,{"$f":"'Normal Purchase %'!F24","v":"Actual Purchase as Percent of Total"},{"$f":"'Normal Purchase %'!G24","v":"Normal Purchase as Percent of Total"},{"$f":"'Normal Purchase %'!H24","v":"Actual Cost-of-Service as Percent of Total"},{"$f":"'Normal Purchase %'!I24","v":"Normal Cost-of-Service as Percent of Total"}]
[]
[null,{"$f":"'Normal Purchase %'!E25","v":"2022-03-01"},{"$f":"VLOOKUP($B4,'Normal Purchase %'!$E$25:$I$27,'IRP Pruch Cover Sheet'!C$1,FALSE)","v":0.52771463331461088},{"$f":"VLOOKUP($B4,'Normal Purchase %'!$E$25:$I$27,'IRP Pruch Cover Sheet'!D$1,FALSE)","v":0.58561482875041071},{"$f":"VLOOKUP($B4,'Normal Purchase %'!$E$25:$I$27,'IRP Pruch Cover Sheet'!E$1,FALSE)","v":0.47228536668538912},{"$f":"VLOOKUP($B4,'Normal Purchase %'!$E$25:$I$27,'IRP Pruch Cover Sheet'!F$1,FALSE)","v":0.41438517124958929}]
[null,{"$f":"'Normal Purchase %'!E26","v":"2022-04-01"},{"$f":"VLOOKUP($B5,'Normal Purchase %'!$E$25:$I$27,'IRP Pruch Cover Sheet'!C$1,FALSE)","v":0.38278994370214448},{"$f":"VLOOKUP($B5,'Normal Purchase %'!$E$25:$I$27,'IRP Pruch Cover Sheet'!D$1,FALSE)","v":0.54550079463667245},{"$f":"VLOOKUP($B5,'Normal Purchase %'!$E$25:$I$27,'IRP Pruch Cover Sheet'!E$1,FALSE)","v":0.61721005629785552},{"$f":"VLOOKUP($B5,'Normal Purchase %'!$E$25:$I$27,'IRP Pruch Cover Sheet'!F$1,FALSE)","v":0.45449920536332755}]
[null,{"$f":"'Normal Purchase %'!E27","v":"2022-05-01"},{"$f":"VLOOKUP($B6,'Normal Purchase %'!$E$25:$I$27,'IRP Pruch Cover Sheet'!C$1,FALSE)","v":0.17852301367379961},{"$f":"VLOOKUP($B6,'Normal Purchase %'!$E$25:$I$27,'IRP Pruch Cover Sheet'!D$1,FALSE)","v":0.3928498619927992},{"$f":"VLOOKUP($B6,'Normal Purchase %'!$E$25:$I$27,'IRP Pruch Cover Sheet'!E$1,FALSE)","v":0.82147698632620048},{"$f":"VLOOKUP($B6,'Normal Purchase %'!$E$25:$I$27,'IRP Pruch Cover Sheet'!F$1,FALSE)","v":0.60715013800720086}]
{"$rows_left_out":10}
{"sheet":"Shut-In","index":40,"n_rows":75,"n_cols":18,"rows_kept":75,"cut":false,"hidden":true,"merged":[[0,1,0,2],[1,1,1,2]]}
[null,"Actual Data from Jennifer Beasley"]
[null,"Estimates…See Company Nom Groups herein"]
[]
[null,null,"September","October","November","Total Dth for Quarter",null,null,"December","January","February","Total Dth for Quarter",null,null,"March","April","May ","Total Dth for Quarter"]
[null,"Estimated Shut-in (dth/day)",{"$f":"'Company Nom Groups'!E132","v":4620.2312203152969},{"$f":"'Company Nom Groups'!F132","v":2410.0330725198164},{"$f":"'Company Nom Groups'!G132","v":139.8373989127625},{"$f":"C5*30+D5*31+E5*30","v":217513.08382495609},null,"Estimated Shut-in (dth/day)",{"$f":"'Company Nom Groups'!H132","v":139.15738038673638},{"$f":"'Company Nom Groups'!I132","v":138.15755584006007},{"$f":"'Company Nom Groups'!J132","v":137.11700634222066},{"$f":"I5*31+J5*31+K5*28","v":12436.039200612868},null,"Estimated Shut-in (dth/day)",{"$f":"'Company Nom Groups'!K132","v":136.52825808452278},{"$f":"'Company Nom Groups'!L132","v":6656.5301017470729},{"$f":"'Company Nom Groups'!M132","v":6598.9693304540078},{"$f":"O5*31+P5*30+Q5*31","v":408496.32829710667}]
[null,"Actual Shut-in  (dth/day)",0,0,0,{"$f":"C6*30+D6*31+E6*31","v":0},null,"Acutal Shut-in  (dth/day)",{"$f":"I75/30","v":0},{"$f":"J75/31","v":0},0,{"$f":"L75","v":0},null,"Actual Shut-in  (dth/day)",0,0,0,{"$f":"O6*30+P6*31+Q6*31","v":0}]
{"$rows_left_out":70}
{"sheet":"Deleted Exhibit 2.5","index":41,"n_rows":32,"n_cols":17,"rows_kept":32,"cut":false,"hidden":true,"merged":[]}
[]
[]
[]
[]
[]
[]
{"$rows_left_out":27}
{"sheet":"Deleted Exhibit 2.6","index":42,"n_rows":32,"n_cols":17,"rows_kept":32,"cut":false,"hidden":true,"merged":[]}
[]
[]
[]
[]
[]
[]
{"$rows_left_out":26}