{"text_format":"1","workbook":"xlsx","n_sheets":43,"sheets":["Ex 1 HDD","Exhibit 1.1","Exhibit 1.2","Exhibit 1.3","Ex 2 Clay Basin","Ex 2 Aquifers","Ex 2 Spire Storage West","Exhibit 2.1","Exhibit 2.2","Exhibit 2.3","Exhibit 2.3 ","Exhibit 2.4 ","Exhibit 2.6","Exhibit Firm Sales Volume","Exhibit 3.1","Exhibit 3.2","Exhibit 3.3","Exhibit 3.4","Ex 4 Purchase Gas","Exhibit 4.1","Exhibit 4.2","Exhibit 4.3","Ex 5 Purchase Gas Cost","Exhibit 5.1","Exhibit 5.2","Exhibit 5.3","Ex 6 Purch Gas Unit Cost","Exhibit 6.1","Exhibit 6.2","Ex 7 Co. Owned Gas","Exhibit 7.1","Exhibit 7.2","Exhibit 7.3","Ex 8 New Drill","Exhibit 8.1","Exhibit 8.2","Exhibit 8.3","Company Nom Groups","Normal Purchase %","IRP Pruch Cover Sheet","Shut-In","Deleted Exhibit 2.5","Deleted Exhibit 2.6"],"not_rendered":{"charts":28,"images":0,"macros":1,"external_links":11,"defined_names":1378,"comments":2,"pivot_tables":0},"unopened":[],"bounds":{"document_bytes":16777216,"sheet_cells":100000,"rows_first":2000,"rows_last":500,"rows_between":2000,"halvings":0,"cell_chars":16384,"cell_head_chars":4096},"cells_cut":0,"cells_raw":0,"read":"whole","date_system":"1900"}

{"sheet":"Ex 1 HDD","index":0,"n_rows":20,"n_cols":9,"rows_kept":20,"cut":false,"hidden":false,"merged":[[0,0,0,5],[1,0,1,5],[1,8,1,9],[26,0,26,6],[4,0,4,6]]}
["Heating Degree Days",null,null,null,null,null,"Docket",null,"Dominion Energy Utah"]
[null,null,null,null,null,null,null,null,"Docket No. 22-057-02"]
[null,null,null,null,null,null,null,null,"DEU Variance Exhibit"]
[]
[]
[]
["Month/Year","Actual","Normal",null,null,"Actual","Normal"]
["2022-06-01",22,37.520000000000003,{"$f":"B8-C8","v":-15.520000000000003},null,{"$f":"B8","v":22},{"$f":"C8","v":37.520000000000003}]
{"$rows_left_out":13}
{"sheet":"Exhibit 1.1","index":1,"n_rows":32,"n_cols":17,"rows_kept":32,"cut":false,"hidden":false,"merged":[]}
[]
[]
[]
[]
[]
[]
[]
[]
{"$rows_left_out":25}
{"sheet":"Exhibit 1.2","index":2,"n_rows":32,"n_cols":17,"rows_kept":32,"cut":false,"hidden":false,"merged":[]}
[]
[]
[]
[]
[]
[]
[]
[]
{"$rows_left_out":25}
{"sheet":"Exhibit 1.3","index":3,"n_rows":32,"n_cols":17,"rows_kept":32,"cut":false,"hidden":false,"merged":[]}
[]
[]
[]
[]
[]
[]
[]
[]
{"$rows_left_out":25}
{"sheet":"Ex 2 Clay Basin","index":4,"n_rows":19,"n_cols":9,"rows_kept":19,"cut":false,"hidden":false,"merged":[[3,0,3,8],[0,0,0,8],[4,0,4,8],[1,0,1,4],[2,0,2,5]]}
["Clay Basin Ending Inventory (MDths)"]
[]
[]
[]
[]
[]
["Month/Year","Actual","Normal",null,"Actual","Actual/1000",null,"Actual","Normal"]
["2022-06-01",{"$f":"F8","v":1571.0619999999999},2789.9070000000002,{"$f":"B8-C8","v":-1218.8450000000003},1571062,{"$f":"E8/1000","v":1571.0619999999999},null,{"$f":"F8","v":1571.0619999999999},{"$f":"C8","v":2789.9070000000002}]
{"$rows_left_out":12}
{"sheet":"Ex 2 Aquifers","index":5,"n_rows":20,"n_cols":17,"rows_kept":20,"cut":false,"hidden":false,"merged":[[2,0,2,14],[1,0,1,14],[3,0,3,9]]}
["Total Aquifer Storage Ending Inventory (MDths)"]
[]
[]
[null,null,null,null,null,null,null,null,null,null,null,null,null,null,1082,1106]
[]
[null,null,null,null,null,null,null,1.0549999999999999,null,null,null,null,"Month/Year","Month","Inj","With","Total"]
["Month/Year","Actual","Normal",null,"Actual","IRP",null,"MCF","DTH","MDTH",null,null,null,null,null,null,775.99800000000005]
[{"$f":"'Ex 1 HDD'!$A$8","v":"2022-06-01"},{"$f":"J8","v":808.93399999999997},{"$f":"Q8","v":775.99800000000005},{"$f":"B8-C8","v":32.935999999999922},{"$f":"B8","v":808.93399999999997},{"$f":"C8","v":775.99800000000005},null,{"$f":"I8/$H$6","v":766762.08530805691},808934,{"$f":"I8/1000","v":808.93399999999997},null,null,{"$f":"A8","v":"2022-06-01"},{"$f":"Q7","v":775.99800000000005},0,0,{"$f":"N8+O8-P8","v":775.99800000000005}]
{"$rows_left_out":13}
{"sheet":"Ex 2 Spire Storage West","index":6,"n_rows":21,"n_cols":17,"rows_kept":21,"cut":false,"hidden":true,"merged":[]}
[]
[]
[]
[]
[null,null,null,null,null,null,null,null,null,null,null,null,null,null,1082,1106]
[null,null,null,null,null,null,null,1000,null,null,null,null,null,"Month","Inj","With","Total"]
[{"$f":"'Ex 1 HDD'!A7","v":"Month/Year"},"Actual","Normal","Days","Daily Demand",null,"Actual Dth","MDth",null,"Actual","Normal",null,null,null,null,null,731]
[{"$f":"'Ex 1 HDD'!A8","v":"2022-06-01"},{"$f":"H8","v":799.21500000000003},{"$f":"Q8","v":1072.73},{"$f":"DAY(EOMONTH(A8,0))","v":30},{"$f":"C8/D8","v":35.757666666666665},null,799215,{"$f":"G8/$H$6","v":799.21500000000003},null,949.73599999999999,{"$f":"C8","v":1072.73},null,{"$f":"A8","v":"2022-06-01"},{"$f":"Q7","v":731},341.73,0,{"$f":"N8+O8-P8","v":1072.73}]
{"$rows_left_out":14}
{"sheet":"Exhibit 2.1","index":7,"n_rows":32,"n_cols":17,"rows_kept":32,"cut":false,"hidden":false,"merged":[]}
[]
[]
[]
[]
[]
[]
[]
[]
{"$rows_left_out":25}
{"sheet":"Exhibit 2.2","index":8,"n_rows":32,"n_cols":17,"rows_kept":32,"cut":false,"hidden":false,"merged":[]}
[]
[]
[]
[]
[]
[]
[]
[]
{"$rows_left_out":25}
{"sheet":"Exhibit 2.3","index":9,"n_rows":32,"n_cols":17,"rows_kept":32,"cut":false,"hidden":true,"merged":[]}
[]
[]
[]
[]
[]
[]
[]
[]
{"$rows_left_out":25}
{"sheet":"Exhibit 2.3 ","index":10,"n_rows":32,"n_cols":17,"rows_kept":32,"cut":false,"hidden":false,"merged":[]}
[]
[]
[]
[]
[]
[]
[]
[]
{"$rows_left_out":25}
{"sheet":"Exhibit 2.4 ","index":11,"n_rows":32,"n_cols":17,"rows_kept":32,"cut":false,"hidden":false,"merged":[]}
[]
[]
[]
[]
[]
[]
[]
[]
{"$rows_left_out":25}
{"sheet":"Exhibit 2.6","index":12,"n_rows":32,"n_cols":17,"rows_kept":32,"cut":false,"hidden":true,"merged":[]}
[]
[]
[]
[]
[]
[]
[]
[]
{"$rows_left_out":25}
{"sheet":"Exhibit Firm Sales Volume","index":13,"n_rows":20,"n_cols":8,"rows_kept":20,"cut":false,"hidden":false,"merged":[[1,0,1,9],[5,6,5,8]]}
["Demand"]
[]
[]
[]
[]
[null,null,null,null,null,null,"Cumulative"]
[{"$f":"'Ex 1 HDD'!A7","v":"Month/Year"},"Actual","IRP Normal","Days","Daily Demand",null,"Actual","IRP Normal"]
["2022-06-01",2802.9350370000002,3129.067,{"$f":"DAY(EOMONTH(A8,0))","v":30},{"$f":"C8/D8","v":104.30223333333333},null,{"$f":"B8","v":2802.9350370000002},{"$f":"C8","v":3129.067}]
{"$rows_left_out":13}
{"sheet":"Exhibit 3.1","index":14,"n_rows":32,"n_cols":17,"rows_kept":32,"cut":false,"hidden":false,"merged":[]}
[]
[]
[]
[]
[]
[]
[]
[]
{"$rows_left_out":25}
{"sheet":"Exhibit 3.2","index":15,"n_rows":32,"n_cols":17,"rows_kept":32,"cut":false,"hidden":false,"merged":[]}
[]
[]
[]
[]
[]
[]
[]
[]
{"$rows_left_out":25}
{"sheet":"Exhibit 3.3","index":16,"n_rows":32,"n_cols":17,"rows_kept":32,"cut":false,"hidden":false,"merged":[]}
[]
[]
[]
[]
[]
[]
[]
[]
{"$rows_left_out":25}
{"sheet":"Exhibit 3.4","index":17,"n_rows":55,"n_cols":8,"rows_kept":55,"cut":false,"hidden":false,"merged":[[8,2,8,3],[8,4,8,5],[8,6,8,7]]}
[null,null,null,null,null,null,null,"Dominion Energy Utah"]
[null,null,null,null,null,null,"Docket No. 22-057-02"]
[null,null,null,null,null,null,null,"DEU Variance Exhibit 3.4"]
[]
[]
[null,"IRP Variance"]
[]
[null,"Actual Results "]
{"$rows_left_out":48}
{"sheet":"Ex 4 Purchase Gas","index":18,"n_rows":21,"n_cols":13,"rows_kept":21,"cut":false,"hidden":false,"merged":[[5,6,5,7]]}
["Purchase Gas Variance (Brady Included) MDths"]
[]
[]
[]
[]
[null,null,null,null,null,null,"Cumulative"]
["Month/Year","Actual","IRP Normal",null,"Month/Year","Actual","IRP Normal",null,"Month/Year","DTHS","MDTHS","$'S","$1,000'S"]
[{"$f":"'Ex 1 HDD'!A8","v":"2022-06-01"},{"$f":"K8","v":483.77},619.59299999999996,null,{"$f":"A8","v":"2022-06-01"},{"$f":"K8","v":483.77},{"$f":"C8","v":619.59299999999996},null,{"$f":"A8","v":"2022-06-01"},483770,{"$f":"J8/1000","v":483.77},3039770.37,{"$f":"L8/1000","v":3039.7703700000002}]
{"$rows_left_out":14}
{"sheet":"Exhibit 4.1","index":19,"n_rows":32,"n_cols":17,"rows_kept":32,"cut":false,"hidden":false,"merged":[]}
[]
[]
[]
[]
[]
[]
[]
[]
{"$rows_left_out":25}
{"sheet":"Exhibit 4.2","index":20,"n_rows":31,"n_cols":17,"rows_kept":31,"cut":false,"hidden":false,"merged":[]}
[]
[]
[]
[]
[]
[]
[]
[]
{"$rows_left_out":24}
{"sheet":"Exhibit 4.3","index":21,"n_rows":32,"n_cols":16,"rows_kept":32,"cut":false,"hidden":false,"merged":[]}
[]
[]
[]
[]
[]
[]
[]
[]
{"$rows_left_out":25}
{"sheet":"Ex 5 Purchase Gas Cost","index":22,"n_rows":21,"n_cols":6,"rows_kept":21,"cut":false,"hidden":false,"merged":[[1,0,1,6],[0,0,0,6],[2,0,2,7],[5,4,5,5]]}
["Purchase Gas Cost Variance ($1,000's)"]
[]
[]
[]
[]
[null,null,null,null,"Cumulative"]
["Month/Year","Actual","Normal",null,"Actual","Normal"]
[{"$f":"'Ex 1 HDD'!A8","v":"2022-06-01"},{"$f":"'Ex 4 Purchase Gas'!M8","v":3039.7703700000002},3457.5050000000001,null,{"$f":"B8","v":3039.7703700000002},{"$f":"C8","v":3457.5050000000001}]
{"$rows_left_out":14}
{"sheet":"Exhibit 5.1","index":23,"n_rows":32,"n_cols":16,"rows_kept":32,"cut":false,"hidden":false,"merged":[]}
[]
[]
[]
[]
[]
[]
[]
[]
{"$rows_left_out":25}
{"sheet":"Exhibit 5.2","index":24,"n_rows":32,"n_cols":17,"rows_kept":32,"cut":false,"hidden":false,"merged":[]}
[]
[]
[]
[]
[]
[]
[]
[]
{"$rows_left_out":25}
{"sheet":"Exhibit 5.3","index":25,"n_rows":32,"n_cols":17,"rows_kept":32,"cut":false,"hidden":false,"merged":[]}
[]
[]
[]
[]
[]
[]
[]
[]
{"$rows_left_out":25}
{"sheet":"Ex 6 Purch Gas Unit Cost","index":26,"n_rows":47,"n_cols":13,"rows_kept":47,"cut":false,"hidden":false,"merged":[[0,0,0,5],[1,0,1,7],[2,0,2,7],[46,2,46,13]]}
["Purchase Gas Unit Cost Variance ($1,000's)"]
[]
[]
[]
[]
[null,null,null,null,"Actual","Actual","Actual",null,"Normal","Normal","Normal"]
["Month/Year","Actual $/Dth","Normal $/Dth",null,"Dth","Cost","$/Dth",null,"Dth","Cost","$/Dth",null,"May Forward Strip"]
[{"$f":"'Ex 1 HDD'!A8","v":"2022-06-01"},{"$f":"G8","v":6.283503255679352},{"$f":"K8","v":5.5802841542754686},null,{"$f":"'Ex 4 Purchase Gas'!B8","v":483.77},{"$f":"'Ex 4 Purchase Gas'!M8","v":3039.7703700000002},{"$f":"IFERROR(F8/E8,0)","v":6.283503255679352},null,{"$f":"'Ex 4 Purchase Gas'!C8","v":619.59299999999996},{"$f":"'Ex 5 Purchase Gas Cost'!C8","v":3457.5050000000001},{"$f":"IFERROR(J8/I8,0)","v":5.5802841542754686},null,5.7]
{"$rows_left_out":40}
{"sheet":"Exhibit 6.1","index":27,"n_rows":32,"n_cols":17,"rows_kept":32,"cut":false,"hidden":false,"merged":[]}
[]
[]
[]
[]
[]
[]
[]
[]
{"$rows_left_out":25}
{"sheet":"Exhibit 6.2","index":28,"n_rows":32,"n_cols":17,"rows_kept":32,"cut":false,"hidden":false,"merged":[]}
[]
[]
[]
[]
[]
[]
[]
[]
{"$rows_left_out":25}
{"sheet":"Ex 7 Co. Owned Gas","index":29,"n_rows":21,"n_cols":17,"rows_kept":21,"cut":false,"hidden":false,"merged":[[0,0,0,7],[2,14,2,19],[1,0,1,7],[2,0,2,10]]}
["Cost-of-Service Gas Variance (MDths)"]
[]
[]
[]
[]
[null,null,null,null,null,null,null,"Cumulative"]
["Month/Year","Actual","Normal","Full Production","Shut-in Est. Month","Shut-in Daily",null,"Actual","Normal",null,"Days in Mo.","Dthms","Dthms/Day"]
[{"$f":"'Ex 1 HDD'!A8","v":"2022-06-01"},{"$f":"'Company Nom Groups'!S120","v":4510.2119999999995},{"$f":"'Company Nom Groups'!B129","v":4454.9400000000005},{"$f":"'Company Nom Groups'!B135","v":4459.6989144662584},{"$f":"D8-C8","v":4.7589144662579201},{"$f":"(E8/30)*1000","v":158.63048220859736},null,{"$f":"B8","v":4510.2119999999995},{"$f":"C8","v":4454.9400000000005},null,{"$f":"DAY(EOMONTH(A8,0))","v":30},{"$f":"C8","v":4454.9400000000005},{"$f":"L8/K8","v":148.49800000000002},null,null,null,5754.4783839995334]
{"$rows_left_out":14}
{"sheet":"Exhibit 7.1","index":30,"n_rows":33,"n_cols":17,"rows_kept":33,"cut":false,"hidden":false,"merged":[]}
[]
[]
[]
[]
[]
[]
[]
[]
{"$rows_left_out":26}
{"sheet":"Exhibit 7.2","index":31,"n_rows":32,"n_cols":17,"rows_kept":32,"cut":false,"hidden":false,"merged":[]}
[]
[]
[]
[]
[]
[]
[]
[]
{"$rows_left_out":25}
{"sheet":"Exhibit 7.3","index":32,"n_rows":32,"n_cols":17,"rows_kept":32,"cut":false,"hidden":false,"merged":[]}
[]
[]
[]
[]
[]
[]
[]
[]
{"$rows_left_out":25}
{"sheet":"Ex 8 New Drill","index":33,"n_rows":19,"n_cols":13,"rows_kept":19,"cut":false,"hidden":false,"merged":[[0,0,0,9],[1,0,1,9],[2,0,2,9]]}
["Isolated New Drill Component (MDths)"]
[]
[]
[]
[]
[null,null,null,null,null,null,null,null,null,"Cumulative",null,"Cumulative"]
["Month/Year","ND Actual","ND Normal","Legacy Actual","Legacy Normal",null,null,"Prod Actual","Prod Normal","ND Actual","ND Normal",{"$f":"D7","v":"Legacy Actual"},{"$f":"E7","v":"Legacy Normal"}]
[{"$f":"'Ex 1 HDD'!A8","v":"2022-06-01"},{"$f":"SUM('Company Nom Groups'!S91:S93,'Company Nom Groups'!S106:S108)","v":0},{"$f":"'Company Nom Groups'!B140","v":0},{"$f":"H8-B8","v":4510.2119999999995},{"$f":"I8-C8","v":4454.9400000000005},null,null,{"$f":"'Ex 7 Co. Owned Gas'!B8","v":4510.2119999999995},{"$f":"'Ex 7 Co. Owned Gas'!C8","v":4454.9400000000005},{"$f":"B8","v":0},{"$f":"C8","v":0},{"$f":"D8","v":4510.2119999999995},{"$f":"E8","v":4454.9400000000005}]
{"$rows_left_out":12}
{"sheet":"Exhibit 8.1","index":34,"n_rows":32,"n_cols":17,"rows_kept":32,"cut":false,"hidden":false,"merged":[]}
[]
[]
[]
[]
[]
[]
[]
[]
{"$rows_left_out":25}
{"sheet":"Exhibit 8.2","index":35,"n_rows":32,"n_cols":17,"rows_kept":32,"cut":false,"hidden":false,"merged":[]}
[]
[]
[]
[]
[]
[]
[]
[]
{"$rows_left_out":25}
{"sheet":"Exhibit 8.3","index":36,"n_rows":32,"n_cols":17,"rows_kept":32,"cut":false,"hidden":false,"merged":[]}
[]
[]
[]
[]
[]
[]
[]
[]
{"$rows_left_out":25}
{"sheet":"Company Nom Groups","index":37,"n_rows":825,"n_cols":50,"rows_kept":825,"cut":false,"hidden":true,"merged":[[1,35,1,37],[1,39,1,41],[1,43,1,45],[1,47,1,49],[2,35,2,37],[2,39,2,41],[2,43,2,45],[2,47,2,49],[1,29,1,31],[2,29,2,31],[1,17,1,19],[2,17,2,19],[1,25,1,27],[2,25,2,27],[1,21,1,23],[2,21,2,23]]}
["Company Nom Groups"]
["Withdrawn Gross Volume (MDths)",null,null,null,null,null,null,null,null,null,null,null,null,null,null,null,null,"June 2022 Cost-of-Service",null,null,null,"July 2022 Cost-of-Service",null,null,null,"August 2022 Cost-of-Service",null,null,null,"First Quarter Cost-of-Service",null,null,null,null,null,"September 2022 Cost-of-Service",null,null,null,"October 2022 Cost-of-Service",null,null,null,"November 2022 Cost-of-Service",null,null,null,"Second Quarter Cost-of-Service"]
["Source: IRP Base Case, Monthly Custom Report Writer",null,null,null,null,null,null,null,null,null,null,null,null,null,null,null,null,"Variance   Mdth",null,null,null,"Variance   Mdth",null,null,null,"Variance   Mdth",null,null,null,"Variance   Mdth",null,null,null,null,null,"Variance   Mdth",null,null,null,"Variance   Mdth",null,null,null,"Variance   Mdth",null,null,null,"Variance   Mdth"]
[]
["Nom Group","2022-06-01","2022-07-01","2022-08-01","2022-09-01","2022-10-01","2022-11-01","2022-12-01","2023-01-01","2023-02-01","2023-03-01","2023-04-01","2023-05-01","Total",null,null,null,"Nom Group","Actual ","Normal",null,"Nom Group","Actual ","Normal",null,"Nom Group","Actual ","Normal",null,"Nom Group","Actual ","Normal",null,null,null,"Nom Group","Actual ","Normal",null,"Nom Group","Actual ","Normal",null,"Nom Group","Actual ","Normal",null,"Nom Group","Actual ","Normal"]
["BIRCH CREEK",116.29600000000001,119.407,118.65,114.098,117.16200000000001,112.676,115.709,114.994,103.226,113.586,109.251,112.20699999999999,1367.2619999999999,null,null,null,"BIRCH CREEK",{"$f":"VLOOKUP(R6,R$130:S$234,2,FALSE)/1000","v":113.765},{"$f":"B6","v":116.29600000000001},null,"BIRCH CREEK",{"$f":"VLOOKUP(V6,V$130:W$234,2,FALSE)/1000","v":107.093},{"$f":"C6","v":119.407},null,"BIRCH CREEK",{"$f":"VLOOKUP(Z6,Z$130:AA$234,2,FALSE)/1000","v":125.041},{"$f":"D6","v":118.65},null,"BIRCH CREEK",{"$f":"VLOOKUP(AD6,AD$130:AE$234,2,FALSE)/1000","v":345.899},{"$f":"T6+X6+AB6","v":354.35300000000001},null,null,null,"BIRCH CREEK",{"$f":"VLOOKUP(AJ6,AJ$130:AK$237,2,FALSE)/1000","v":119.926},{"$f":"E6","v":114.098},null,"BIRCH CREEK",{"$f":"VLOOKUP(AN6,AN$130:AO$237,2,FALSE)/1000","v":123.46},{"$f":"F6","v":117.16200000000001},null,"BIRCH CREEK",{"$f":"VLOOKUP(AR6,AR$130:AS$237,2,FALSE)/1000","v":116.15600000000001},{"$f":"G6","v":112.676},null,"BIRCH CREEK",{"$f":"VLOOKUP(AV6,AV$130:AW$237,2,FALSE)/1000","v":359.54199999999997},{"$f":"AL6+AP6+AT6","v":343.93599999999998}]
["ACEJDMT D24",7.4119999999999999,7.5960000000000001,7.5339999999999998,7.2309999999999999,7.4109999999999996,7.1130000000000004,7.29,7.2309999999999999,6.4779999999999998,7.1130000000000004,6.827,6.9969999999999999,86.233999999999995,null,null,null,"ACEJDMT D24",8.157,{"$f":"B7","v":7.4119999999999999},null,"ACEJDMT D24",8.5350000000000001,{"$f":"C7","v":7.5960000000000001},null,"ACEJDMT D24",7.7759999999999998,{"$f":"D7","v":7.5339999999999998},null,"ACEJDMT D24",24.468,{"$f":"T7+X7+AB7","v":22.541999999999998},null,null,null,"ACEJDMT D24",5.5860000000000003,{"$f":"E7","v":7.2309999999999999},null,"ACEJDMT D24",4.92,{"$f":"F7","v":7.4109999999999996},null,"ACEJDMT D24",7.7949999999999999,{"$f":"G7","v":7.1130000000000004},null,"ACEJDMT D24",18.300999999999998,{"$f":"AL7+AP7+AT7","v":21.754999999999999}]
["BRFM D24",1.9039999999999999,1.956,1.944,1.87,1.92,1.847,1.897,1.8859999999999999,1.6930000000000001,1.863,1.792,1.841,22.413,null,null,null,"BRFM D24",2.0369999999999999,1.9039999999999999,null,"BRFM D24",2.008,1.956,null,"BRFM D24",2.0790000000000002,1.944,null,"BRFM D24",6.1239999999999997,5.8040000000000003,null,null,null,"BRFM D24",1.8839999999999999,1.87,null,"BRFM D24",2.0760000000000001,1.92,null,"BRFM D24",1.9910000000000001,1.847,null,"BRFM D24",5.9509999999999996,5.6370000000000005]
{"$rows_left_out":818}
{"sheet":"Normal Purchase %","index":38,"n_rows":34,"n_cols":17,"rows_kept":34,"cut":false,"hidden":true,"merged":[[1,0,1,8]]}
[]
["Source:  The whole numbers come from Purchase Gas and Company Owned Gas sheets.  The percentages are then calculated from those numbers."]
[null,2,3,4,5,6,7,8,9]
["Month","Actual Purchase Mdth","Normal Purchase Mdth","Actual Company Mdth","Normal Company Mdths","Actual Purchase as Percent of Total","Normal Purchase as Percent of Total","Actual Cost-of-Service as Percent of Total","Normal Cost-of-Service as Percent of Total",null,"Check Should = 100%","Check Should = 100%"]
[{"$f":"'Ex 1 HDD'!A8","v":"2022-06-01"},{"$f":"'Ex 4 Purchase Gas'!B8","v":483.77},{"$f":"'Ex 4 Purchase Gas'!C8","v":619.59299999999996},{"$f":"'Ex 7 Co. Owned Gas'!B8","v":4510.2119999999995},{"$f":"'Ex 7 Co. Owned Gas'!C8","v":4454.9400000000005},{"$f":"IFERROR(B5/(B5+D5),0)","v":9.6870593446271927E-2},{"$f":"C5/(C5+E5)","v":0.12209852611067855},{"$f":"IFERROR(D5/(D5+B5),0)","v":0.90312940655372798},{"$f":"E5/(E5+C5)","v":0.87790147388932149},null,{"$f":"F5+H5","v":0.99999999999999989},{"$f":"G5+I5","v":1},null,null,null,null,{"$f":"SUM(B5:B7)","v":1012.798}]
[{"$f":"'Ex 1 HDD'!A9","v":"2022-07-01"},{"$f":"'Ex 4 Purchase Gas'!B9","v":252.06100000000001},{"$f":"'Ex 4 Purchase Gas'!C9","v":0},{"$f":"'Ex 7 Co. Owned Gas'!B9","v":4737.1949999999988},{"$f":"'Ex 7 Co. Owned Gas'!C9","v":4482.0400000000009},{"$f":"IFERROR(B6/(B6+D6),0)","v":5.0520759006954158E-2},0,{"$f":"IFERROR(D6/(D6+B6),0)","v":0.94947924099304593},1,null,1,1,null,null,null,null,{"$f":"SUM(D5:D7)","v":13653.637999999999}]
[{"$f":"'Ex 1 HDD'!A10","v":"2022-08-01"},{"$f":"'Ex 4 Purchase Gas'!B10","v":276.96699999999998},{"$f":"'Ex 4 Purchase Gas'!C10","v":0},{"$f":"'Ex 7 Co. Owned Gas'!B10","v":4406.2309999999998},{"$f":"'Ex 7 Co. Owned Gas'!C10","v":4411.1949999999997},5.9140570183024509E-2,0,0.94085942981697557,1,null,1,1,null,null,null,null,{"$f":"Q5+Q6","v":14666.436}]
[{"$f":"'Ex 1 HDD'!A11","v":"2022-09-01"},{"$f":"'Ex 4 Purchase Gas'!B11","v":1317.673},{"$f":"'Ex 4 Purchase Gas'!C11","v":1212.3869999999999},{"$f":"'Ex 7 Co. Owned Gas'!B11","v":4399.6039999999994},{"$f":"'Ex 7 Co. Owned Gas'!C11","v":4056.7949999999996},0.23047212860247984,0.23009017338934201,0.76952787139752021,0.76990982661065788,null,1,0.99999999999999989,null,null,null,null,{"$f":"Q5/Q7","v":6.9055495145514567E-2}]
{"$rows_left_out":27}
{"sheet":"IRP Pruch Cover Sheet","index":39,"n_rows":15,"n_cols":6,"rows_kept":15,"cut":false,"hidden":true,"merged":[]}
[null,null,2,3,4,5]
[null,null,{"$f":"'Normal Purchase %'!F24","v":"Actual Purchase as Percent of Total"},{"$f":"'Normal Purchase %'!G24","v":"Normal Purchase as Percent of Total"},{"$f":"'Normal Purchase %'!H24","v":"Actual Cost-of-Service as Percent of Total"},{"$f":"'Normal Purchase %'!I24","v":"Normal Cost-of-Service as Percent of Total"}]
[]
[null,{"$f":"'Normal Purchase %'!E25","v":"2022-09-01"},{"$f":"VLOOKUP($B4,'Normal Purchase %'!$E$25:$I$27,'IRP Pruch Cover Sheet'!C$1,FALSE)","v":0.23047212860247984},{"$f":"VLOOKUP($B4,'Normal Purchase %'!$E$25:$I$27,'IRP Pruch Cover Sheet'!D$1,FALSE)","v":0.23009017338934201},{"$f":"VLOOKUP($B4,'Normal Purchase %'!$E$25:$I$27,'IRP Pruch Cover Sheet'!E$1,FALSE)","v":0.76952787139752021},{"$f":"VLOOKUP($B4,'Normal Purchase %'!$E$25:$I$27,'IRP Pruch Cover Sheet'!F$1,FALSE)","v":0.76990982661065788}]
[null,{"$f":"'Normal Purchase %'!E26","v":"2022-10-01"},{"$f":"VLOOKUP($B5,'Normal Purchase %'!$E$25:$I$27,'IRP Pruch Cover Sheet'!C$1,FALSE)","v":0.50775124529315951},{"$f":"VLOOKUP($B5,'Normal Purchase %'!$E$25:$I$27,'IRP Pruch Cover Sheet'!D$1,FALSE)","v":0.56602795074429302},{"$f":"VLOOKUP($B5,'Normal Purchase %'!$E$25:$I$27,'IRP Pruch Cover Sheet'!E$1,FALSE)","v":0.49224875470684054},{"$f":"VLOOKUP($B5,'Normal Purchase %'!$E$25:$I$27,'IRP Pruch Cover Sheet'!F$1,FALSE)","v":0.43397204925570709}]
[null,{"$f":"'Normal Purchase %'!E27","v":"2022-11-01"},{"$f":"VLOOKUP($B6,'Normal Purchase %'!$E$25:$I$27,'IRP Pruch Cover Sheet'!C$1,FALSE)","v":0.71702474805761796},{"$f":"VLOOKUP($B6,'Normal Purchase %'!$E$25:$I$27,'IRP Pruch Cover Sheet'!D$1,FALSE)","v":0.60585673173288224},{"$f":"VLOOKUP($B6,'Normal Purchase %'!$E$25:$I$27,'IRP Pruch Cover Sheet'!E$1,FALSE)","v":0.28297525194238216},{"$f":"VLOOKUP($B6,'Normal Purchase %'!$E$25:$I$27,'IRP Pruch Cover Sheet'!F$1,FALSE)","v":0.39414326826711771}]
[]
[null,"Q2",{"$f":"VLOOKUP($B$8,'Normal Purchase %'!$E$29:$I$32,'IRP Pruch Cover Sheet'!C$1,FALSE)","v":0.56922574330457953},{"$f":"VLOOKUP($B$8,'Normal Purchase %'!$E$29:$I$32,'IRP Pruch Cover Sheet'!D$1,FALSE)","v":0.52273567009129429},{"$f":"VLOOKUP($B$8,'Normal Purchase %'!$E$29:$I$32,'IRP Pruch Cover Sheet'!E$1,FALSE)","v":0.43077425669542052},{"$f":"VLOOKUP($B$8,'Normal Purchase %'!$E$29:$I$32,'IRP Pruch Cover Sheet'!F$1,FALSE)","v":0.47726432990870576}]
{"$rows_left_out":8}
{"sheet":"Shut-In","index":40,"n_rows":75,"n_cols":12,"rows_kept":75,"cut":false,"hidden":true,"merged":[[0,1,0,2],[1,1,1,2]]}
[null,"Actual Data from Jennifer Beasley"]
[null,"Estimates…See Company Nom Groups herein"]
[]
[null,null,"June","July ","August ","Total Dth for Quarter",null,null,"September","October","November","Total Dth for Quarter"]
[null,"Estimated Shut-in (dth/day)",{"$f":"'Company Nom Groups'!B138","v":158.63048220859733},{"$f":"'Company Nom Groups'!C138","v":157.62857711125699},{"$f":"'Company Nom Groups'!D138","v":156.76880095701739},{"$f":"C5*30+D5*31+E5*31","v":14505.233186374426},null,"Estimated Shut-in (dth/day)",{"$f":"'Company Nom Groups'!E138","v":155.72133982417049},{"$f":"'Company Nom Groups'!F138","v":154.92520935549692},{"$f":"'Company Nom Groups'!G138","v":153.98672293807371},{"$f":"I5*30+J5*31+K5*30","v":14093.92337288773}]
[null,"Actual Shut-in  (dth/day)",0,0,0,{"$f":"C6*30+D6*31+E6*31","v":0},null,"Acutal Shut-in  (dth/day)",{"$f":"I75/30","v":0},{"$f":"J75/31","v":0},0,{"$f":"I6*30+J6*31+K6*30","v":0}]
[]
[]
{"$rows_left_out":68}
{"sheet":"Deleted Exhibit 2.5","index":41,"n_rows":32,"n_cols":17,"rows_kept":32,"cut":false,"hidden":true,"merged":[]}
[]
[]
[]
[]
[]
[]
[]
[]
{"$rows_left_out":25}
{"sheet":"Deleted Exhibit 2.6","index":42,"n_rows":32,"n_cols":17,"rows_kept":32,"cut":false,"hidden":true,"merged":[]}
[]
[]
[]
[]
[]
[]
[]
[]
{"$rows_left_out":24}