{"text_format":"1","workbook":"xlsx","n_sheets":43,"sheets":["Ex 1 HDD","Exhibit 1.1","Exhibit 1.2","Exhibit 1.3","Ex 2 Clay Basin","Ex 2 Aquifers","Ex 2 Spire","Exhibit 2.1","Exhibit 2.2","Exhibit 2.3","Exhibit 2.4 ","Exhibit 2.5 ","Exhibit 2.6 ","Exhibit Firm Sales Volume","Exhibit 3.1","Exhibit 3.2","Exhibit 3.3","Exhibit 3.4","Ex 4 Purchase Gas","Exhibit 4.1","Exhibit 4.2","Exhibit 4.3","Ex 5 Purchase Gas Cost","Exhibit 5.1","Exhibit 5.2","Exhibit 5.3","Ex 6 Purch Gas Unit Cost","Exhibit 6.1","Exhibit 6.2","Ex 7 Co. Owned Gas","Exhibit 7.1","Exhibit 7.2","Exhibit 7.3","Ex 8 New Drill","Exhibit 8.1","Exhibit 8.2","Exhibit 8.3","Company Nom Groups","IRP Pruch Cover Sheet","Normal Purchase %","Shut-In","Deleted Exhibit 2.5","Deleted Exhibit 2.6"],"not_rendered":{"charts":28,"images":0,"macros":1,"external_links":0,"defined_names":1378,"comments":1,"pivot_tables":0},"unopened":[],"bounds":{"document_bytes":16777216,"sheet_cells":100000,"rows_first":2000,"rows_last":500,"rows_between":2000,"halvings":0,"cell_chars":16384,"cell_head_chars":4096},"cells_cut":0,"cells_raw":0,"read":"whole","date_system":"1900"}

{"sheet":"Ex 1 HDD","index":0,"n_rows":20,"n_cols":9,"rows_kept":20,"cut":false,"hidden":false,"merged":[[0,0,0,5],[1,0,1,5],[1,8,1,9],[26,0,26,6],[4,0,4,6]]}
["Heating Degree Days",null,null,null,null,null,"Docket",null,"Enbridge Gas Utah"]
[null,null,null,null,null,null,null,null,"Docket No. 25-057-02"]
[null,null,null,null,null,null,null,null,"EGU Variance Exhibit"]
[]
[]
[]
["Month/Year","Actual","Normal",null,null,"Actual","Normal"]
["2025-06-01",12,37.520000000000003,{"$f":"B8-C8","v":-25.520000000000003},null,{"$f":"B8","v":12},{"$f":"C8","v":37.520000000000003}]
{"$rows_left_out":13}
{"sheet":"Exhibit 1.1","index":1,"n_rows":32,"n_cols":17,"rows_kept":32,"cut":false,"hidden":false,"merged":[]}
[]
[]
[]
[]
[]
[]
[]
[]
{"$rows_left_out":25}
{"sheet":"Exhibit 1.2","index":2,"n_rows":32,"n_cols":17,"rows_kept":32,"cut":false,"hidden":false,"merged":[]}
[]
[]
[]
[]
[]
[]
[]
[]
{"$rows_left_out":25}
{"sheet":"Exhibit 1.3","index":3,"n_rows":32,"n_cols":17,"rows_kept":32,"cut":false,"hidden":false,"merged":[]}
[]
[]
[]
[]
[]
[]
[]
[]
{"$rows_left_out":25}
{"sheet":"Ex 2 Clay Basin","index":4,"n_rows":19,"n_cols":9,"rows_kept":19,"cut":false,"hidden":false,"merged":[[5,7,5,8],[3,0,3,8],[0,0,0,8],[4,0,4,8],[1,0,1,4],[2,0,2,5]]}
["Clay Basin Ending Inventory (MDths)"]
[]
[]
[]
[]
[null,null,null,null,null,null,null,"Cumulative "]
["Month/Year","Actual","Normal",null,"Actual","Actual/1000",null,"Actual","Normal"]
["2025-06-01",{"$f":"F8","v":8361.3790000000008},8612.3420000000006,{"$f":"B8-C8","v":-250.96299999999974},8361379,{"$f":"E8/1000","v":8361.3790000000008},null,{"$f":"F8","v":8361.3790000000008},{"$f":"C8","v":8612.3420000000006}]
{"$rows_left_out":12}
{"sheet":"Ex 2 Aquifers","index":5,"n_rows":20,"n_cols":17,"rows_kept":20,"cut":false,"hidden":false,"merged":[[2,0,2,14],[1,0,1,14],[3,0,3,9],[4,12,4,16],[5,4,5,5]]}
["Total Aquifer Storage Ending Inventory (MDths)"]
[]
[]
[]
[null,null,null,null,null,null,null,null,null,null,null,null,"IRP - Normal "]
[null,null,null,null,"Cumulative ",null,null,1.0549999999999999,null,null,null,null,"Month/Year","Month","Inj","With","Total"]
["Month/Year","Actual","Normal",null,"Actual","IRP",null,"MCF","DTH","MDTH",null,null,null,null,null,null,868.59]
[{"$f":"'Ex 1 HDD'!$A$8","v":"2025-06-01"},{"$f":"J8","v":844.96799999999996},{"$f":"Q8","v":868.59},{"$f":"B8-C8","v":-23.622000000000071},{"$f":"B8","v":844.96799999999996},{"$f":"C8","v":868.59},null,{"$f":"I8/$H$6","v":800917.53554502374},844968,{"$f":"I8/1000","v":844.96799999999996},null,null,{"$f":"A8","v":"2025-06-01"},{"$f":"Q7","v":868.59},0,0,{"$f":"N8+O8-P8","v":868.59}]
{"$rows_left_out":13}
{"sheet":"Ex 2 Spire","index":6,"n_rows":20,"n_cols":17,"rows_kept":20,"cut":false,"hidden":false,"merged":[[1,0,1,14],[2,0,2,14],[3,0,3,9],[4,12,4,16],[5,4,5,5]]}
["Total Spire Storage Ending Inventory (MDths)"]
[]
[]
[]
[null,null,null,null,null,null,null,null,null,null,null,null,"IRP - Normal "]
[null,null,null,null,"Cumulative ",null,null,1.0549999999999999,null,null,null,null,"Month/Year","Month","Inj","With","Total"]
["Month/Year","Actual","Normal",null,"Actual","IRP",null,"MCF","DTH","MDTH",null,null,null,null,null,null,1076]
[{"$f":"'Ex 1 HDD'!$A$8","v":"2025-06-01"},{"$f":"J8","v":1226.6600000000001},{"$f":"Q8","v":1193},{"$f":"B8-C8","v":33.660000000000082},{"$f":"B8","v":1226.6600000000001},{"$f":"C8","v":1193},null,{"$f":"I8/$H$6","v":1162710.9004739337},1226660,{"$f":"I8/1000","v":1226.6600000000001},null,null,{"$f":"A8","v":"2025-06-01"},{"$f":"Q7","v":1076},117,0,{"$f":"N8+O8-P8","v":1193}]
{"$rows_left_out":13}
{"sheet":"Exhibit 2.1","index":7,"n_rows":32,"n_cols":17,"rows_kept":32,"cut":false,"hidden":false,"merged":[]}
[]
[]
[]
[]
[]
[]
[]
[]
{"$rows_left_out":25}
{"sheet":"Exhibit 2.2","index":8,"n_rows":32,"n_cols":17,"rows_kept":32,"cut":false,"hidden":false,"merged":[]}
[]
[]
[]
[]
[]
[]
[]
[]
{"$rows_left_out":25}
{"sheet":"Exhibit 2.3","index":9,"n_rows":32,"n_cols":17,"rows_kept":32,"cut":false,"hidden":false,"merged":[]}
[]
[]
[]
[]
[]
[]
[]
[]
{"$rows_left_out":25}
{"sheet":"Exhibit 2.4 ","index":10,"n_rows":32,"n_cols":17,"rows_kept":32,"cut":false,"hidden":false,"merged":[]}
[]
[]
[]
[]
[]
[]
[]
[]
{"$rows_left_out":25}
{"sheet":"Exhibit 2.5 ","index":11,"n_rows":32,"n_cols":17,"rows_kept":32,"cut":false,"hidden":false,"merged":[]}
[]
[]
[]
[]
[]
[]
[]
[]
{"$rows_left_out":25}
{"sheet":"Exhibit 2.6 ","index":12,"n_rows":32,"n_cols":17,"rows_kept":32,"cut":false,"hidden":false,"merged":[]}
[]
[]
[]
[]
[]
[]
[]
[]
{"$rows_left_out":25}
{"sheet":"Exhibit Firm Sales Volume","index":13,"n_rows":20,"n_cols":8,"rows_kept":20,"cut":false,"hidden":false,"merged":[[1,0,1,9],[5,6,5,8]]}
["Demand"]
[]
[]
[]
[]
[null,null,null,null,null,null,"Cumulative"]
[{"$f":"'Ex 1 HDD'!A7","v":"Month/Year"},"Actual","IRP Normal","Days","Daily Demand",null,"Actual","IRP Normal"]
["2025-06-01",3138.4367909999996,3441.069,{"$f":"DAY(EOMONTH(A8,0))","v":30},{"$f":"C8/D8","v":114.70229999999999},null,{"$f":"B8","v":3138.4367909999996},{"$f":"C8","v":3441.069}]
{"$rows_left_out":13}
{"sheet":"Exhibit 3.1","index":14,"n_rows":32,"n_cols":17,"rows_kept":32,"cut":false,"hidden":false,"merged":[]}
[]
[]
[]
[]
[]
[]
[]
[]
{"$rows_left_out":25}
{"sheet":"Exhibit 3.2","index":15,"n_rows":32,"n_cols":17,"rows_kept":32,"cut":false,"hidden":false,"merged":[]}
[]
[]
[]
[]
[]
[]
[]
[]
{"$rows_left_out":25}
{"sheet":"Exhibit 3.3","index":16,"n_rows":32,"n_cols":17,"rows_kept":32,"cut":false,"hidden":false,"merged":[]}
[]
[]
[]
[]
[]
[]
[]
[]
{"$rows_left_out":25}
{"sheet":"Exhibit 3.4","index":17,"n_rows":60,"n_cols":8,"rows_kept":60,"cut":false,"hidden":false,"merged":[[8,2,8,3],[8,4,8,5],[8,6,8,7]]}
[null,null,null,null,null,null,null,"Enbridge Gas Utah"]
[null,null,null,null,null,null,null,"Docket No. 25-057-02"]
[null,null,null,null,null,null,null,"EGU Variance Exhibit 3.4"]
[]
[]
[null,"IRP Variance"]
[]
[null,"Actual Results "]
{"$rows_left_out":53}
{"sheet":"Ex 4 Purchase Gas","index":18,"n_rows":21,"n_cols":13,"rows_kept":21,"cut":false,"hidden":false,"merged":[[5,6,5,7]]}
["Purchase Gas Variance (Brady Included) MDths"]
[]
[]
[]
[]
[null,null,null,null,null,null,"Cumulative"]
["Month/Year","Actual","IRP Normal",null,"Month/Year","Actual","IRP Normal",null,"Month/Year","DTHS","MDTHS","$'S","$1,000'S"]
[{"$f":"'Ex 1 HDD'!A8","v":"2025-06-01"},{"$f":"K8","v":1310.3720000000001},158.69,null,{"$f":"A8","v":"2025-06-01"},{"$f":"K8","v":1310.3720000000001},{"$f":"C8","v":158.69},null,{"$f":"A8","v":"2025-06-01"},1310372,{"$f":"J8/1000","v":1310.3720000000001},3334348.5,{"$f":"L8/1000","v":3334.3485000000001}]
{"$rows_left_out":14}
{"sheet":"Exhibit 4.1","index":19,"n_rows":32,"n_cols":17,"rows_kept":32,"cut":false,"hidden":false,"merged":[]}
[]
[]
[]
[]
[]
[]
[]
[]
{"$rows_left_out":25}
{"sheet":"Exhibit 4.2","index":20,"n_rows":31,"n_cols":17,"rows_kept":31,"cut":false,"hidden":false,"merged":[]}
[]
[]
[]
[]
[]
[]
[]
[]
{"$rows_left_out":24}
{"sheet":"Exhibit 4.3","index":21,"n_rows":32,"n_cols":17,"rows_kept":32,"cut":false,"hidden":false,"merged":[]}
[]
[]
[]
[]
[]
[]
[]
[]
{"$rows_left_out":25}
{"sheet":"Ex 5 Purchase Gas Cost","index":22,"n_rows":21,"n_cols":6,"rows_kept":21,"cut":false,"hidden":false,"merged":[[1,0,1,6],[0,0,0,6],[2,0,2,7],[5,4,5,5]]}
["Purchase Gas Cost Variance ($1,000's)"]
[]
[]
[]
[]
[null,null,null,null,"Cumulative"]
["Month/Year","Actual","Normal",null,"Actual","Normal"]
[{"$f":"'Ex 1 HDD'!A8","v":"2025-06-01"},{"$f":"'Ex 4 Purchase Gas'!M8","v":3334.3485000000001},{"$f":"'Ex 4 Purchase Gas'!C8*'Ex 6 Purch Gas Unit Cost'!C8","v":409.32815979999998},null,{"$f":"B8","v":3334.3485000000001},{"$f":"C8","v":409.32815979999998}]
{"$rows_left_out":14}
{"sheet":"Exhibit 5.1","index":23,"n_rows":32,"n_cols":17,"rows_kept":32,"cut":false,"hidden":false,"merged":[]}
[]
[]
[]
[]
[]
[]
[]
[]
{"$rows_left_out":25}
{"sheet":"Exhibit 5.2","index":24,"n_rows":32,"n_cols":17,"rows_kept":32,"cut":false,"hidden":false,"merged":[]}
[]
[]
[]
[]
[]
[]
[]
[]
{"$rows_left_out":25}
{"sheet":"Exhibit 5.3","index":25,"n_rows":32,"n_cols":17,"rows_kept":32,"cut":false,"hidden":false,"merged":[]}
[]
[]
[]
[]
[]
[]
[]
[]
{"$rows_left_out":25}
{"sheet":"Ex 6 Purch Gas Unit Cost","index":26,"n_rows":47,"n_cols":13,"rows_kept":47,"cut":false,"hidden":false,"merged":[[0,0,0,5],[1,0,1,7],[2,0,2,7],[46,2,46,13]]}
["Purchase Gas Unit Cost Variance ($1,000's)"]
[]
[]
[]
[]
[null,null,null,null,"Actual","Actual","Actual",null,"Normal","Normal","Normal"]
["Month/Year","Actual $/Dth","Normal $/Dth",null,"Dth","Cost","$/Dth",null,"Dth","Cost","$/Dth",null,"May Forward Strip"]
[{"$f":"'Ex 1 HDD'!A8","v":"2025-06-01"},{"$f":"G8","v":2.544581614991773},2.5794199999999998,null,{"$f":"'Ex 4 Purchase Gas'!B8","v":1310.3720000000001},{"$f":"'Ex 4 Purchase Gas'!M8","v":3334.3485000000001},{"$f":"IFERROR(F8/E8,0)","v":2.544581614991773},null,{"$f":"'Ex 4 Purchase Gas'!C8","v":158.69},{"$f":"'Ex 5 Purchase Gas Cost'!C8","v":409.32815979999998},{"$f":"IFERROR(J8/I8,0)","v":2.5794199999999998},null,5.7]
{"$rows_left_out":40}
{"sheet":"Exhibit 6.1","index":27,"n_rows":32,"n_cols":17,"rows_kept":32,"cut":false,"hidden":false,"merged":[]}
[]
[]
[]
[]
[]
[]
[]
[]
{"$rows_left_out":25}
{"sheet":"Exhibit 6.2","index":28,"n_rows":32,"n_cols":17,"rows_kept":32,"cut":false,"hidden":false,"merged":[]}
[]
[]
[]
[]
[]
[]
[]
[]
{"$rows_left_out":25}
{"sheet":"Ex 7 Co. Owned Gas","index":29,"n_rows":21,"n_cols":17,"rows_kept":21,"cut":false,"hidden":false,"merged":[[0,0,0,7],[2,14,2,19],[1,0,1,7],[2,0,2,10]]}
["Cost-of-Service Gas Variance (MDths)"]
[]
[]
[]
[]
[null,null,null,null,null,null,null,"Cumulative"]
["Month/Year","Actual","Normal","Full Production","Shut-in Est. Month","Shut-in Daily",null,"Actual","Normal",null,"Days in Mo.","Dthms","Dthms/Day"]
[{"$f":"'Ex 1 HDD'!A8","v":"2025-06-01"},{"$f":"'Company Nom Groups'!R116","v":3973.6358260000002},{"$f":"'Company Nom Groups'!B106","v":4667.0128491868809},{"$f":"'Company Nom Groups'!B112","v":4689.3},{"$f":"D8-C8","v":22.287150813119297},{"$f":"(E8/30)*1000","v":742.90502710397652},null,{"$f":"B8","v":3973.6358260000002},{"$f":"C8","v":4667.0128491868809},null,{"$f":"DAY(EOMONTH(A8,0))","v":30},{"$f":"C8","v":4667.0128491868809},{"$f":"L8/K8","v":155.56709497289603},null,null,null,5754.4783839995334]
{"$rows_left_out":14}
{"sheet":"Exhibit 7.1","index":30,"n_rows":33,"n_cols":17,"rows_kept":33,"cut":false,"hidden":false,"merged":[]}
[]
[]
[]
[]
[]
[]
[]
[]
{"$rows_left_out":26}
{"sheet":"Exhibit 7.2","index":31,"n_rows":32,"n_cols":17,"rows_kept":32,"cut":false,"hidden":false,"merged":[]}
[]
[]
[]
[]
[]
[]
[]
[]
{"$rows_left_out":25}
{"sheet":"Exhibit 7.3","index":32,"n_rows":32,"n_cols":17,"rows_kept":32,"cut":false,"hidden":false,"merged":[]}
[]
[]
[]
[]
[]
[]
[]
[]
{"$rows_left_out":25}
{"sheet":"Ex 8 New Drill","index":33,"n_rows":19,"n_cols":13,"rows_kept":19,"cut":false,"hidden":false,"merged":[[0,0,0,9],[1,0,1,9],[2,0,2,9]]}
["Isolated New Drill Component (MDths)"]
[]
[]
[]
[]
[null,null,null,null,null,null,null,null,null,"Cumulative",null,"Cumulative"]
["Month/Year","ND Actual","ND Normal","Legacy Actual","Legacy Normal",null,null,"Prod Actual","Prod Normal","ND Actual","ND Normal",{"$f":"D7","v":"Legacy Actual"},{"$f":"E7","v":"Legacy Normal"}]
[{"$f":"'Ex 1 HDD'!A8","v":"2025-06-01"},{"$f":"SUM('Company Nom Groups'!R77:R80,'Company Nom Groups'!R94:R98)","v":47.552644000000001},{"$f":"SUM('Company Nom Groups'!B72:B75,'Company Nom Groups'!B89:B92)","v":0},{"$f":"H8-B8","v":3926.0831820000003},{"$f":"I8-C8","v":4667.0128491868809},null,null,{"$f":"'Ex 7 Co. Owned Gas'!B8","v":3973.6358260000002},{"$f":"'Ex 7 Co. Owned Gas'!C8","v":4667.0128491868809},{"$f":"B8","v":47.552644000000001},{"$f":"C8","v":0},{"$f":"D8","v":3926.0831820000003},{"$f":"E8","v":4667.0128491868809}]
{"$rows_left_out":12}
{"sheet":"Exhibit 8.1","index":34,"n_rows":32,"n_cols":17,"rows_kept":32,"cut":false,"hidden":false,"merged":[]}
[]
[]
[]
[]
[]
[]
[]
[]
{"$rows_left_out":25}
{"sheet":"Exhibit 8.2","index":35,"n_rows":32,"n_cols":17,"rows_kept":32,"cut":false,"hidden":false,"merged":[]}
[]
[]
[]
[]
[]
[]
[]
[]
{"$rows_left_out":25}
{"sheet":"Exhibit 8.3","index":36,"n_rows":32,"n_cols":17,"rows_kept":32,"cut":false,"hidden":false,"merged":[]}
[]
[]
[]
[]
[]
[]
[]
[]
{"$rows_left_out":25}
{"sheet":"Company Nom Groups","index":37,"n_rows":802,"n_cols":31,"rows_kept":802,"cut":false,"hidden":true,"merged":[[1,16,1,18],[1,20,1,22],[1,28,1,30],[1,24,1,26]]}
["Company Nom Groups"]
["Withdrawn Gross Volume (MDths)",null,null,null,null,null,null,null,null,null,null,null,null,null,null,null,"Jun 2025 Cost-of-Service",null,null,null,"Jul 2025 Cost-of-Service",null,null,null,"Aug 2025 Cost-of-Service",null,null,null,"First  Quarter Cost-of-Service"]
["Source: IRP Base Case, Monthly Custom Report Writer",null,null,null,null,null,null,null,null,null,null,null,null,null,null,null,"Variance   Mdth",null,null,null,"Variance   Mdth",null,null,null,"Variance   Mdth",null,null,null,"Variance   Mdth"]
[]
["Nom Group","2024-06-01","2024-07-01","2024-08-01","2024-09-01","2024-10-01","2024-11-01","2024-12-01","2025-01-01","2025-02-01","2025-03-01","2025-04-01","2025-05-01","Total",null,null,"Nom Group","Actual ","Normal",null,"Nom Group","Actual ","Normal",null,"Nom Group","Actual ","Normal",null,"Nom Group","Actual ","Normal"]
["FLD-ACEJD D24",9.5405084757599994,9.7903346615999975,9.7225426737599925,9.3436917979199983,9.5883638311199952,9.2147409811200021,9.456036469679999,9.3905592045600006,8.4228625619999953,9.2609618217599952,8.9000970158399983,9.1331531411999993,111.76385263631998,null,null,{"$f":"A6","v":"FLD-ACEJD D24"},{"$f":"VLOOKUP(Q6,Q$124:R$205,2,FALSE)/1000","v":11.790841},{"$f":"B6","v":9.5405084757599994},null,{"$f":"A6","v":"FLD-ACEJD D24"},{"$f":"VLOOKUP(U6,U$124:V$205,2,FALSE)/1000","v":14.381558},{"$f":"C6","v":9.7903346615999975},null,{"$f":"A6","v":"FLD-ACEJD D24"},{"$f":"VLOOKUP(Y6,Y$124:Z$205,2,FALSE)/1000","v":11.436485000000001},{"$f":"D6","v":9.7225426737599925},null,{"$f":"A6","v":"FLD-ACEJD D24"},{"$f":"VLOOKUP(AC6,AC$124:AD$205,2,FALSE)/1000","v":37.608884000000003},{"$f":"S6+W6+AA6","v":29.053385811119991}]
["FLD-BRCH CRK D24",91.59247547447994,94.041265512720045,93.441123365520014,89.850087453599983,92.255015692560008,88.711270585920005,91.087441915439939,90.510473041199987,81.23253139199997,89.36991653904002,85.936912213200046,88.117177308240016,1076.14569049392,null,null,"FLD-BRCH CRK D24",65.554709000000031,91.59247547447994,null,"FLD-BRCH CRK D24",{"$f":"VLOOKUP(U7,U$124:V$205,2,FALSE)/1000","v":92.114927000000009},94.041265512720045,null,"FLD-BRCH CRK D24",{"$f":"VLOOKUP(Y7,Y$124:Z$205,2,FALSE)/1000","v":93.629537000000013},93.441123365520014,null,"FLD-BRCH CRK D24",{"$f":"VLOOKUP(AC7,AC$124:AD$205,2,FALSE)/1000","v":251.29917300000008},{"$f":"S7+W7+AA7","v":279.07486435272}]
["FLD-BRFM D24",2.0377345516799994,2.0930976086399991,2.0805978892800012,2.0014448169599985,2.0558222488800006,1.97761155312,2.0313415528799994,2.0192107569599993,1.8128745321600008,1.9951664049599991,1.9192636955999995,1.9714085404799988,23.995574151599996,null,null,"FLD-BRFM D24",1.3097849999999998,2.0377345516799994,null,"FLD-BRFM D24",2.0796859999999997,2.0930976086399991,null,"FLD-BRFM D24",1.9454130000000001,2.0805978892800012,null,"FLD-BRFM D24",5.3348839999999997,6.2114300496000006]
{"$rows_left_out":795}
{"sheet":"IRP Pruch Cover Sheet","index":38,"n_rows":17,"n_cols":15,"rows_kept":17,"cut":false,"hidden":true,"merged":[]}
[]
[null,null,2,3,4,5]
[]
[null,null,{"$f":"'Normal Purchase %'!F24","v":"Actual Purchase as Percent of Total"},{"$f":"'Normal Purchase %'!G24","v":"Normal Purchase as Percent of Total"},{"$f":"'Normal Purchase %'!H24","v":"Actual Cost-of-Service as Percent of Total"},{"$f":"'Normal Purchase %'!I24","v":"Normal Cost-of-Service as Percent of Total"},null,null,null,null,null,"June","July","August","Total Dth for Quarter"]
[null,null,null,null,null,null,null,null,null,null,"Estimated Shut-in (dth/day)",0,0,0,0]
[null,{"$f":"'Normal Purchase %'!E25","v":"2025-06-01"},{"$f":"VLOOKUP($B6,'Normal Purchase %'!$E$25:$I$27,'IRP Pruch Cover Sheet'!C$2,FALSE)","v":0.24798827767671064},{"$f":"VLOOKUP($B6,'Normal Purchase %'!$E$25:$I$27,'IRP Pruch Cover Sheet'!D$2,FALSE)","v":3.2884328969144651E-2},{"$f":"VLOOKUP($B6,'Normal Purchase %'!$E$25:$I$27,'IRP Pruch Cover Sheet'!E$2,FALSE)","v":0.75201172232328939},{"$f":"VLOOKUP($B6,'Normal Purchase %'!$E$25:$I$27,'IRP Pruch Cover Sheet'!F$2,FALSE)","v":0.96711567103085538},null,null,null,null,"Acutal Shut-in  (dth/day)",0,0,0,{"$f":"L6*30+M6*31+N6*30","v":0}]
[null,{"$f":"'Normal Purchase %'!E26","v":"2025-07-01"},{"$f":"VLOOKUP($B7,'Normal Purchase %'!$E$25:$I$27,'IRP Pruch Cover Sheet'!C$2,FALSE)","v":9.0667164387613436E-2},{"$f":"VLOOKUP($B7,'Normal Purchase %'!$E$25:$I$27,'IRP Pruch Cover Sheet'!D$2,FALSE)","v":2.9425485080309516E-3},{"$f":"VLOOKUP($B7,'Normal Purchase %'!$E$25:$I$27,'IRP Pruch Cover Sheet'!E$2,FALSE)","v":0.90933283561238654},{"$f":"VLOOKUP($B7,'Normal Purchase %'!$E$25:$I$27,'IRP Pruch Cover Sheet'!F$2,FALSE)","v":0.99705745149196912}]
[null,{"$f":"'Normal Purchase %'!E27","v":"2025-08-01"},{"$f":"VLOOKUP($B8,'Normal Purchase %'!$E$25:$I$27,'IRP Pruch Cover Sheet'!C$2,FALSE)","v":8.4921712944788924E-2},{"$f":"VLOOKUP($B8,'Normal Purchase %'!$E$25:$I$27,'IRP Pruch Cover Sheet'!D$2,FALSE)","v":2.9965567713098485E-3},{"$f":"VLOOKUP($B8,'Normal Purchase %'!$E$25:$I$27,'IRP Pruch Cover Sheet'!E$2,FALSE)","v":0.91507828705521121},{"$f":"VLOOKUP($B8,'Normal Purchase %'!$E$25:$I$27,'IRP Pruch Cover Sheet'!F$2,FALSE)","v":0.99700344322869028}]
{"$rows_left_out":10}
{"sheet":"Normal Purchase %","index":39,"n_rows":34,"n_cols":17,"rows_kept":34,"cut":false,"hidden":true,"merged":[[1,0,1,8]]}
[]
["Source:  The whole numbers come from Purchase Gas and Company Owned Gas sheets.  The percentages are then calculated from those numbers."]
[null,2,3,4,5,6,7,8,9]
["Month","Actual Purchase Mdth","Normal Purchase Mdth","Actual Company Mdth","Normal Company Mdths","Actual Purchase as Percent of Total","Normal Purchase as Percent of Total","Actual Cost-of-Service as Percent of Total","Normal Cost-of-Service as Percent of Total",null,"Check Should = 100%","Check Should = 100%"]
[{"$f":"'Ex 1 HDD'!A8","v":"2025-06-01"},{"$f":"'Ex 4 Purchase Gas'!B8","v":1310.3720000000001},{"$f":"'Ex 4 Purchase Gas'!C8","v":158.69},{"$f":"'Ex 7 Co. Owned Gas'!B8","v":3973.6358260000002},{"$f":"'Ex 7 Co. Owned Gas'!C8","v":4667.0128491868809},{"$f":"IFERROR(B5/(B5+D5),0)","v":0.24798827767671064},{"$f":"C5/(C5+E5)","v":3.2884328969144651E-2},{"$f":"IFERROR(D5/(D5+B5),0)","v":0.75201172232328939},{"$f":"E5/(E5+C5)","v":0.96711567103085538},null,{"$f":"F5+H5","v":1},{"$f":"G5+I5","v":1},null,null,null,null,{"$f":"SUM(B5:B7)","v":2158.0389999999998}]
[{"$f":"'Ex 1 HDD'!A9","v":"2025-07-01"},{"$f":"'Ex 4 Purchase Gas'!B9","v":433.13799999999998},{"$f":"'Ex 4 Purchase Gas'!C9","v":13.930999999999999},{"$f":"'Ex 7 Co. Owned Gas'!B9","v":4344.0931280000004},{"$f":"'Ex 7 Co. Owned Gas'!C9","v":4720.4004687859224},{"$f":"IFERROR(B6/(B6+D6),0)","v":9.0667164387613436E-2},2.9425485080309516E-3,{"$f":"IFERROR(D6/(D6+B6),0)","v":0.90933283561238654},0.99705745149196912,null,1,1,null,null,null,null,{"$f":"SUM(D5:D7)","v":12784.507521}]
[{"$f":"'Ex 1 HDD'!A10","v":"2025-08-01"},{"$f":"'Ex 4 Purchase Gas'!B10","v":414.529},{"$f":"'Ex 4 Purchase Gas'!C10","v":13.930999999999999},{"$f":"'Ex 7 Co. Owned Gas'!B10","v":4466.7785670000003},{"$f":"'Ex 7 Co. Owned Gas'!C10","v":4635.0715262930398},8.4921712944788924E-2,2.9965567713098485E-3,0.91507828705521121,0.99700344322869028,null,1.0000000000000002,1.0000000000000002,null,null,null,null,{"$f":"Q5+Q6","v":14942.546521}]
[{"$f":"'Ex 1 HDD'!A11","v":"2025-09-01"},{"$f":"'Ex 4 Purchase Gas'!B11","v":0},{"$f":"'Ex 4 Purchase Gas'!C11","v":14.978999999999999},{"$f":"'Ex 7 Co. Owned Gas'!B11","v":0},{"$f":"'Ex 7 Co. Owned Gas'!C11","v":4485.4510104151204},0,3.3283486167621419E-3,0,0.99667165138323777,null,0,0.99999999999999989,null,null,null,null,{"$f":"Q5/Q7","v":0.14442243810097086}]
{"$rows_left_out":27}
{"sheet":"Shut-In","index":40,"n_rows":38,"n_cols":24,"rows_kept":38,"cut":false,"hidden":true,"merged":[[0,1,0,2]]}
[null,"Estimates…See Company Nom Groups herein"]
[]
[null,null,"June","July ","August ","Total Dth for Quarter",null,null,"September","October","November","Total Dth for Quarter",null,null,"December","January","February","Total Dth for Quarter",null,null,"March","April","May","Total Dth for Quarter"]
["IRP","Estimated Shut-in (dth/day)",{"$f":"'Company Nom Groups'!B116","v":0},{"$f":"'Company Nom Groups'!C116","v":0},{"$f":"'Company Nom Groups'!D116","v":0},{"$f":"C4*30+D4*31+E4*31","v":0},null,"Estimated Shut-in (dth/day)",{"$f":"'Company Nom Groups'!E116","v":0},{"$f":"'Company Nom Groups'!F116","v":0},{"$f":"'Company Nom Groups'!G116","v":0},{"$f":"I4*30+J4*31+K4*30","v":0},null,"Estimated Shut-in (dth/day)",{"$f":"'Company Nom Groups'!H116","v":0},{"$f":"'Company Nom Groups'!I116","v":0},{"$f":"'Company Nom Groups'!J116","v":0},{"$f":"O4*31+P4*31+Q4*28","v":0},null,"Estimated Shut-in (dth/day)",{"$f":"'Company Nom Groups'!K116","v":0},{"$f":"'Company Nom Groups'!L116","v":0},{"$f":"'Company Nom Groups'!M116","v":0},{"$f":"U4*31+V4*31+W4*28","v":0}]
[null,"Actual Shut-in  (dth/day)",0,0,0,{"$f":"C5*30+D5*31+E5*31","v":0},null,"Acutal Shut-in  (dth/day)",{"$f":"I74/30","v":0},{"$f":"J74/31","v":0},0,{"$f":"I5*30+J5*31+K5*30","v":0},null,"Acutal Shut-in  (dth/day)",{"$f":"O74/30","v":0},{"$f":"P74/31","v":0},0,{"$f":"O5*30+P5*31+Q5*30","v":0},null,"Acutal Shut-in  (dth/day)",0,0,0,{"$f":"U5*30+V5*31+W5*30","v":0}]
[]
[]
[null,1,0,0,0,0,null,{"$f":"B8","v":1},null,null,null,0,null,{"$f":"H8","v":1},null,null,null,0,null,{"$f":"N8","v":1},null,null,null,0]
{"$rows_left_out":31}
{"sheet":"Deleted Exhibit 2.5","index":41,"n_rows":32,"n_cols":17,"rows_kept":32,"cut":false,"hidden":true,"merged":[]}
[]
[]
[]
[]
[]
[]
[]
[]
{"$rows_left_out":25}
{"sheet":"Deleted Exhibit 2.6","index":42,"n_rows":32,"n_cols":17,"rows_kept":32,"cut":false,"hidden":true,"merged":[]}
[]
[]
[]
[]
[]
[]
[]
[]
{"$rows_left_out":24}